x,z
0,0
0.0096,0.0368
0.0147,0.0655
0.0176,0.089
0.0195,0.1089
0.021,0.1266
0.0224,0.1426
0.0238,0.1573
0.0253,0.1711
0.0269,0.184
0.0287,0.1962
0.0307,0.2077
0.033,0.2187
0.0354,0.2291
0.0378,0.2391
0.0403,0.2488
0.0426,0.2581
0.0446,0.2671
0.0463,0.2759
0.0476,0.2845
0.0485,0.2929
0.0492,0.3011
0.0496,0.3092
0.05,0.3171
0.0505,0.3248
0.0512,0.3322
0.0523,0.3395
0.0539,0.3465
0.056,0.3533
0.0586,0.36
0.0616,0.3664
0.0649,0.3727
0.0683,0.3789
0.0718,0.385
0.075,0.3912
0.0779,0.3974
0.0803,0.4037
0.0822,0.4101
0.0834,0.4166
0.0841,0.4233
0.0842,0.4301
0.0839,0.437
0.0833,0.444
0.0826,0.451
0.0819,0.458
0.0814,0.4651
0.081,0.4721
0.081,0.479
0.0812,0.4859
0.0818,0.4927
0.0826,0.4995
0.0835,0.5062
0.0846,0.5129
0.0855,0.5195
0.0864,0.5262
0.0871,0.5328
0.0875,0.5395
0.0877,0.5462
0.0876,0.5528
0.0873,0.5595
0.0868,0.5662
0.0862,0.5728
0.0856,0.5795
0.085,0.5861
0.0845,0.5928
0.0842,0.5994
0.084,0.606
0.084,0.6127
0.0842,0.6194
0.0844,0.6261
0.0847,0.6329
0.085,0.6398
0.0851,0.6468
0.0851,0.6538
0.0847,0.661
0.0839,0.6682
0.0827,0.6755
0.081,0.6828
0.0788,0.6902
0.0762,0.6977
0.0731,0.7053
0.0697,0.713
0.0661,0.721
0.0625,0.7292
0.0589,0.7378
0.0555,0.7468
0.0524,0.7563
0.0497,0.7663
0.0474,0.7769
0.0453,0.7881
0.0434,0.7999
0.0414,0.8123
0.0391,0.8253
0.0364,0.839
0.0332,0.8535
0.0294,0.8691
0.0251,0.8865
0.0206,0.9064
0.0155,0.9304
0.0093,0.9606
0,1
