cable,fx,fy,fz,fn
1,204.94708,-158.259978,-496.610451,560.063805
2,-289.282375,-172.328145,-525.074214,623.766152
3,-240.000913,112.865906,-354.935643,443.078392
4,373.745141,237.286518,-707.106656,834.260238
5,725.690019,-514.817021,561.869869,1052.311892
6,-614.461418,-276.549043,311.633895,742.400089
7,-1061.113308,324.024735,457.189175,1199.98976
8,900.475774,447.777028,654.686461,1199.989687
