x1,y1,z1,x2,y2,z2,x3,y3,z3,x4,y4,z4,x5,y5,z5,x6,y6,z6,x7,y7,z7,x8,y8,z8
-8.544,5.463,3.202,8.184,5.692,3.236,8.224,-5.492,3.25,-8.491,-5.322,3.221,-8.192,5.648,-0.589,7.208,6.463,-0.548,7.869,-5.557,-0.527,-8.27,-5.545,-0.582
-8.2119,5.2743,3.0673,7.8657,5.4943,3.0999,7.9041,-5.3023,3.1134,-8.161,-5.139,3.0856,-7.8743,5.456,-0.5547,6.9293,6.2391,-0.5153,7.5644,-5.3684,-0.4951,-7.9492,-5.357,-0.5479
-7.9618,5.1322,2.9659,7.626,5.3455,2.9974,7.6632,-5.1595,3.0105,-7.9125,-5.0012,2.9836,-7.635,5.3113,-0.5288,6.7194,6.0704,-0.4907,7.335,-5.2265,-0.4711,-7.7077,-5.2153,-0.5223
-7.7624,5.0189,2.885,7.4348,5.2267,2.9157,7.4711,-5.0456,2.9284,-7.7143,-4.8912,2.9023,-7.4442,5.196,-0.5082,6.552,5.9359,-0.4711,7.152,-5.1132,-0.452,-7.515,-5.1024,-0.5019
-7.5944,4.9234,2.8169,7.2738,5.1268,2.8469,7.3093,-4.9496,2.8593,-7.5474,-4.7987,2.8338,-7.2835,5.0989,-0.4909,6.411,5.8227,-0.4546,6.9979,-5.0179,-0.4359,-7.3528,-5.0073,-0.4846
-7.4468,4.8395,2.757,7.1322,5.0389,2.7864,7.167,-4.8653,2.7986,-7.4006,-4.7173,2.7736,-7.1423,5.0135,-0.4756,6.2871,5.7231,-0.44,6.8625,-4.934,-0.4217,-7.2102,-4.9237,-0.4695
-7.3131,4.7636,2.7029,7.0041,4.9593,2.7316,7.0383,-4.7889,2.7436,-7.2678,-4.6436,2.7191,-7.0144,4.9362,-0.4618,6.1749,5.633,-0.4269,6.7399,-4.8581,-0.4089,-7.0811,-4.848,-0.4558
-7.1899,4.6936,2.6529,6.886,4.886,2.6812,6.9196,-4.7186,2.6929,-7.1454,-4.5757,2.6689,-6.8965,4.865,-0.4491,6.0715,5.5499,-0.4147,6.6269,-4.7882,-0.3971,-6.9621,-4.7783,-0.4432
-7.075,4.6283,2.6063,6.7759,4.8176,2.6341,6.8089,-4.653,2.6457,-7.0313,-4.5124,2.622,-6.7866,4.7985,-0.4372,5.9751,5.4724,-0.4034,6.5215,-4.723,-0.3861,-6.8512,-4.7132,-0.4314
-6.967,4.5669,2.5625,6.6724,4.7533,2.5898,6.7049,-4.5913,2.6012,-6.9239,-4.4529,2.578,-6.6833,4.7361,-0.426,5.8845,5.3996,-0.3928,6.4224,-4.6617,-0.3757,-6.7469,-4.6521,-0.4203
-6.8648,4.5089,2.5211,6.5744,4.6925,2.548,6.6065,-4.5329,2.5592,-6.8224,-4.3966,2.5363,-6.5856,4.677,-0.4155,5.7987,5.3307,-0.3828,6.3287,-4.6036,-0.3659,-6.6482,-4.5942,-0.4098
-6.7676,4.4536,2.4817,6.4812,4.6346,2.5081,6.5128,-4.4774,2.5192,-6.7258,-4.343,2.4967,-6.4925,4.6208,-0.4054,5.7171,5.2651,-0.3732,6.2395,-4.5484,-0.3566,-6.5542,-4.5392,-0.3999
-6.6747,4.4008,2.444,6.3922,4.5793,2.47,6.4233,-4.4243,2.481,-6.6334,-4.2918,2.4588,-6.4036,4.567,-0.3958,5.6391,5.2025,-0.364,6.1542,-4.4957,-0.3477,-6.4645,-4.4865,-0.3903
-6.5855,4.3501,2.4078,6.3067,4.5262,2.4335,6.3374,-4.3734,2.4443,-6.5448,-4.2426,2.4224,-6.3183,4.5155,-0.3866,5.5643,5.1423,-0.3553,6.0724,-4.445,-0.3391,-6.3784,-4.436,-0.3812
-6.4997,4.3014,2.373,6.2244,4.4751,2.3983,6.2547,-4.3243,2.409,-6.4595,-4.1953,2.3874,-6.2362,4.4658,-0.3777,5.4922,5.0845,-0.3468,5.9937,-4.3963,-0.3309,-6.2955,-4.3874,-0.3724
-6.4169,4.2543,2.3394,6.145,4.4258,2.3644,6.1749,-4.277,2.3749,-6.3772,-4.1497,2.3537,-6.157,4.4179,-0.3691,5.4227,5.0286,-0.3387,5.9177,-4.3493,-0.3229,-6.2155,-4.3405,-0.3639
-6.3367,4.2088,2.3069,6.0682,4.3781,2.3316,6.0977,-4.2313,2.3419,-6.2976,-4.1055,2.321,-6.0803,4.3716,-0.3609,5.3554,4.9746,-0.3308,5.8442,-4.3038,-0.3152,-6.1381,-4.2952,-0.3557
-6.259,4.1646,2.2754,5.9937,4.3319,2.2997,6.0229,-4.1869,2.31,-6.2204,-4.0627,2.2893,-6.006,4.3267,-0.3528,5.2902,4.9222,-0.3231,5.7729,-4.2597,-0.3078,-6.063,-4.2512,-0.3477
-6.1836,4.1218,2.2448,5.9214,4.287,2.2688,5.9502,-4.1438,2.2789,-6.1454,-4.0211,2.2586,-5.9338,4.283,-0.345,5.2269,4.8713,-0.3157,5.7037,-4.2168,-0.3005,-5.9901,-4.2085,-0.34
-6.1102,4.08,2.2151,5.8511,4.2433,2.2388,5.8795,-4.1019,2.2488,-6.0725,-3.9807,2.2286,-5.8636,4.2406,-0.3374,5.1653,4.8218,-0.3085,5.6364,-4.1752,-0.2935,-5.9193,-4.1669,-0.3324
-6.0387,4.0394,2.1861,5.7825,4.2007,2.2095,5.8106,-4.061,2.2193,-6.0014,-3.9413,2.1995,-5.7952,4.1993,-0.3301,5.1053,4.7736,-0.3014,5.5708,-4.1346,-0.2866,-5.8502,-4.1264,-0.3251
-5.9689,3.9998,2.1578,5.7156,4.1592,2.1809,5.7434,-4.0212,2.1906,-5.9321,-3.9028,2.171,-5.7284,4.1589,-0.3228,5.0467,4.7266,-0.2946,5.5068,-4.095,-0.2799,-5.7828,-4.0869,-0.318
-5.9007,3.961,2.1302,5.6503,4.1186,2.1529,5.6778,-3.9822,2.1626,-5.8643,-3.8653,2.1432,-5.6632,4.1195,-0.3158,4.9895,4.6806,-0.2879,5.4443,-4.0563,-0.2734,-5.717,-4.0483,-0.311
-5.8341,3.9232,2.1031,5.5864,4.0789,2.1256,5.6135,-3.9442,2.1352,-5.7981,-3.8285,2.1161,-5.5994,4.0809,-0.3089,4.9336,4.6356,-0.2813,5.3831,-4.0184,-0.267,-5.6526,-4.0106,-0.3041
-5.7688,3.8861,2.0766,5.5238,4.0401,2.0989,5.5506,-3.9069,2.1083,-5.7332,-3.7925,2.0894,-5.537,4.0432,-0.3022,4.8788,4.5916,-0.2749,5.3232,-3.9813,-0.2607,-5.5895,-3.9736,-0.2974
-5.7047,3.8497,2.0507,5.4624,4.0019,2.0726,5.489,-3.8703,2.082,-5.6696,-3.7572,2.0633,-5.4757,4.0062,-0.2955,4.825,4.5484,-0.2686,5.2645,-3.945,-0.2546,-5.5277,-3.9373,-0.2909
-5.6419,3.8139,2.0252,5.4022,3.9645,2.0469,5.4284,-3.8344,2.0561,-5.6071,-3.7226,2.0377,-5.4156,3.9698,-0.289,4.7723,4.506,-0.2624,5.2068,-3.9093,-0.2486,-5.4669,-3.9017,-0.2844
-5.5801,3.7788,2.0001,5.3429,3.9277,2.0216,5.3689,-3.7991,2.0307,-5.5457,-3.6885,2.0125,-5.3564,3.9341,-0.2827,4.7204,4.4644,-0.2563,5.1501,-3.8742,-0.2426,-5.4072,-3.8667,-0.2781
-5.5192,3.7443,1.9755,5.2846,3.8915,1.9966,5.3103,-3.7643,2.0057,-5.4852,-3.655,1.9877,-5.2982,3.8989,-0.2764,4.6694,4.4233,-0.2503,5.0943,-3.8397,-0.2368,-5.3485,-3.8323,-0.2718
-5.4593,3.7102,1.9512,5.2272,3.8558,1.9721,5.2525,-3.7301,1.981,-5.4257,-3.622,1.9633,-5.2409,3.8642,-0.2702,4.619,4.3829,-0.2444,5.0393,-3.8056,-0.231,-5.2906,-3.7983,-0.2657
-5.4001,3.6766,1.9272,5.1704,3.8206,1.9478,5.1955,-3.6963,1.9567,-5.3669,-3.5894,1.9391,-5.1843,3.83,-0.264,4.5694,4.343,-0.2386,4.9851,-3.772,-0.2254,-5.2334,-3.7648,-0.2596
-5.3416,3.6433,1.9034,5.1144,3.7858,1.9239,5.1392,-3.6629,1.9326,-5.3087,-3.5571,1.9153,-5.1283,3.7962,-0.258,4.5203,4.3036,-0.2328,4.9314,-3.7388,-0.2198,-5.1769,-3.7317,-0.2536
-5.2837,3.6104,1.88,5.0589,3.7513,1.9002,5.0834,-3.6298,1.9088,-5.2512,-3.5252,1.8917,-5.0729,3.7627,-0.252,4.4717,4.2645,-0.2271,4.8783,-3.7059,-0.2142,-5.121,-3.6989,-0.2477
-5.2263,3.5778,1.8567,5.0039,3.7172,1.8766,5.0281,-3.597,1.8852,-5.1942,-3.4936,1.8683,-5.018,3.7295,-0.2461,4.4235,4.2258,-0.2215,4.8257,-3.6734,-0.2087,-5.0656,-3.6664,-0.2418
-5.1694,3.5455,1.8336,4.9493,3.6833,1.8533,4.9733,-3.5645,1.8618,-5.1376,-3.4622,1.8451,-4.9635,3.6966,-0.2402,4.3757,4.1874,-0.2159,4.7734,-3.641,-0.2032,-5.0106,-3.6342,-0.236
-5.1128,3.5133,1.8107,4.895,3.6496,1.8301,4.9188,-3.5322,1.8385,-5.0814,-3.431,1.822,-4.9094,3.6639,-0.2344,4.3283,4.1493,-0.2103,4.7215,-3.6089,-0.1978,-4.9559,-3.6022,-0.2302
-5.0565,3.4813,1.7879,4.8411,3.6161,1.8071,4.8645,-3.5001,1.8153,-5.0254,-3.4,1.7991,-4.8556,3.6313,-0.2285,4.281,4.1113,-0.2048,4.6699,-3.577,-0.1924,-4.9016,-3.5703,-0.2244
-5.0005,3.4495,1.7651,4.7874,3.5827,1.7841,4.8106,-3.468,1.7923,-4.9698,-3.3691,1.7762,-4.802,3.5989,-0.2227,4.234,4.0735,-0.1993,4.6185,-3.5451,-0.187,-4.8475,-3.5386,-0.2186
-4.9446,3.4178,1.7425,4.7338,3.5495,1.7612,4.7567,-3.4361,1.7693,-4.9142,-3.3383,1.7534,-4.7485,3.5666,-0.217,4.1871,4.0359,-0.1938,4.5672,-3.5134,-0.1817,-4.7935,-3.5069,-0.2129
-4.8889,3.3861,1.7199,4.6804,3.5163,1.7384,4.7031,-3.4043,1.7464,-4.8589,-3.3076,1.7307,-4.6952,3.5344,-0.2112,4.1403,3.9983,-0.1883,4.5161,-3.4818,-0.1763,-4.7397,-3.4754,-0.2072
-4.8333,3.3545,1.6974,4.6271,3.4832,1.7156,4.6495,-3.3726,1.7235,-4.8036,-3.277,1.7081,-4.642,3.5022,-0.2055,4.0937,3.9608,-0.1828,4.4651,-3.4502,-0.171,-4.686,-3.4439,-0.2015
-4.7778,3.3229,1.6748,4.5739,3.4502,1.6929,4.596,-3.3408,1.7007,-4.7484,-3.2464,1.6854,-4.5889,3.4701,-0.1997,4.0471,3.9234,-0.1773,4.4142,-3.4187,-0.1657,-4.6323,-3.4124,-0.1958
-4.7223,3.2914,1.6523,4.5207,3.4171,1.6701,4.5426,-3.3091,1.6778,-4.6933,-3.2158,1.6628,-4.5358,3.438,-0.194,4.0005,3.8859,-0.1719,4.3633,-3.3872,-0.1603,-4.5787,-3.381,-0.1901
-4.6668,3.2599,1.6299,4.4676,3.3841,1.6474,4.4891,-3.2775,1.655,-4.6382,-3.1852,1.6402,-4.4828,3.406,-0.1882,3.954,3.8486,-0.1664,4.3124,-3.3557,-0.155,-4.5252,-3.3496,-0.1844
-4.6114,3.2284,1.6074,4.4144,3.3511,1.6247,4.4358,-3.2458,1.6322,-4.5831,-3.1547,1.6176,-4.4297,3.3739,-0.1825,3.9074,3.8112,-0.161,4.2616,-3.3242,-0.1497,-4.4717,-3.3183,-0.1787
-4.556,3.1969,1.5849,4.3613,3.3182,1.602,4.3824,-3.2142,1.6095,-4.5281,-3.1242,1.595,-4.3767,3.3419,-0.1768,3.8609,3.7738,-0.1555,4.2108,-3.2928,-0.1444,-4.4181,-3.2869,-0.1731
-4.5006,3.1654,1.5625,4.3082,3.2852,1.5793,4.329,-3.1825,1.5867,-4.473,-3.0936,1.5724,-4.3237,3.3099,-0.1711,3.8144,3.7365,-0.1501,4.1599,-3.2613,-0.1391,-4.3646,-3.2555,-0.1674
-4.4452,3.134,1.54,4.2551,3.2522,1.5566,4.2757,-3.1509,1.5639,-4.418,-3.0631,1.5498,-4.2707,3.2778,-0.1653,3.768,3.6991,-0.1446,4.1091,-3.2299,-0.1337,-4.3111,-3.2241,-0.1617
-4.3898,3.1025,1.5175,4.202,3.2192,1.5339,4.2223,-3.1192,1.5411,-4.3629,-3.0326,1.5273,-4.2177,3.2458,-0.1596,3.7215,3.6618,-0.1391,4.0583,-3.1984,-0.1284,-4.2576,-3.1928,-0.156
-4.3344,3.071,1.4951,4.1489,3.1863,1.5112,4.1689,-3.0876,1.5183,-4.3079,-3.002,1.5047,-4.1647,3.2138,-0.1539,3.675,3.6244,-0.1337,4.0075,-3.167,-0.1231,-4.2041,-3.1614,-0.1503
-4.279,3.0395,1.4726,4.0958,3.1533,1.4886,4.1156,-3.056,1.4955,-4.2528,-2.9715,1.4821,-4.1118,3.1817,-0.1482,3.6285,3.5871,-0.1282,3.9567,-3.1355,-0.1178,-4.1506,-3.1301,-0.1446
-4.2237,3.0081,1.4502,4.0427,3.1203,1.4659,4.0622,-3.0243,1.4727,-4.1978,-2.941,1.4595,-4.0588,3.1497,-0.1424,3.582,3.5497,-0.1228,3.9059,-3.1041,-0.1125,-4.0971,-3.0987,-0.139
-4.1683,2.9766,1.4277,3.9896,3.0873,1.4432,4.0089,-2.9927,1.45,-4.1427,-2.9105,1.4369,-4.0058,3.1177,-0.1367,3.5355,3.5124,-0.1173,3.8551,-3.0726,-0.1072,-4.0436,-3.0673,-0.1333
-4.1129,2.9451,1.4053,3.9365,3.0544,1.4205,3.9555,-2.9611,1.4272,-4.0877,-2.8799,1.4144,-3.9528,3.0856,-0.131,3.489,3.475,-0.1119,3.8043,-3.0412,-0.1018,-3.9901,-3.036,-0.1276
-4.0575,2.9136,1.3828,3.8834,3.0214,1.3978,3.9021,-2.9294,1.4044,-4.0327,-2.8494,1.3918,-3.8998,3.0536,-0.1252,3.4425,3.4377,-0.1064,3.7534,-3.0097,-0.0965,-3.9366,-3.0046,-0.1219
-4.0021,2.8822,1.3603,3.8303,2.9884,1.3751,3.8488,-2.8978,1.3816,-3.9776,-2.8189,1.3692,-3.8468,3.0216,-0.1195,3.396,3.4003,-0.101,3.7026,-2.9783,-0.0912,-3.8831,-2.9732,-0.1162
-3.9466,2.8507,1.3379,3.7772,2.9554,1.3524,3.7954,-2.8661,1.3588,-3.9225,-2.7883,1.3466,-3.7938,2.9895,-0.1138,3.3495,3.3629,-0.0955,3.6518,-2.9468,-0.0859,-3.8296,-2.9418,-0.1106
-3.8912,2.8192,1.3154,3.7241,2.9224,1.3297,3.742,-2.8344,1.336,-3.8674,-2.7578,1.324,-3.7407,2.9575,-0.1081,3.303,3.3255,-0.0901,3.6009,-2.9153,-0.0806,-3.776,-2.9104,-0.1049
-3.8357,2.7876,1.2929,3.6709,2.8894,1.3069,3.6885,-2.8028,1.3132,-3.8123,-2.7272,1.3014,-3.6876,2.9254,-0.1023,3.2564,3.2881,-0.0846,3.55,-2.8838,-0.0753,-3.7224,-2.879,-0.0992
-3.7802,2.7561,1.2704,3.6176,2.8563,1.2842,3.635,-2.771,1.2903,-3.7571,-2.6966,1.2787,-3.6345,2.8933,-0.0966,3.2098,3.2507,-0.0791,3.4991,-2.8523,-0.0699,-3.6688,-2.8476,-0.0935
-3.7246,2.7245,1.2478,3.5643,2.8232,1.2614,3.5815,-2.7393,1.2675,-3.7018,-2.6659,1.2561,-3.5813,2.8611,-0.0908,3.1631,3.2132,-0.0737,3.4481,-2.8207,-0.0646,-3.6151,-2.8161,-0.0878
-3.6688,2.6928,1.2252,3.5109,2.7901,1.2386,3.5278,-2.7074,1.2445,-3.6465,-2.6352,1.2333,-3.528,2.8289,-0.0851,3.1164,3.1756,-0.0682,3.397,-2.7891,-0.0592,-3.5613,-2.7845,-0.0821
-3.613,2.6611,1.2026,3.4574,2.7568,1.2157,3.474,-2.6755,1.2216,-3.591,-2.6044,1.2106,-3.4746,2.7966,-0.0793,3.0695,3.1379,-0.0627,3.3457,-2.7574,-0.0539,-3.5073,-2.7529,-0.0763
-3.5569,2.6292,1.1799,3.4037,2.7235,1.1927,3.42,-2.6435,1.1985,-3.5353,-2.5736,1.1877,-3.4209,2.7642,-0.0735,3.0224,3.1001,-0.0572,3.2943,-2.7256,-0.0485,-3.4532,-2.7212,-0.0706
-3.5007,2.5972,1.1571,3.3497,2.69,1.1697,3.3658,-2.6114,1.1754,-3.4793,-2.5425,1.1648,-3.3671,2.7316,-0.0677,2.9752,3.0622,-0.0516,3.2427,-2.6936,-0.0431,-3.3988,-2.6893,-0.0648
-3.4441,2.5651,1.1341,3.2955,2.6563,1.1465,3.3113,-2.5791,1.1521,-3.4231,-2.5114,1.1417,-3.313,2.6989,-0.0618,2.9277,3.024,-0.0461,3.1908,-2.6615,-0.0377,-3.3442,-2.6573,-0.059
-3.3871,2.5327,1.111,3.2409,2.6224,1.1232,3.2564,-2.5465,1.1287,-3.3665,-2.48,1.1185,-3.2585,2.666,-0.0559,2.8799,2.9856,-0.0404,3.1385,-2.6291,-0.0322,-3.2892,-2.625,-0.0532
-3.3298,2.5001,1.0878,3.1859,2.5882,1.0997,3.2011,-2.5138,1.1051,-3.3095,-2.4483,1.0951,-3.2036,2.6328,-0.05,2.8318,2.9469,-0.0348,3.0859,-2.5966,-0.0267,-3.2338,-2.5925,-0.0473
-3.2719,2.4672,1.0643,3.1304,2.5538,1.0759,3.1454,-2.4807,1.0813,-3.252,-2.4164,1.0715,-3.1482,2.5993,-0.044,2.7832,2.9079,-0.0291,3.0328,-2.5637,-0.0211,-3.1779,-2.5598,-0.0413
-3.2134,2.434,1.0406,3.0743,2.5189,1.052,3.089,-2.4473,1.0572,-3.1938,-2.3842,1.0477,-3.0922,2.5655,-0.038,2.7341,2.8685,-0.0233,2.9791,-2.5305,-0.0155,-3.1214,-2.5266,-0.0353
-3.1542,2.4004,1.0166,3.0176,2.4837,1.0277,3.032,-2.4135,1.0329,-3.135,-2.3516,1.0235,-3.0356,2.5313,-0.0319,2.6844,2.8286,-0.0175,2.9249,-2.4969,-0.0098,-3.0642,-2.4931,-0.0293
-3.0942,2.3663,0.9923,2.9601,2.448,1.0032,2.9742,-2.3792,1.0082,-3.0755,-2.3185,0.9991,-2.9783,2.4966,-0.0257,2.6341,2.7881,-0.0116,2.8699,-2.4628,-0.0041,-3.0063,-2.4592,-0.0231
-3.0334,2.3317,0.9676,2.9018,2.4118,0.9783,2.9156,-2.3445,0.9832,-3.015,-2.285,0.9743,-2.9201,2.4614,-0.0194,2.5831,2.7471,-0.0056,2.8141,-2.4283,0.0017,-2.9475,-2.4247,-0.0169
-2.9716,2.2966,0.9426,2.8426,2.375,0.9529,2.8561,-2.3092,0.9578,-2.9536,-2.251,0.9491,-2.861,2.4257,-0.013,2.5312,2.7054,0.0005,2.7574,-2.3932,0.0077,-2.8878,-2.3898,-0.0105
-2.9087,2.2609,0.9171,2.7823,2.3376,0.9272,2.7956,-2.2733,0.9319,-2.8911,-2.2163,0.9235,-2.8008,2.3893,-0.0065,2.4784,2.663,0.0067,2.6997,-2.3575,0.0137,-2.8271,-2.3542,-0.0041
-2.8447,2.2245,0.8911,2.7209,2.2995,0.901,2.7339,-2.2367,0.9056,-2.8275,-2.181,0.8974,-2.7396,2.3523,0.0001,2.4247,2.6199,0.013,2.641,-2.3212,0.0199,-2.7653,-2.3179,0.0025
-2.7794,2.1874,0.8647,2.6583,2.2606,0.8742,2.671,-2.1994,0.8787,-2.7626,-2.145,0.8708,-2.6771,2.3146,0.0069,2.3699,2.5758,0.0194,2.5811,-2.2841,0.0261,-2.7022,-2.2809,0.0092
-2.7127,2.1495,0.8376,2.5944,2.2209,0.8469,2.6067,-2.1613,0.8513,-2.6963,-2.1083,0.8436,-2.6133,2.276,0.0138,2.3139,2.5309,0.0259,2.5199,-2.2463,0.0325,-2.6378,-2.2432,0.016
-2.6446,2.1108,0.81,2.5291,2.1804,0.819,2.5411,-2.1224,0.8233,-2.6286,-2.0707,0.8158,-2.5481,2.2366,0.0208,2.2567,2.4849,0.0327,2.4574,-2.2076,0.0391,-2.572,-2.2046,0.023
-2.5748,2.0711,0.7817,2.4622,2.1388,0.7904,2.4739,-2.0826,0.7946,-2.5593,-2.0323,0.7874,-2.4813,2.1963,0.0281,2.1982,2.4379,0.0395,2.3934,-2.1679,0.0458,-2.5046,-2.1651,0.0302
-2.5033,2.0305,0.7527,2.3937,2.0963,0.7611,2.405,-2.0417,0.7652,-2.4882,-1.9929,0.7582,-2.4129,2.1549,0.0354,2.1381,2.3897,0.0466,2.3278,-2.1273,0.0526,-2.4355,-2.1246,0.0375
-2.4299,1.9888,0.723,2.3233,2.0526,0.731,2.3343,-1.9998,0.735,-2.4153,-1.9524,0.7283,-2.3427,2.1125,0.043,2.0765,2.3402,0.0538,2.2605,-2.0857,0.0597,-2.3646,-2.083,0.045
-2.3544,1.9459,0.6924,2.251,2.0077,0.7001,2.2616,-1.9567,0.7039,-2.3403,-1.9108,0.6975,-2.2705,2.0688,0.0508,2.0132,2.2893,0.0612,2.1913,-2.0428,0.0669,-2.2918,-2.0403,0.0528
-2.2767,1.9018,0.6609,2.1765,1.9614,0.6683,2.1868,-1.9123,0.672,-2.2631,-1.868,0.6659,-2.1962,2.0239,0.0589,1.948,2.2369,0.0689,2.12,-1.9987,0.0744,-2.2167,-1.9963,0.0607
-2.1966,1.8563,0.6284,2.0997,1.9137,0.6355,2.1096,-1.8665,0.639,-2.1835,-1.8239,0.6332,-2.1195,1.9776,0.0672,1.8808,2.1829,0.0768,2.0465,-1.9532,0.0821,-2.1393,-1.9509,0.0689
-2.1138,1.8092,0.5948,2.0203,1.8644,0.6016,2.0298,-1.8192,0.605,-2.1011,-1.7782,0.5994,-2.0403,1.9297,0.0757,1.8112,2.127,0.0849,1.9705,-1.9062,0.09,-2.0593,-1.904,0.0774
-2.0279,1.7604,0.56,1.938,1.8133,0.5664,1.9471,-1.7702,0.5697,-2.0159,-1.7309,0.5645,-1.9582,1.88,0.0846,1.7392,2.0691,0.0934,1.8918,-1.8575,0.0982,-1.9764,-1.8554,0.0863
-1.9388,1.7097,0.5239,1.8526,1.7602,0.5299,1.8612,-1.7193,0.533,-1.9273,-1.6818,0.5281,-1.8729,1.8285,0.0938,1.6644,2.009,0.1021,1.81,-1.8068,0.1068,-1.8903,-1.805,0.0954
-1.8458,1.6569,0.4862,1.7635,1.7049,0.4918,1.7717,-1.6662,0.4948,-1.8349,-1.6305,0.4902,-1.784,1.7747,0.1034,1.5864,1.9463,0.1113,1.7247,-1.7541,0.1157,-1.8005,-1.7523,0.1049
-1.7486,1.6017,0.4468,1.6703,1.647,0.452,1.678,-1.6107,0.4548,-1.7383,-1.5769,0.4506,-1.691,1.7185,0.1135,1.5048,1.8808,0.1209,1.6355,-1.6989,0.1251,-1.7066,-1.6973,0.1149
-1.6464,1.5436,0.4054,1.5723,1.5862,0.4101,1.5796,-1.5523,0.4128,-1.6367,-1.5206,0.4089,-1.5932,1.6594,0.1241,1.419,1.8119,0.1309,1.5418,-1.6409,0.1349,-1.6079,-1.6394,0.1254
-1.5384,1.4822,0.3616,1.4688,1.5219,0.3659,1.4755,-1.4906,0.3683,-1.5294,-1.4611,0.3649,-1.4899,1.597,0.1352,1.3284,1.739,0.1416,1.4427,-1.5795,0.1452,-1.5036,-1.5783,0.1365
-1.4235,1.417,0.315,1.3587,1.4535,0.3188,1.3649,-1.425,0.3211,-1.4152,-1.3978,0.3181,-1.38,1.5305,0.1471,1.232,1.6616,0.1529,1.3373,-1.5143,0.1563,-1.3927,-1.5132,0.1483
-1.3003,1.347,0.2651,1.2406,1.3802,0.2684,1.2462,-1.3546,0.2704,-1.2928,-1.3299,0.2679,-1.2621,1.4593,0.1598,1.1286,1.5785,0.165,1.2243,-1.4444,0.1681,-1.2737,-1.4435,0.1609
-1.1667,1.271,0.2109,1.1125,1.3006,0.2136,1.1174,-1.2783,0.2155,-1.16,-1.2562,0.2134,-1.1342,1.382,0.1737,1.0164,1.4884,0.1782,1.1017,-1.3685,0.1809,-1.1446,-1.3678,0.1746
-1.019,1.1871,0.1511,0.9709,1.2128,0.1531,0.9752,-1.1939,0.1547,-1.0133,-1.1749,0.1532,-0.993,1.2966,0.1889,0.8925,1.3888,0.1927,0.9663,-1.2847,0.1951,-1.002,-1.2842,0.1898
-0.851,1.0917,0.083,0.8099,1.1128,0.0843,0.8134,-1.098,0.0857,-0.8464,-1.0823,0.0848,-0.8323,1.1995,0.2063,0.7515,1.2756,0.2092,0.8122,-1.1893,0.2112,-0.8397,-1.1891,0.207
-0.6516,0.9783,0.0021,0.6187,0.994,0.0027,0.6213,-0.9841,0.0036,-0.6481,-0.9724,0.0035,-0.6415,1.0842,0.2269,0.5841,1.1411,0.2289,0.6293,-1.0761,0.2304,-0.6471,-1.0761,0.2274
-0.4015,0.8362,-0.0992,0.379,0.8452,-0.0998,0.3803,-0.8412,-0.0992,-0.3996,-0.8345,-0.0985,-0.4022,0.9396,0.2528,0.3742,0.9724,0.2535,0.3999,-0.9341,0.2544,-0.4056,-0.9345,0.2531
-0.0694,0.6475,-0.2338,0.0606,0.6475,-0.2358,0.0604,-0.6515,-0.2358,-0.0696,-0.6515,-0.2338,-0.0845,0.7475,0.2872,0.0955,0.7485,0.2862,0.0952,-0.7455,0.2862,-0.0848,-0.7465,0.2872
