x,y,z,u,v,w
-0.819765487086742,0.0411746562320253,-0.166194660953865,-0.33816266005681,-0.940832530194574,-0.0219126783159721
-0.819765487086742,0.0411746562320253,-0.166194660953865,0.864812337922539,-0.31985304016387,0.387031849948918
-0.819765487086742,0.0411746562320253,-0.166194660953865,-0.371140991430824,0.111929365340854,0.921805934920219
