cable,fx,fy,fz,fn
1,1.988521,-1.404121,-2.223269,3.296771
2,-1.984527,-1.397633,-2.214569,3.285733
3,-1.956566,1.38365,-2.17991,3.239544
4,1.978729,1.402551,-2.208471,3.280223
5,-0.000844,0.000502,-0.00109,0.001467
6,0.000508,0.0003,-0.000778,0.000976
7,-0.025198,0.015127,0.025698,0.039041
8,-0.000623,-0.000377,-0.000866,0.001132
