xi,s1,s2
0,0,0
0.01,0.00159015666284234,-0.0100619312199339
0.02,0.00319312858729929,-0.0201202884390492
0.03,0.00480912519585867,-0.0301750209475336
0.04,0.00643836101620861,-0.0402260763468902
0.05,0.00808105584607108,-0.0502734004795395
0.06,0.00973743492463415,-0.0603169373548971
0.07,0.0114077291108947,-0.070356629071718
0.08,0.0130921750692437,-0.0803924157364904
0.09,0.0147910154626422,-0.0904242353776413
0.1,0.0165044991537558,-0.100452023855305
0.11,0.0182328814144378,-0.110475714766389
0.12,0.0199764241439696,-0.120495239344639
0.13,0.0217353960964945,-0.130510526355424
0.14,0.0235100731180997,-0.14052150198487
0.15,0.0253007383940352,-0.150528089723045
0.16,0.0271076827065783,-0.160530210240766
0.17,0.0289312047040879,-0.170527781259668
0.18,0.0307716111818202,-0.180520717415076
0.19,0.0326292173751158,-0.190508930111232
0.2,0.034504347265597,-0.200492327368365
0.21,0.0363973339010593,-0.210470813661084
0.22,0.0383085197297777,-0.220444289747505
0.23,0.0402382569499912,-0.230412652488512
0.24,0.0421869078753778,-0.240375794656461
0.25,0.0441548453173795,-0.250333604732634
0.26,0.0461424529852888,-0.260285966692663
0.27,0.0481501259050652,-0.270232759779083
0.28,0.0501782708579103,-0.28017385826013
0.29,0.0522273068396919,-0.290109131173807
0.3,0.0542976655423766,-0.300038442056165
0.31,0.056389791858704,-0.309961648652687
0.32,0.058504144411409,-0.319878602611522
0.33,0.0606411961083874,-0.32978914915727
0.34,0.0628014347252825,-0.339693126743865
0.35,0.0649853635170677,-0.34959036668501
0.36,0.0671935018602998,-0.359480692760464
0.37,0.069426385927825,-0.36936392079637
0.38,0.0716845693978343,-0.379239858217604
0.39,0.0739686241992872,-0.38910830357001
0.4,0.0762791412958518,-0.398969046010151
0.41,0.0786167315106511,-0.408821864760018
0.42,0.0809820263942509,-0.418666528523901
0.43,0.0833756791384824,-0.428502794864394
0.44,0.0857983655388646,-0.438330409534188
0.45,0.0882507850085646,-0.448149105760051
0.46,0.0907336616470279,-0.457958603475011
0.47,0.0932477453666123,-0.467758608494421
0.48,0.0957938130807693,-0.477548811631153
0.49,0.0983726699575494,-0.487328887744725
0.5,0.100985150742438,-0.497098494718665
0.51,0.103632121154793,-0.506857272359852
0.52,0.106314479362401,-0.516604841212976
0.53,0.109033157538973,-0.526340801282553
0.54,0.111789123509663,-0.536064730654213
0.55,0.114583382490009,-0.545776184006109
0.56,0.117416978924017,-0.555474691000372
0.57,0.12029099842739,-0.565159754543525
0.58,0.123206569842284,-0.57483084890358
0.59,0.126164867410246,-0.584487417670307
0.6,0.12916711307036,-0.594128871543698
0.61,0.132214578889905,-0.603754585934081
0.62,0.135308589635167,-0.613363898355576
0.63,0.13845052549028,-0.622956105592581
0.64,0.141641824932273,-0.632530460616811
0.65,0.144883987770599,-0.642086169229902
0.66,0.148178578359629,-0.651622386403904
0.67,0.151527228992537,-0.661138212288861
0.68,0.154931643484942,-0.670632687853288
0.69,0.158393600956366,-0.680104790119511
0.7,0.161914959817133,-0.68955342695157
0.71,0.165497661967527,-0.698977431348612
0.72,0.169143737215014,-0.708375555191393
0.73,0.17285530791378,-0.717746462383583
0.74,0.176634593828836,-0.727088721322979
0.75,0.180483917224264,-0.736400796630422
0.76,0.184405708171649,-0.745681040056106
0.77,0.1884025100703,-0.754927680474009
0.78,0.192476985365045,-0.764138812865313
0.79,0.196631921440187,-0.773312386180889
0.8,0.200870236658999,-0.782446189961106
0.81,0.205194986506722,-0.79153783957852
0.82,0.209609369780767,-0.800584759955316
0.83,0.214116734754119,-0.80958416759289
0.84,0.218720585216147,-0.818533050735938
0.85,0.223424586268121,-0.827428147478007
0.86,0.228232569717834,-0.836265921600366
0.87,0.233148538877511,-0.845042535921822
0.88,0.238176672520305,-0.853753822924845
0.89,0.243321327691521,-0.862395252414503
0.9,0.248587040999427,-0.870961895963163
0.91,0.253978527925212,-0.879448387898347
0.92,0.259500679590163,-0.887848882607128
0.93,0.265158556298512,-0.896157007962511
0.94,0.270957377034646,-0.904365814731584
0.95,0.276902503932324,-0.91246772190937
0.96,0.282999420550701,-0.920454458046122
0.97,0.289253702588762,-0.928316998811218
0.98,0.295670979450243,-0.936045501278319
0.99,0.302256884843102,-0.943629235741047
1,0.309016994375001,-0.9510565162951
