xi,s1,s2
0,3.2339370760251e-26,4.2712933002717e-26
0.01,0.0177735120155421,0.0221120605515523
0.02,0.0330261742050403,0.0421313671912398
0.03,0.0461677529781143,0.0603709028867999
0.04,0.057550305902972,0.0771004364885288
0.05,0.0674741349272325,0.0925509782281072
0.06,0.076193407666974,0.106918986133519
0.07,0.0839214467640063,0.120370323360065
0.08,0.0908356873113672,0.133043966437461
0.09,0.0970823023470436,0.14505546443304
0.1,0.102780496415917,0.156500149031038
0.11,0.108026467199931,0.167456095527977
0.12,0.112897035216489,0.177986834744136
0.13,0.117452941585071,0.18814381585112
0.14,0.121741813862073,0.197968620115518
0.15,0.125800799943879,0.207494925558652
0.16,0.129658870038149,0.216750222532427
0.17,0.133338786703335,0.22575728021126
0.18,0.136858742956424,0.234535364000113
0.19,0.140233668448898,0.243101203858615
0.2,0.143476203710924,0.251469713541272
0.21,0.146597342913406,0.259654461093536
0.22,0.149606770777204,0.26766790996999
0.23,0.152513029419903,0.275521533381899
0.24,0.155323650930503,0.283225904481377
0.25,0.158045281301347,0.290790781748437
0.26,0.160683796166913,0.298225189920678
0.27,0.163244408349478,0.305537496465617
0.28,0.16573176721166,0.312735483595666
0.29,0.168150049815815,0.319826415825738
0.3,0.170503043890318,0.326817103073511
0.31,0.172794222602706,0.333713959302316
0.32,0.175026811139695,0.340523056706683
0.33,0.177203845094067,0.347250175440516
0.34,0.179328220658423,0.353900848887914
0.35,0.181402736625812,0.360480404476634
0.36,0.183430128197224,0.366994000034195
0.37,0.185413092595961,0.373446655686622
0.38,0.187354306488871,0.379843281299833
0.39,0.189256435214452,0.386188699463665
0.4,0.191122133817836,0.392487664018545
0.41,0.192954039906771,0.398744874130864
0.42,0.19475475913479,0.404964984262738
0.43,0.196526847582784,0.411152611867671
0.44,0.198272795310216,0.417312344643609
0.45,0.199995011882148,0.423448747689094
0.46,0.20169581388621,0.429566370568553
0.47,0.20337741443952,0.435669754286743
0.48,0.205041914685552,0.441763438172351
0.49,0.206691297280954,0.447851966670729
0.5,0.20832742187231,0.453939896045794
0.51,0.209952022562852,0.460031800991066
0.52,0.211566707369125,0.466132281149862
0.53,0.213172959667594,0.472245967544635
0.54,0.214772141631203,0.478377528915468
0.55,0.216365499655879,0.484531677967709
0.56,0.217954171776989,0.490713177528763
0.57,0.219539197075741,0.496926846614033
0.58,0.221121527075537,0.503177566402004
0.59,0.222702039128269,0.509470286118481
0.6,0.224281551790571,0.515810028829978
0.61,0.225860842185484,0.522201897154457
0.62,0.227440665091449,0.528651079356942
0.63,0.22902177239116,0.535162858307111
0.64,0.230604931512824,0.541742625775919
0.65,0.232190942605722,0.548395902538812
0.66,0.23378065444555,0.555128364293711
0.67,0.235374979069542,0.561945873393783
0.68,0.236974905141362,0.568854516394981
0.69,0.238581510045781,0.575860647418373
0.7,0.24019597071313,0.582970937327246
0.71,0.241819573173533,0.590192428718989
0.72,0.243453720840911,0.597532596731754
0.73,0.245099941526771,0.604999415665899
0.74,0.246759893183772,0.61260143142021
0.75,0.248435368379066,0.6203478397429
0.76,0.250128297497416,0.628248570297385
0.77,0.2518407506741,0.63631437654285
0.78,0.253574938457582,0.64455693142958
0.79,0.255333211201967,0.652988928909077
0.8,0.257118057189234,0.661624191258962
0.81,0.258932099573013,0.670477782803461
0.82,0.260778097374639,0.67956616313606
0.83,0.262658978245161,0.688907555251047
0.84,0.264577930707022,0.698522703990652
0.85,0.266538561106106,0.708436057914359
0.86,0.26854511536595,0.718677375171212
0.87,0.270602765544096,0.729283753375097
0.88,0.272717961190605,0.740302083483024
0.89,0.274898845508711,0.751791927676389
0.9,0.277155736317636,0.763828821245226
0.91,0.279501671817548,0.776507998475448
0.92,0.28195302115668,0.789948542539074
0.93,0.284530159800589,0.804297959387444
0.94,0.287258209703575,0.819737175647422
0.95,0.290167844282245,0.836485960520591
0.96,0.293296158191236,0.854808771685423
0.97,0.296687601901077,0.875021025202453
0.98,0.300394981078216,0.897495789422433
0.99,0.304480520767191,0.922670902897469
1,0.309016994374947,0.951056516295154
