xi,sx,sy,cx,cy,ex,ey,ne
0,0,-0,0,0,0,-0,0
0.01,0.0272182088,-0.0096001887,0.0096130487,-0.0034810041,0.0176051601,-0.0061191846,0.0186382962
0.02,0.0504354771,-0.0174124397,0.0192479707,-0.0068994454,0.0311875064,-0.0105129944,0.0329117548
0.03,0.0705776933,-0.0238782452,0.0289044685,-0.0102549005,0.0416732248,-0.0136233448,0.0438435079
0.04,0.0883509305,-0.0293278799,0.0385822367,-0.0135469498,0.0497686938,-0.0157809301,0.052210733
0.05,0.1042906935,-0.0340063586,0.0482809625,-0.0167751781,0.056009731,-0.0172311805,0.0586003716
0.06,0.1188013605,-0.0380940755,0.0580003256,-0.0199391744,0.0608010349,-0.0181549011,0.0634536545
0.07,0.1321874654,-0.0417230356,0.0677399981,-0.0230385325,0.0644474672,-0.018684503,0.0671013166
0.08,0.1446782496,-0.0449894663,0.0774996448,-0.026072851,0.0671786048,-0.0189166152,0.0697911404
0.09,0.1564467125,-0.0479634864,0.0872789228,-0.0290417336,0.0691677897,-0.0189217528,0.0717092453
0.1,0.167624214,-0.0506964111,0.097077482,-0.0319447893,0.0705467319,-0.0187516218,0.0729963335
0.11,0.1783115204,-0.0532261809,0.106894965,-0.0347816327,0.0714165555,-0.0184445482,0.0737599197
0.12,0.1885870449,-0.0555813245,0.1167310068,-0.0375518843,0.0718560381,-0.0180294402,0.0740834052
0.13,0.1985129025,-0.0577837933,0.1265852356,-0.0402551704,0.071927667,-0.0175286229,0.0740327083
0.14,0.208139294,-0.0598509446,0.136457272,-0.0428911237,0.071682022,-0.0169598209,0.0736610331
0.15,0.2175076303,-0.061796896,0.1463467299,-0.0454593833,0.0711609004,-0.0163375127,0.073012246
0.16,0.2266527295,-0.0636334272,0.1562532159,-0.0479595952,0.0703995135,-0.015673832,0.0721232314
0.17,0.2356043441,-0.0653705655,0.16617633,-0.0503914121,0.069428014,-0.0149791534,0.0710255177
0.18,0.2443882177,-0.0670169588,0.1761156652,-0.052754494,0.0682725525,-0.0142624648,0.069746393
0.19,0.253026819,-0.0685801121,0.1860708077,-0.0550485081,0.0669560114,-0.0135316039,0.0683096755
0.2,0.2615398615,-0.0700665414,0.1960413372,-0.0572731296,0.0654985243,-0.0127934118,0.0667362575
0.21,0.2699446842,-0.0714818808,0.2060268272,-0.0594280412,0.063917857,-0.0120538396,0.0650445039
0.22,0.2782565444,-0.0728309665,0.2160268444,-0.0615129336,0.0622297,-0.0113180329,0.0632505607
0.23,0.2864888554,-0.0741179113,0.2260409496,-0.0635275061,0.0604479058,-0.0105904052,0.0613686076
0.24,0.2946533877,-0.0753461748,0.2360686973,-0.065471466,0.0585846904,-0.0098747088,0.059411075
0.25,0.3027604454,-0.076518634,0.2461096363,-0.0673445297,0.0566508091,-0.0091741043,0.0573888348
0.26,0.3108190224,-0.0776376511,0.2561633095,-0.0691464222,0.0546557129,-0.0084912289,0.0553113725
0.27,0.3188369441,-0.0787051416,0.2662292542,-0.0708768777,0.0526076899,-0.0078282639,0.0531869416
0.28,0.3268209931,-0.0797226371,0.2763070022,-0.0725356395,0.0505139909,-0.0071869976,0.0510227029
0.29,0.3347770237,-0.0806913459,0.2863960802,-0.0741224605,0.0483809435,-0.0065688854,0.0488248497
0.3,0.3427100652,-0.0816122083,0.2964960096,-0.0756371033,0.0462140556,-0.005975105,0.0465987212
0.31,0.3506244152,-0.0824859462,0.3066063071,-0.07707934,0.0440181081,-0.0054066061,0.0443489034
0.32,0.3585237239,-0.0833131079,0.3167264844,-0.078448953,0.0417972395,-0.004864155,0.0420793208
0.33,0.3664110716,-0.0840941078,0.3268560489,-0.0797457345,0.0395550227,-0.0043483732,0.0397933182
0.34,0.3742890375,-0.0848292588,0.3369945037,-0.0809694874,0.0372945338,-0.0038597714,0.037493734
0.35,0.3821597635,-0.0855188014,0.3471413477,-0.0821200246,0.0350184158,-0.0033987768,0.0351829665
0.36,0.3900250105,-0.0861629258,0.3572960758,-0.0831971699,0.0327289347,-0.0029657559,0.0328630321
0.37,0.397886211,-0.0867617907,0.3674581794,-0.0842007577,0.0304280316,-0.002561033,0.0305356185
0.38,0.4057445145,-0.0873155363,0.3776271465,-0.0851306333,0.028117368,-0.0021849031,0.0282021309
0.39,0.4136008299,-0.0878242944,0.3878024617,-0.0859866528,0.0257983682,-0.0018376415,0.0258637338
0.4,0.4214558619,-0.0882881942,0.3979836067,-0.0867686837,0.0234722552,-0.0015195104,0.0235213877
0.41,0.4293101445,-0.0887073658,0.4081700603,-0.0874766044,0.0211400842,-0.0012307614,0.021175881
0.42,0.4371640697,-0.089081941,0.4183612989,-0.0881103046,0.0188027708,-0.0009716363,0.0188278587
0.43,0.4450179128,-0.0894120518,0.4285567968,-0.0886696856,0.016461116,-0.0007423662,0.0164778472
0.44,0.4528718546,-0.0896978282,0.4387560258,-0.0891546598,0.0141158287,-0.0005431683,0.0141262753
0.45,0.4607259999,-0.0899393943,0.4489584565,-0.0895651515,0.0117675435,-0.0003742428,0.011773493
0.46,0.4685803943,-0.0901368647,0.4591635574,-0.0899010962,0.0094168369,-0.0002357685,0.0094197879
0.47,0.4764350372,-0.0902903398,0.4693707961,-0.0901624412,0.007064241,-0.0001278986,0.0070653987
0.48,0.484289894,-0.0903999027,0.4795796391,-0.0903491456,0.0047102549,-5.07571e-05,0.0047105284
0.49,0.4921449063,-0.0904656149,0.489789552,-0.09046118,0.0023553543,-4.4349e-06,0.0023553585
0.5,0.5,-0.0904875147,0.5,-0.0904985267,0,1.1012e-05,1.1012e-05
0.51,0.5078550937,-0.0904656149,0.510210448,-0.09046118,-0.0023553543,-4.4349e-06,0.0023553585
0.52,0.515710106,-0.0903999027,0.5204203609,-0.0903491456,-0.0047102549,-5.07571e-05,0.0047105284
0.53,0.5235649628,-0.0902903398,0.5306292038,-0.0901624412,-0.007064241,-0.0001278986,0.0070653987
0.54,0.5314196057,-0.0901368647,0.5408364426,-0.0899010962,-0.0094168368,-0.0002357685,0.0094197878
0.55,0.5392740001,-0.0899393943,0.5510415435,-0.0895651515,-0.0117675434,-0.0003742428,0.011773493
0.56,0.5471281454,-0.0896978282,0.5612439741,-0.0891546598,-0.0141158287,-0.0005431683,0.0141262752
0.57,0.5549820872,-0.0894120518,0.5714432032,-0.0886696856,-0.016461116,-0.0007423662,0.0164778472
0.58,0.5628359303,-0.089081941,0.5816387011,-0.0881103046,-0.0188027707,-0.0009716363,0.0188278587
0.59,0.5706898555,-0.0887073658,0.5918299397,-0.0874766044,-0.0211400842,-0.0012307614,0.021175881
0.6,0.5785441381,-0.0882881942,0.6020163933,-0.0867686837,-0.0234722552,-0.0015195104,0.0235213876
0.61,0.5863991701,-0.0878242944,0.6121975383,-0.0859866528,-0.0257983681,-0.0018376415,0.0258637338
0.62,0.5942554855,-0.0873155363,0.6223728535,-0.0851306333,-0.028117368,-0.0021849031,0.0282021308
0.63,0.602113789,-0.0867617907,0.6325418205,-0.0842007577,-0.0304280315,-0.002561033,0.0305356184
0.64,0.6099749895,-0.0861629258,0.6427039242,-0.0831971699,-0.0327289347,-0.0029657559,0.0328630321
0.65,0.6178402365,-0.0855188014,0.6528586523,-0.0821200246,-0.0350184158,-0.0033987768,0.0351829664
0.66,0.6257109625,-0.0848292588,0.6630054963,-0.0809694874,-0.0372945338,-0.0038597714,0.037493734
0.67,0.6335889284,-0.0840941078,0.6731439511,-0.0797457345,-0.0395550227,-0.0043483732,0.0397933181
0.68,0.6414762761,-0.0833131079,0.6832735156,-0.078448953,-0.0417972395,-0.004864155,0.0420793208
0.69,0.6493755848,-0.0824859462,0.6933936929,-0.07707934,-0.0440181081,-0.0054066061,0.0443489034
0.7,0.6572899348,-0.0816122083,0.7035039903,-0.0756371033,-0.0462140556,-0.005975105,0.0465987212
0.71,0.6652229763,-0.0806913459,0.7136039198,-0.0741224605,-0.0483809435,-0.0065688854,0.0488248497
0.72,0.6731790069,-0.0797226371,0.7236929978,-0.0725356395,-0.0505139908,-0.0071869976,0.0510227028
0.73,0.6811630559,-0.0787051416,0.7337707458,-0.0708768777,-0.0526076899,-0.0078282639,0.0531869416
0.74,0.6891809776,-0.0776376511,0.7438366905,-0.0691464222,-0.0546557129,-0.0084912289,0.0553113725
0.75,0.6972395546,-0.076518634,0.7538903637,-0.0673445297,-0.056650809,-0.0091741043,0.0573888348
0.76,0.7053466123,-0.0753461748,0.7639313027,-0.065471466,-0.0585846904,-0.0098747088,0.059411075
0.77,0.7135111446,-0.0741179113,0.7739590504,-0.0635275061,-0.0604479058,-0.0105904052,0.0613686076
0.78,0.7217434556,-0.0728309665,0.7839731556,-0.0615129336,-0.0622296999,-0.0113180329,0.0632505607
0.79,0.7300553158,-0.0714818808,0.7939731728,-0.0594280412,-0.063917857,-0.0120538396,0.0650445039
0.8,0.7384601385,-0.0700665414,0.8039586627,-0.0572731296,-0.0654985243,-0.0127934118,0.0667362575
0.81,0.746973181,-0.0685801121,0.8139291923,-0.0550485081,-0.0669560114,-0.0135316039,0.0683096755
0.82,0.7556117823,-0.0670169588,0.8238843348,-0.052754494,-0.0682725525,-0.0142624648,0.0697463929
0.83,0.7643956559,-0.0653705655,0.83382367,-0.0503914121,-0.069428014,-0.0149791534,0.0710255177
0.84,0.7733472705,-0.0636334272,0.843746784,-0.0479595952,-0.0703995135,-0.015673832,0.0721232314
0.85,0.7824923697,-0.061796896,0.8536532701,-0.0454593833,-0.0711609004,-0.0163375127,0.073012246
0.86,0.791860706,-0.0598509446,0.863542728,-0.0428911237,-0.071682022,-0.0169598209,0.0736610331
0.87,0.8014870975,-0.0577837933,0.8734147644,-0.0402551704,-0.071927667,-0.0175286229,0.0740327083
0.88,0.8114129551,-0.0555813245,0.8832689932,-0.0375518843,-0.0718560381,-0.0180294402,0.0740834052
0.89,0.8216884796,-0.0532261809,0.893105035,-0.0347816327,-0.0714165554,-0.0184445482,0.0737599197
0.9,0.832375786,-0.0506964111,0.9029225179,-0.0319447893,-0.0705467319,-0.0187516218,0.0729963335
0.91,0.8435532875,-0.0479634864,0.9127210772,-0.0290417336,-0.0691677897,-0.0189217528,0.0717092453
0.92,0.8553217504,-0.0449894663,0.9225003552,-0.026072851,-0.0671786048,-0.0189166152,0.0697911404
0.93,0.8678125346,-0.0417230356,0.9322600019,-0.0230385325,-0.0644474672,-0.018684503,0.0671013166
0.94,0.8811986395,-0.0380940755,0.9419996744,-0.0199391744,-0.0608010349,-0.0181549011,0.0634536545
0.95,0.8957093065,-0.0340063586,0.9517190375,-0.0167751781,-0.056009731,-0.0172311805,0.0586003716
0.96,0.9116490695,-0.0293278799,0.9614177633,-0.0135469498,-0.0497686938,-0.0157809301,0.052210733
0.97,0.9294223067,-0.0238782452,0.9710955315,-0.0102549005,-0.0416732248,-0.0136233448,0.0438435079
0.98,0.9495645229,-0.0174124397,0.9807520293,-0.0068994454,-0.0311875064,-0.0105129944,0.0329117548
0.99,0.9727817912,-0.0096001887,0.9903869513,-0.0034810041,-0.0176051601,-0.0061191846,0.0186382962
1,1,0,1,0,0,-0,0
