xi,s1,s2
0,-2.8933377674829e-26,-1.52190389060609e-26
0.01,0.00482840369509173,-0.0302911242147944
0.02,0.0085426536597878,-0.0531868450760358
0.03,0.011521410649338,-0.071212807016146
0.04,0.0140455422893626,-0.0862396996852464
0.05,0.0162981230758527,-0.0994832579511583
0.06,0.0183683704856469,-0.111530576836253
0.07,0.0202949421916814,-0.122629575822813
0.08,0.0221092332782397,-0.132978463158385
0.09,0.0238393123514295,-0.142752050792637
0.1,0.0255099215391829,-0.152101754377353
0.11,0.0271424553375706,-0.161155597256278
0.12,0.0287547279202572,-0.170018254353348
0.13,0.0303607404479568,-0.178771096060929
0.14,0.031970659914747,-0.187472192229658
0.15,0.0335908191480688,-0.19615631216844
0.16,0.0352238724496141,-0.204835896850901
0.17,0.0368705076450833,-0.213511753186339
0.18,0.0385311581339439,-0.22218374829068
0.19,0.0402061585303173,-0.230851781692926
0.2,0.0418957446629789,-0.239515785335158
0.21,0.0436000600057614,-0.248175721403807
0.22,0.0453192264119892,-0.25683155847365
0.23,0.0470534148489137,-0.265483247651813
0.24,0.0488028518281161,-0.274130720409038
0.25,0.0505678194055075,-0.282773888579687
0.26,0.0523486521775195,-0.291412645391865
0.27,0.0541457042391993,-0.300046876798777
0.28,0.055959316142305,-0.308676472810089
0.29,0.0577898118914962,-0.317301328522054
0.3,0.0596374989443341,-0.325921344117507
0.31,0.0615026698400691,-0.334536424274062
0.32,0.0633856201163096,-0.343146471654238
0.33,0.0652866662256897,-0.351751380395582
0.34,0.0672061471646576,-0.360351035518865
0.35,0.0691444244734754,-0.36894531292808
0.36,0.0711018814903757,-0.377534079646912
0.37,0.0730789151472813,-0.386117196419888
0.38,0.0750759277655257,-0.394694520313526
0.39,0.0770933263100091,-0.403265904952807
0.4,0.0791315223891987,-0.411831200521171
0.41,0.0811909328318951,-0.420390253542882
0.42,0.0832719860316656,-0.428942904489028
0.43,0.0853751282912776,-0.437488985383522
0.44,0.0875008243994649,-0.446028319585463
0.45,0.0896495576309282,-0.454560721789139
0.46,0.0918218295422601,-0.463085997995348
0.47,0.0940181577271263,-0.471603945195957
0.48,0.0962390735714468,-0.480114351058468
0.49,0.0984851220493214,-0.488616993897334
0.5,0.100756861723029,-0.497111642673964
0.51,0.103054865236975,-0.505598056850787
0.52,0.105379724751081,-0.514075984785977
0.53,0.107732057374188,-0.522545162128178
0.54,0.110112505657994,-0.531005311670568
0.55,0.112521737597056,-0.539456143350859
0.56,0.11496044640071,-0.54789735402571
0.57,0.117429347984139,-0.556328624989218
0.58,0.119929178459451,-0.564749619491419
0.59,0.122460693907593,-0.573159982512696
0.6,0.12502467037835,-0.581559340763778
0.61,0.127621904813666,-0.589947302549007
0.62,0.130253225204123,-0.598323456262286
0.63,0.132919500745427,-0.606687368883022
0.64,0.135621642761725,-0.615038585839394
0.65,0.138360604705604,-0.623376631008354
0.66,0.141137381570714,-0.631701005998374
0.67,0.143953003430576,-0.640011182259689
0.68,0.146808528977404,-0.648306593194532
0.69,0.149705044934722,-0.65658663343989
0.7,0.152643666057364,-0.664850658867499
0.71,0.155625536644699,-0.67309798687624
0.72,0.158651847186113,-0.681327899608524
0.73,0.161723851006488,-0.689539647166661
0.74,0.164842865779432,-0.697732447905262
0.75,0.168010273527271,-0.705905488431236
0.76,0.171227520954545,-0.714057920391235
0.77,0.174496123116366,-0.722188825133486
0.78,0.177817667086781,-0.730297178369631
0.79,0.181193812292265,-0.738381846962164
0.8,0.184626290511713,-0.746441588924436
0.81,0.18811690100192,-0.754475059455266
0.82,0.191667456877783,-0.762480877319716
0.83,0.195279731492507,-0.770457691229864
0.84,0.198955453563082,-0.778404185879416
0.85,0.202696307170278,-0.786319081943713
0.86,0.206504441611677,-0.794201955340326
0.87,0.210388079785003,-0.802062249095678
0.88,0.214367126571443,-0.809928285211658
0.89,0.218473678688682,-0.817848083926226
0.9,0.222752024690901,-0.82588936371341
0.91,0.227259046294479,-0.834139298488001
0.92,0.232068632960733,-0.842701846857171
0.93,0.23727609647865,-0.851695081372094
0.94,0.242998572290594,-0.861250945732637
0.95,0.249375019492304,-0.871515254787359
0.96,0.256584715143198,-0.882666124206657
0.97,0.265050691679727,-0.895116696887314
0.98,0.27564317432873,-0.90971786935706
0.99,0.289698075417731,-0.927776721447707
1,0.309016994374947,-0.951056516295154
