xi,sx,sy,cx,cy,ex,ey,ne
0,-9.62843761604091e-27,5.64127664972546e-26,0,0,-9.62843761604091e-27,5.64127664972546e-26,5.72285508710448e-26
0.01,0.0164751192579512,0.0208713973936503,0.00676010953189304,0.00742728055405826,0.00971500972605817,0.013444116839592,0.0165869132623887
0.02,0.0310080715403481,0.0401133275401016,0.0133460149247473,0.0150110150167915,0.0176620566156008,0.0251023125233101,0.0306932295125589
0.03,0.0438425351597735,0.057914879337568,0.0197632917862231,0.0227395174838962,0.0240792433735505,0.0351753618536717,0.042627644117162
0.04,0.0551986241589459,0.0744471339981041,0.0260175738242796,0.0306020582489961,0.0291810503346662,0.0438450757491081,0.0526680583093714
0.05,0.0652741425786997,0.089864124550278,0.0321144904426518,0.0385887943857518,0.033159652136048,0.0512753301645262,0.0610632623863554
0.06,0.0742458387259669,0.104303795341843,0.0380596173403265,0.0466907015635408,0.0361862213856404,0.0576130937783019,0.0680346323050106
0.07,0.0822706594417572,0.11788896154241,0.0438584380764561,0.0548995083326167,0.0384122213653011,0.0629894532097935,0.0737778419709174
0.08,0.0894870043691393,0.130728268646122,0.0495163147848011,0.063207633688002,0.0399706895843382,0.06752063495812,0.0784645918296605
0.09,0.0960159802212217,0.142917151974324,0.0550384664497492,0.071608128396785,0.0409775137714725,0.0713090235775389,0.0822443522588221
0.1,0.101962655049133,0.154538796178236,0.0604299533755307,0.0800946203319716,0.0415327016736027,0.0744441758462646,0.0852461179511305
0.11,0.107417312510005,0.165665094741628,0.065695666683434,0.0886612638806329,0.0417216458265708,0.0770038308609949,0.0875801672626088
0.12,0.112456706134949,0.176357609483488,0.0708403218546469,0.0973026933702929,0.0416163842803021,0.0790549161131952,0.0893398186825455
0.13,0.117145313597042,0.186668530060699,0.0758684554974384,0.106013980373317,0.0412768580996033,0.0806545496873821,0.0906031754402084
0.14,0.121536590979303,0.196641633470709,0.080784424657113,0.114790594694774,0.0407521663221901,0.0818510387759347,0.091434848983585
0.15,0.125674227042678,0.206313243554204,0.0855924081068245,0.123628368817135,0.0400818189358537,0.0826848747370681,0.0918876527042192
0.16,0.129593397494018,0.215713190497779,0.0902964091587965,0.132523465559206,0.0392969883352213,0.0831897249385733,0.0920042587469407
0.17,0.133322019254059,0.224865770336615,0.0949002596208221,0.141472348702255,0.038421759633237,0.0833934216343598,0.0918188128065286
0.18,0.136882004725407,0.233790704457145,0.0994076245941721,0.15047175633983,0.0374743801312351,0.0833189481173154,0.0913585041558595
0.19,0.140290516060515,0.242504099099733,0.103822007868215,0.159518676716626,0.0364685081922996,0.0829854223831074,0.0906450904234453
0.2,0.143561219429665,0.251019404861342,0.108146757715938,0.168610326334041,0.0354144617137273,0.0824090785273011,0.089696378534431
0.21,0.146705529299128,0.259348368567031,0.112385072934748,0.177744130114258,0.0343204563643799,0.0816042384527724,0.0885276536372463
0.22,0.14973359297395,0.267501786730834,0.116540009009889,0.186917703429835,0.0331935839640614,0.0805840833009993,0.0871527882390552
0.23,0.152654615812492,0.275489755358936,0.120614484304633,0.19612883582114,0.0320401315078595,0.0793609195377958,0.0855846106313829
0.24,0.155476926705596,0.283321721342224,0.124611286203282,0.205375476239043,0.0308656405023135,0.0779462451031808,0.0838349860696785
0.25,0.158208033565929,0.29100652621767,0.128533077150667,0.214655719664728,0.0296749564152616,0.0763508065529425,0.0819148869225401
0.26,0.16085467881733,0.298552449929711,0.132382400546093,0.223967794972171,0.0284722782712366,0.0745846549575394,0.0798344623899349
0.27,0.163422894884155,0.305967254591623,0.136161686461149,0.233310053911568,0.0272612084230059,0.0726572006800559,0.0776031075108753
0.28,0.165918059680621,0.313258228246911,0.139873257159914,0.242680961103758,0.0260448025207074,0.0705772671431533,0.0752295312742188
0.29,0.168344952100152,0.320432228630678,0.1435193324074,0.25207908494654,0.0248256196927518,0.0683531436841386,0.0727218237163621
0.3,0.170707807504723,0.327495726931011,0.147102034557794,0.261503089343582,0.0236057729469293,0.065992637587429,0.0700875219434082
0.31,0.173010373214206,0.334454851550358,0.15062339341856,0.270951726175641,0.0223869797956461,0.0635031253747166,0.0673336750573414
0.32,0.175255963995715,0.341315431866908,0.154085350889984,0.280423828441865,0.0211706131057307,0.060891603425043,0.0644669079989513
0.33,0.177447517552951,0.348083041995971,0.157489765382388,0.289918304006292,0.0199577521705627,0.0581647379896791,0.0614934843467958
0.34,0.179587650015546,0.354763044551358,0.160838416015296,0.299434129891249,0.0187492340002502,0.0553289146601086,0.0584193681330235
0.35,0.181678711428412,0.361360634406759,0.164133006604326,0.308970347065251,0.0175457048240862,0.0523902873415075,0.0552502847549195
0.36,0.18372284124108,0.367880882457124,0.167375169442651,0.318526055678343,0.0163476717984283,0.0493548267787817,0.0519917810773268
0.37,0.185722023797049,0.374328779380043,0.170566468884644,0.328100410702572,0.0151555549124055,0.0462283686774713,0.0486492848383525
0.38,0.187678143823133,0.380709279397123,0.173708404739758,0.337692617939578,0.0139697390833751,0.0430166614575458,0.045228163493676
0.39,0.1895930419188,0.387027344035371,0.176802415485018,0.347301930361072,0.0127906264337811,0.0397254136742987,0.0417337826725867
0.4,0.191468570045522,0.39328798588857,0.179849881304564,0.356927644751455,0.0116186887409581,0.0363603411371144,0.038171564490686
0.41,0.193306646420977,0.399496311913569,0.182852126964678,0.366569098624846,0.010454519456299,0.0329272132887226,0.0345470454890598
0.42,0.195109294939519,0.405657554634167,0.18581042453264,0.376225667391574,0.00929887040687896,0.0294318872425933,0.0308659193529799
0.43,0.196878645313195,0.411777072648901,0.188725995947534,0.385896761751629,0.00815264936566104,0.0258803108972713,0.0271340410521329
0.44,0.198616917739026,0.417860339046423,0.191600015450907,0.395581825294782,0.00701690228811955,0.0222785137516417,0.0233574205061926
0.45,0.200326406971155,0.423912929355804,0.194433611884915,0.405280332289045,0.00589279508624019,0.0186325970667583,0.0195422288232583
0.46,0.20200946639298,0.429940509496812,0.197227870865261,0.414991785640941,0.00478159552771865,0.0149487238558706,0.0156948399389664
0.47,0.203668492089304,0.435948823730215,0.199983836835951,0.424715715012602,0.00368465525335276,0.0112331087176128,0.0118219886566419
0.48,0.20530590691847,0.441943682608065,0.202702515012523,0.434451675082178,0.00260339190594716,0.00749200752588663,0.00793144540319689
0.49,0.206924144584509,0.447930950923994,0.205384873220131,0.444199243935302,0.00153927136437768,0.00373170698869224,0.00403670575874036
0.5,0.208525633709276,0.453916535663504,0.208031843632486,0.45395802157649,0.00049379007678968,-4.14859129853618e-05,0.00049552973766686
0.51,0.210112781904595,0.459906373954259,0.210644324417375,0.46372762855043,-0.000531542512780092,-0.003821254596171,0.0038580466730783
0.52,0.211687959844401,0.465906421016374,0.213223181294156,0.473507704664001,-0.00153522144975418,-0.0076012836476273,0.00775476743632403
0.53,0.21325348533688,0.471922638112713,0.215769249008313,0.483297907800733,-0.00251576367143308,-0.0113752696880206,0.011650142802803
0.54,0.21481160739661,0.477960980499173,0.218283332727898,0.493097912820143,-0.00347172533128742,-0.0151369323209701,0.0155299580445515
0.55,0.216364490316706,0.484027385374982,0.220766209366361,0.502907410535103,-0.00440171904965489,-0.0188800251601213,0.019386347790105
0.56,0.21791419774096,0.490127759832987,0.223218628836061,0.512726106760966,-0.00530443109510173,-0.0225983469279796,0.023212545597586
0.57,0.21946267673598,0.496267968809946,0.225641315236444,0.52255372143076,-0.00617863850046413,-0.0262857526208147,0.0270021548133123
0.58,0.221011741863337,0.502453823036821,0.228034967980676,0.532389987771253,-0.00702322611733883,-0.0299361647344322,0.0307489782611119
0.59,0.222563059251703,0.508691066989069,0.230400262864276,0.542234651535137,-0.00783720361257303,-0.0335435845460677,0.0344469711972492
0.6,0.224118130668993,0.514985366836933,0.232737853079076,0.552087470285003,-0.0086197224100823,-0.0371021034480697,0.0380902309614702
0.61,0.225678277950011,0.521342298921591,0.235048370175641,0.561948212725145,-0.00937009222562976,-0.0406059138035539,0.0416729992217798
0.62,0.227244636667129,0.527767351903541,0.237332424977094,0.571816658077551,-0.0100877883099649,-0.04404930617401,0.0451896542075544
0.63,0.228818173264079,0.534265963617457,0.239590608447104,0.581692595498785,-0.0107724351830251,-0.0474266318813278,0.0486346663541496
0.64,0.230399711432775,0.540843571599278,0.241823492514629,0.59157582353469,-0.011423781081854,-0.0507322519354123,0.052002539944163
0.65,0.231989958845648,0.547505664139155,0.244031630857862,0.601466149610145,-0.0120416720122135,-0.0539604854709893,0.0552877550377529
0.66,0.233589533887969,0.554257831334403,0.246215559649647,0.611363389551289,-0.0126260257616784,-0.0571055582168857,0.0584847100172061
0.67,0.23519899239018,0.561105816142445,0.248375798266543,0.621267367137884,-0.0131768058763625,-0.0601615509954394,0.061587664603232
0.68,0.236818854360225,0.56805556543376,0.250512849963522,0.631177913683632,-0.013693995603297,-0.0631223482498726,0.0645906832612979
0.69,0.238449630715874,0.575113281044834,0.252627202516227,0.641094867642467,-0.0141775718003536,-0.0659815865976335,0.0674875789467602
0.7,0.240091850017056,0.582285470831104,0.254719328832555,0.651018074238989,-0.0146274788154994,-0.0687326034078842,0.0702718571529413
0.71,0.241746085198186,0.589578999719912,0.25678968753524,0.660947385121348,-0.015043602337054,-0.0713683854014351,0.0729366602339536
0.72,0.243412980300496,0.597001140763445,0.258838723517022,0.670882658035024,-0.0154257432165266,-0.0738815172715789,0.0754747119778063
0.73,0.245093277204358,0.604559626191687,0.260866868469868,0.680823756516072,-0.0157735912655099,-0.0762641303243841,0.07787826240708
0.74,0.24678784236162,0.612262698465369,0.262874541389645,0.690770549602492,-0.0160866990280243,-0.0785078511371222,0.0801390327854459
0.75,0.248497693527931,0.620119161328913,0.264862149057554,0.70072291156252,-0.016364455529623,-0.0806037502336076,0.0822481608092412
0.76,0.25022402649507,0.62813843086338,0.266830086499557,0.710680721638693,-0.0166060600044867,-0.0825422907753129,0.0841961459646992
0.77,0.251968241823274,0.636330586539423,0.268778737424944,0.720643863806642,-0.0168104956016701,-0.0843132772672186,0.0859727950337352
0.78,0.253731971573569,0.644706422270229,0.270708474645158,0.730612226547648,-0.0169765030715886,-0.0859058042774196,0.0875671677347736
0.79,0.255517106040098,0.653277497464469,0.272619660473877,0.74058570263407,-0.0171025544337782,-0.0873082051696018,0.0889675224905001
0.8,0.25732582048245,0.662056188079246,0.27451264710934,0.750564188926789,-0.0171868266268895,-0.0885080008475428,0.0901612623221936
0.81,0.259160602969109,0.671055750600487,0.276387776999821,0.760547586183922,-0.0172271740307127,-0.0894918355834355,0.0911348679769556
0.82,0.261024311110078,0.680290722136805,0.278245383193117,0.770535798880078,-0.0172210720830396,-0.0902450767432735,0.0918734956344243
0.83,0.262920302123557,0.689778173724513,0.28008578967085,0.780528735035486,-0.0171654875472934,-0.0907505613109731,0.092359722503876
0.84,0.264852591791789,0.699539299746109,0.28190931166836,0.790526306054388,-0.0170567198765717,-0.0909870063082794,0.0925719558499803
0.85,0.266826014528028,0.7096010202762,0.283716255980904,0.800528426572109,-0.0168902414528757,-0.0909274062959089,0.0924828279846466
0.86,0.268846383443515,0.719997583427435,0.28550692125684,0.810535014310283,-0.0166605378133248,-0.0905374308828485,0.0920575901873159
0.87,0.270920650414442,0.730772167696431,0.287281598278446,0.82054598993973,-0.016360947864004,-0.0897738222432991,0.0912525055830256
0.88,0.273057066148924,0.741978484309701,0.289040570230971,0.830561276950514,-0.0159835040820472,-0.0885827926408129,0.0900132409970116
0.89,0.275265340253971,0.753682379569583,0.290784112960504,0.840580801528765,-0.0155187727065327,-0.0868984219591821,0.0882732578152244
0.9,0.277556801302456,0.765963437200166,0.292512495221186,0.850604492439848,-0.0149556939187301,-0.0846410552396824,0.0859522019070931
0.91,0.279944556900086,0.77891658069322,0.2942259789123,0.860632280917513,-0.0142814220122148,-0.0817157002242925,0.082954292702894
0.92,0.28244365375237,0.792653675654123,0.295924819305699,0.870664100558664,-0.0134811655533292,-0.07801042490454,0.0791667115551931
0.93,0.285071237731593,0.807305132147792,0.297609265264049,0.880699887223436,-0.0125380275324554,-0.0733947550756444,0.0744579895445643
0.94,0.287846713943783,0.823021507044603,0.29927955945031,0.890739578940257,-0.0114328455065266,-0.0677180718956533,0.0686763949085926
0.95,0.290791906795682,0.839975106366331,0.300935938528873,0.900783115815614,-0.0101440317331919,-0.0608080094492829,0.0616483202771015
0.96,0.293931220061714,0.858361587632069,0.302578633358736,0.910830439948264,-0.00864741329702279,-0.0524688523161948,0.0531766698854694
0.97,0.297291796950959,0.878401562204156,0.304207869179087,0.92088149534762,-0.00691607222812818,-0.0424799331434638,0.0430392469141577
0.98,0.300903680174121,0.900342197634112,0.305823865787647,0.930936227856105,-0.00492018561352642,-0.0305940302219927,0.0309871410700593
0.99,0.304799972010496,0.924458820008559,0.307426837712104,0.94099458507522,-0.00262686570160819,-0.0165357650666604,0.0167431164886969
1,0.309016994374947,0.951056516295154,0.309016994374947,0.951056516295154,5.55111512312578e-17,-1.11022302462516e-16,1.24126707662364e-16
