%!TEX root=../../../../../thesis.tex
%!TEX file=figures/caro-dynamics/named/ipanema-1_5/statics/residuals.tikz

\begin{tikzpicture}[%
  ]

\begin{axis}[%
    % General adjustments
    static residual iteration,%
    %
    % X-Axis
    xmode=log,%
    %
    % Y-Axis
    ymode=log,%
    ymax=1e4,%
    ytickten={-12,-9,-6,-3,0,3},%
  ]

\pgfmathsetmacro{\caropolydeg}{7}
\pgfmathsetmacro{\caronumsegment}{11}


% Residual threshold
\addplot+[%
    no markers,%
  ]%
  table[%
      x=k,%
      y=thresh,%
      col sep=comma,%
      unbounded coords=discard,%
    ]%
    {data/cdpr/named/statics/ipanema_1_5/degree-\caropolydeg/segment-\caronumsegment/residual.dat};
\addlegendentry{Threshold}


% Residual succession
\addplot+[%
  ]%
  table[%
      x=k,%
      y=t1,%
      col sep=comma,%
      unbounded coords=discard,%
    ]%
    {data/cdpr/named/statics/ipanema_1_5/degree-\caropolydeg/segment-\caronumsegment/residual.dat};
\addlegendentry{Statics residual $\norm{\residual_{\iterindex}}$}


\end{axis}

\end{tikzpicture}
