xi,s1,s2
0,3.06625935195703e-26,9.64377673418081e-27
0.01,0.0255373442200398,-0.00890201396280543
0.02,0.0487921155101313,-0.0167115292132232
0.03,0.0700413800231724,-0.0235683622139074
0.04,0.0895353901223103,-0.0295983230706997
0.05,0.107499020850326,-0.0349139816062756
0.06,0.124133206399019,-0.039615433433791
0.07,0.139616376578594,-0.0437910660305288
0.08,0.154105893287041,-0.0475183248115454
0.09,0.167739486979525,-0.0508644792033174
0.1,0.180636693137769,-0.0538873887173878
0.11,0.192900288739439,-0.0566362690240127
0.12,0.204617728727528,-0.059152458025808
0.13,0.215862582479741,-0.0614701819313956
0.14,0.226695970277882,-0.0636173213290502
0.15,0.237167999777233,-0.0656161772603457
0.16,0.247319202475948,-0.067484237293802
0.17,0.257181970184429,-0.0692349415985308
0.18,0.266781991494717,-0.0708784490178832
0.19,0.27613968824987,-0.0724224031430952
0.2,0.285271652013357,-0.0738726983869351
0.21,0.294192069037657,-0.0752342397129785
0.22,0.302913846212647,-0.0765115374112445
0.23,0.311448977962647,-0.0777088831453594
0.24,0.319808614123248,-0.0788303610460812
0.25,0.328003116317352,-0.0798798524604524
0.26,0.336042114331225,-0.0808610407009539
0.27,0.34393456249054,-0.0817774157946573
0.28,0.351688796036424,-0.0826322792323793
0.29,0.359312587501505,-0.083428748717834
0.3,0.366813203085956,-0.0841697629167865
0.31,0.374197459033545,-0.0848580862062066
0.32,0.381471778007678,-0.0854963134234213
0.33,0.38864224546745,-0.0860868746152685
0.34,0.395714666043685,-0.0866320397872501
0.35,0.402694619914987,-0.0871339236526856
0.36,0.409587519183786,-0.0875944903818648
0.37,0.416398664252382,-0.0880155583512015
0.38,0.423133300198995,-0.0883988048923866
0.39,0.429796673153808,-0.0887457710415414
0.4,0.436394086675014,-0.0890578662883706
0.41,0.442930957513247,-0.0893363732857399
0.42,0.449412855473966,-0.089582451530269
0.43,0.455845502913103,-0.0897971384308918
0.44,0.462234758330676,-0.0899813493484321
0.45,0.468586599352773,-0.090135877595604
0.46,0.474907105713544,-0.0902613944370117
0.47,0.481202442237194,-0.0903584490891494
0.48,0.487478841819967,-0.0904274687204017
0.49,0.493742588412136,-0.0904687584510433
0.5,0.5,-0.0904825013532388
0.51,0.506257411587863,-0.0904687584510433
0.52,0.512521158180033,-0.0904274687204017
0.53,0.518797557762806,-0.0903584490891494
0.54,0.525092894286455,-0.0902613944370117
0.55,0.531413400647227,-0.090135877595604
0.56,0.537765241669324,-0.0899813493484321
0.57,0.544154497086897,-0.0897971384308918
0.58,0.550587144526034,-0.089582451530269
0.59,0.557069042486752,-0.0893363732857399
0.6,0.563605913324986,-0.0890578662883706
0.61,0.570203326846192,-0.0887457710415414
0.62,0.576866699801005,-0.0883988048923866
0.63,0.583601335747617,-0.0880155583512015
0.64,0.590412480816214,-0.0875944903818648
0.65,0.597305380085013,-0.0871339236526856
0.66,0.604285333956315,-0.0866320397872501
0.67,0.61135775453255,-0.0860868746152685
0.68,0.618528221992322,-0.0854963134234213
0.69,0.625802540966455,-0.0848580862062066
0.7,0.633186796914044,-0.0841697629167866
0.71,0.640687412498495,-0.083428748717834
0.72,0.648311203963576,-0.0826322792323793
0.73,0.65606543750946,-0.0817774157946573
0.74,0.663957885668775,-0.0808610407009538
0.75,0.671996883682648,-0.0798798524604524
0.76,0.680191385876752,-0.0788303610460812
0.77,0.688551022037352,-0.0777088831453593
0.78,0.697086153787353,-0.0765115374112444
0.79,0.705807930962343,-0.0752342397129785
0.8,0.714728347986643,-0.0738726983869351
0.81,0.72386031175013,-0.0724224031430952
0.82,0.733218008505283,-0.0708784490178832
0.83,0.742818029815571,-0.0692349415985309
0.84,0.752680797524052,-0.067484237293802
0.85,0.762832000222767,-0.0656161772603458
0.86,0.773304029722118,-0.0636173213290502
0.87,0.784137417520259,-0.0614701819313956
0.88,0.795382271272472,-0.059152458025808
0.89,0.807099711260561,-0.0566362690240128
0.9,0.819363306862231,-0.0538873887173878
0.91,0.832260513020475,-0.0508644792033175
0.92,0.84589410671296,-0.0475183248115455
0.93,0.860383623421406,-0.0437910660305288
0.94,0.87586679360098,-0.039615433433791
0.95,0.892500979149674,-0.0349139816062756
0.96,0.91046460987769,-0.0295983230706998
0.97,0.929958619976828,-0.0235683622139074
0.98,0.951207884489869,-0.0167115292132232
0.99,0.97446265577996,-0.00890201396280544
1,1,9.82986314197457e-27
