xi,s1,s2
0,-5.64584941909532e-25,3.34826088926294e-26
0.01,-0.0407975163473489,0.0110436450443328
0.02,-0.0701134687681888,0.0199322762084689
0.03,-0.0930233072200968,0.0275411015356469
0.04,-0.1121782291772,0.0343564987042744
0.05,-0.128945105890969,0.0406485378579671
0.06,-0.144043574222729,0.0465704816334879
0.07,-0.15787961422896,0.0522134591270336
0.08,-0.170707894343835,0.0576351678659539
0.09,-0.182705379653062,0.0628745009890245
0.1,-0.194003558044091,0.0679590666385852
0.11,-0.20470353760507,0.0729093038869293
0.12,-0.214884600183813,0.0777409452120822
0.13,-0.224609954576261,0.0824665705160228
0.14,-0.233930836964527,0.0870965862222021
0.15,-0.242889445510752,0.0916398266352217
0.16,-0.25152104205222,0.0961039163062021
0.17,-0.259855468099281,0.100495490528827
0.18,-0.267918254483903,0.104820338574208
0.19,-0.275731450916582,0.109083509628054
0.2,-0.28331426149571,0.113289403562008
0.21,-0.290683542991325,0.117441856593572
0.22,-0.297854202609156,0.12154422450695
0.23,-0.304839519046181,0.125599462361528
0.24,-0.311651403090316,0.129610198446815
0.25,-0.318300609922005,0.13357880060094
0.26,-0.324796912930977,0.137507433935557
0.27,-0.331149247141813,0.141398109886941
0.28,-0.337365828861957,0.145252727156393
0.29,-0.34345425686733,0.149073105518534
0.3,-0.349421599311688,0.152861013696319
0.31,-0.355274469575568,0.156618192559933
0.32,-0.361019093448448,0.160346374836696
0.33,-0.366661369352945,0.164047302353978
0.34,-0.372206922761719,0.167722741610468
0.35,-0.377661155515767,0.171374498216198
0.36,-0.383029290416027,0.175004430491921
0.37,-0.388316411218255,0.178614462303996
0.38,-0.393527498003096,0.182206595050671
0.39,-0.398667457808388,0.185782918611468
0.4,-0.403741150388335,0.189345621017064
0.41,-0.408753408993265,0.192896996585035
0.42,-0.413709056133671,0.196439452289366
0.43,-0.418612914392082,0.199975512181177
0.44,-0.423469812465451,0.203507819746944
0.45,-0.42828458674818,0.207039138171
0.46,-0.433062078890966,0.210572348553614
0.47,-0.437807129882504,0.214110446216842
0.48,-0.442524571289768,0.217656535300603
0.49,-0.447219214351798,0.221213821906449
0.5,-0.451895837651108,0.224785606086092
0.51,-0.456559174088844,0.228375272997701
0.52,-0.461213897867968,0.231986283567779
0.53,-0.46586461214645,0.235622165002413
0.54,-0.470515837963127,0.239286501491284
0.55,-0.475172004965939,0.242982925443382
0.56,-0.479837444389012,0.246715109587379
0.57,-0.484516384635065,0.250486760264304
0.58,-0.489212949726108,0.254301612238146
0.59,-0.493931160791956,0.258163425353231
0.6,-0.498674940676307,0.262075983376899
0.61,-0.503448121658166,0.266043095381062
0.62,-0.508254456216556,0.270068600034456
0.63,-0.513097630713219,0.27415637319626
0.64,-0.517981281835728,0.278310339218718
0.65,-0.522909015636581,0.28253448637893
0.66,-0.527884429026817,0.286832886865554
0.67,-0.532911133639924,0.29120972174221
0.68,-0.537992782077674,0.295669311293408
0.69,-0.543133096688507,0.300216151128322
0.7,-0.548335901215083,0.304854954371976
0.71,-0.553605155882035,0.309590700221906
0.72,-0.558944996773823,0.314428689121738
0.73,-0.564359780668232,0.319374604846692
0.74,-0.569854136834889,0.324434583958552
0.75,-0.575433027671573,0.329615293418346
0.76,-0.58110182042542,0.33492401769284
0.77,-0.586866372622737,0.340368757505127
0.78,-0.592733134201427,0.345958343509126
0.79,-0.598709269695287,0.351702569661827
0.8,-0.604802804152378,0.357612352975615
0.81,-0.611022796810488,0.363699928733916
0.82,-0.617379547201402,0.369979093424829
0.83,-0.623884840221675,0.376465512319395
0.84,-0.63055224118443,0.383177115883012
0.85,-0.637397460479095,0.390134620246892
0.86,-0.644438821748791,0.397362222975403
0.87,-0.651697888983447,0.404888547539012
0.88,-0.659200338155586,0.41274793943553
0.89,-0.666977199530156,0.420982254988683
0.9,-0.675066649096013,0.429643331688752
0.91,-0.683516593953023,0.438796388759898
0.92,-0.692388406700542,0.44852472024222
0.93,-0.701762573824264,0.458936577471514
0.94,-0.711748565334357,0.4701772903515
0.95,-0.722505253902045,0.482455383547876
0.96,-0.734286215765684,0.49610286813166
0.97,-0.747537751298609,0.51170921524272
0.98,-0.763097989157419,0.530397930360711
0.99,-0.782574503168945,0.55435632908772
1,-0.809016994374947,0.587785252292473
