ns,d2,d3,d4,d5,d6,d7,d8,d9,d10
1,0.060758023213,0.051597267215,0.040173124775,0.035698294891,0.018852119959,0.016729684853,0.008869387922,0.00726343011,0.004501587192
2,0.031005249875,0.03115337407,0.031979190944,0.02801684361,0.026227886685,0.02346689761,0.02172956927,0.019964554099,0.018557845714
3,0.035465498463,0.043509783265,0.045750999741,0.04433710451,0.042371799588,0.039787902868,0.037475361416,0.035168853055,0.033125734654
4,0.034739350403,0.04776856373,0.053405578863,0.054581601061,0.053283703329,0.051415013266,0.049062120523,0.046758831798,0.044458267419
5,0.032261767636,0.047009268104,0.05599785861,0.059424196686,0.059967044636,0.058965694411,0.057302490383,0.055268360363,0.053144379778
10,0.020072084606,0.034564608297,0.046042165637,0.054659139846,0.060996969824,0.065496487278,0.06848905369,0.07025692575,0.071063558445
15,0.014288522821,0.026043365024,0.036014669151,0.044347723448,0.051287162486,0.057031900446,0.061745255504,0.065562631484,0.068597273291
20,0.011103003064,0.020735517696,0.029243917877,0.036700049293,0.043225500405,0.048926142416,0.053893101884,0.058204933683,0.061929606426
