n,w1,wr1,wd1,we1,wp1
1,0.414698109825683,0.373629516785091,0.104191687958865,0.0410685930405912,0.109917956680638
2,1.9003854788313,1.49451806714037,0.239103942833681,0.405867411690935,0.271570762919934
