xi,s1,s2
0,6.29503617247877e-27,-8.7118935367955e-27
0.01,0.0209315269085641,-0.00732808458985232
0.02,0.0404486468557295,-0.0139473513700218
0.03,0.0586875527121723,-0.0199312030735924
0.04,0.0757734853709065,-0.0253465948920875
0.05,0.0918213737252792,-0.0302544312207139
0.06,0.106936454659023,-0.0347099496692572
0.07,0.121214873048364,-0.0387630923386283
0.08,0.134744261776186,-0.0424588643630626
0.09,0.147604301758248,-0.0458376797179695
0.1,0.159867261981465,-0.0489356942934344
0.11,0.171598519554236,-0.0517851262333724
0.12,0.182857059768835,-0.0544145635403327
0.13,0.193695956175852,-0.0568492589459555
0.14,0.204162830670697,-0.0591114120470803
0.15,0.214300293592151,-0.0612204387075051
0.16,0.224146363832987,-0.0631932277253986
0.17,0.233734868962627,-0.0650443847663629
0.18,0.243095825361875,-0.0667864635621476
0.19,0.252255798369696,-0.0684301843750169
0.2,0.261238242442048,-0.0699846397277668
0.21,0.270063821322779,-0.0714574873993947
0.22,0.278750708226574,-0.0728551306864208
0.23,0.287314866033959,-0.07418288592986
0.24,0.295770307498361,-0.0754451373078471
0.25,0.304129335465229,-0.0766454788939117
0.26,0.312402763103199,-0.0777868439809066
0.27,0.320600114147329,-0.0788716216705862
0.28,0.328729803154382,-0.0799017607288374
0.29,0.336799295770165,-0.0808788607065622
0.3,0.344815249008927,-0.0818042503262112
0.31,0.352783631544814,-0.0826790531339694
0.32,0.360709824015372,-0.0835042404175929
0.33,0.368598699337118,-0.0842806713898984
0.34,0.376454683035596,-0.0850091206394255
0.35,0.384281794167881,-0.0856902932093724
0.36,0.392083672706311,-0.0863248309715283
0.37,0.399863603377331,-0.0869133165392452
0.38,0.407624539344587,-0.0874562768369274
0.39,0.415369125891986,-0.0879541864233286
0.4,0.423099724106752,-0.0884074705686775
0.41,0.430818434562481,-0.0888165080856341
0.42,0.438527121002201,-0.089181633914076
0.43,0.446227434021425,-0.0895031414597139
0.44,0.453920834751213,-0.0897812846865379
0.45,0.461608618541225,-0.0900162799630926
0.46,0.469291938642778,-0.0902083076625834
0.47,0.476971829891906,-0.0903575135168117
0.48,0.484649232392415,-0.0904640097239402
0.49,0.492325015198939,-0.0905278758100885
0.5,0.5,-0.0905491592447583
0.51,0.507674984801061,-0.0905278758100885
0.52,0.515350767607585,-0.0904640097239402
0.53,0.523028170108094,-0.0903575135168117
0.54,0.530708061357222,-0.0902083076625834
0.55,0.538391381458775,-0.0900162799630926
0.56,0.546079165248787,-0.0897812846865378
0.57,0.553772565978575,-0.0895031414597139
0.58,0.561472878997799,-0.0891816339140759
0.59,0.569181565437519,-0.0888165080856341
0.6,0.576900275893248,-0.0884074705686774
0.61,0.584630874108014,-0.0879541864233286
0.62,0.592375460655413,-0.0874562768369274
0.63,0.600136396622669,-0.0869133165392451
0.64,0.607916327293688,-0.0863248309715283
0.65,0.615718205832118,-0.0856902932093723
0.66,0.623545316964404,-0.0850091206394255
0.67,0.631401300662882,-0.0842806713898984
0.68,0.639290175984628,-0.0835042404175929
0.69,0.647216368455186,-0.0826790531339693
0.7,0.655184750991073,-0.0818042503262112
0.71,0.663200704229835,-0.0808788607065622
0.72,0.671270196845618,-0.0799017607288374
0.73,0.679399885852671,-0.0788716216705861
0.74,0.687597236896801,-0.0777868439809066
0.75,0.695870664534771,-0.0766454788939117
0.76,0.704229692501639,-0.075445137307847
0.77,0.712685133966041,-0.07418288592986
0.78,0.721249291773426,-0.0728551306864207
0.79,0.729936178677221,-0.0714574873993947
0.8,0.738761757557952,-0.0699846397277667
0.81,0.747744201630304,-0.0684301843750169
0.82,0.756904174638124,-0.0667864635621476
0.83,0.766265131037373,-0.0650443847663629
0.84,0.775853636167013,-0.0631932277253986
0.85,0.785699706407848,-0.0612204387075051
0.86,0.795837169329303,-0.0591114120470802
0.87,0.806304043824147,-0.0568492589459555
0.88,0.817142940231164,-0.0544145635403327
0.89,0.828401480445763,-0.0517851262333724
0.9,0.840132738018535,-0.0489356942934344
0.91,0.852395698241752,-0.0458376797179694
0.92,0.865255738223814,-0.0424588643630625
0.93,0.878785126951635,-0.0387630923386283
0.94,0.893063545340977,-0.0347099496692572
0.95,0.908178626274721,-0.0302544312207139
0.96,0.924226514629093,-0.0253465948920875
0.97,0.941312447287827,-0.0199312030735924
0.98,0.95955135314427,-0.0139473513700218
0.99,0.979068473091436,-0.00732808458985231
1,1,1.45886524851092e-27
