x1,y1,z1,x2,y2,z2,x3,y3,z3,x4,y4,z4,x5,y5,z5,x6,y6,z6,x7,y7,z7,x8,y8,z8
-8.544,5.463,3.202,8.184,5.692,3.236,8.224,-5.492,3.25,-8.491,-5.322,3.221,-8.192,5.648,-0.589,7.208,6.463,-0.548,7.869,-5.557,-0.527,-8.27,-5.545,-0.582
-8.2118,5.2741,3.0883,7.8658,5.4941,3.1209,7.9041,-5.3025,3.1342,-8.1609,-5.1392,3.1064,-7.8742,5.4557,-0.5337,6.9293,6.2387,-0.4943,7.5643,-5.3688,-0.4743,-7.9492,-5.3573,-0.5272
-7.9616,5.1318,3.0027,7.6261,5.3451,3.0343,7.6632,-5.1599,3.047,-7.9124,-5.0015,3.0201,-7.6349,5.3108,-0.492,6.7195,6.0699,-0.4538,7.3349,-5.227,-0.4347,-7.7077,-5.2159,-0.4859
-7.7621,5.0183,2.9345,7.435,5.2262,2.9652,7.4711,-5.0461,2.9774,-7.7142,-4.8917,2.9512,-7.4441,5.1953,-0.4588,6.5521,5.9352,-0.4216,7.152,-5.1139,-0.4031,-7.5151,-5.1031,-0.453
-7.5941,4.9228,2.877,7.274,5.1261,2.907,7.3093,-4.9503,2.9188,-7.5473,-4.7993,2.8933,-7.2834,5.098,-0.4308,6.4112,5.8218,-0.3944,6.9979,-5.0187,-0.3765,-7.3529,-5.0082,-0.4252
-7.4464,4.8388,2.8265,7.1325,5.0381,2.8558,7.1671,-4.866,2.8674,-7.4005,-4.718,2.8423,-7.1421,5.0125,-0.4062,6.2873,5.7221,-0.3705,6.8624,-4.935,-0.353,-7.2103,-4.9247,-0.4009
-7.3127,4.7628,2.7807,7.0045,4.9585,2.8095,7.0384,-4.7898,2.8207,-7.2677,-4.6444,2.7962,-7.0142,4.9351,-0.3839,6.1751,5.6318,-0.3489,6.7398,-4.8593,-0.3319,-7.0812,-4.8491,-0.3788
-7.1895,4.6927,2.7385,6.8864,4.885,2.7669,6.9197,-4.7195,2.7778,-7.1453,-4.5766,2.7537,-6.8963,4.8637,-0.3634,6.0717,5.5486,-0.329,6.6268,-4.7895,-0.3123,-6.9622,-4.7795,-0.3584
-7.0746,4.6273,2.6992,6.7763,4.8166,2.7271,6.8091,-4.654,2.7377,-7.0311,-4.5134,2.714,-6.7864,4.7972,-0.3442,5.9754,5.4711,-0.3104,6.5214,-4.7243,-0.2941,-6.8512,-4.7145,-0.3395
-6.9666,4.5659,2.6623,6.6728,4.7522,2.6896,6.7051,-4.5923,2.7001,-6.9238,-4.4539,2.6768,-6.683,4.7347,-0.3262,5.8847,5.3981,-0.293,6.4223,-4.6631,-0.277,-6.7469,-4.6535,-0.3216
-6.8643,4.5077,2.6273,6.5749,4.6913,2.6542,6.6066,-4.534,2.6644,-6.8222,-4.3977,2.6415,-6.5853,4.6755,-0.3092,5.799,5.3291,-0.2764,6.3286,-4.6052,-0.2608,-6.6482,-4.5957,-0.3048
-6.7671,4.4524,2.594,6.4817,4.6334,2.6205,6.513,-4.4786,2.6305,-6.7256,-4.3442,2.608,-6.4922,4.6192,-0.293,5.7174,5.2635,-0.2607,6.2394,-4.5501,-0.2454,-6.5543,-4.5408,-0.2887
-6.6741,4.3996,2.5622,6.3927,4.578,2.5883,6.4235,-4.4256,2.5981,-6.6332,-4.293,2.5759,-6.4033,4.5653,-0.2775,5.6394,5.2007,-0.2457,6.1541,-4.4974,-0.2306,-6.4646,-4.4882,-0.2734
-6.5849,4.3488,2.5317,6.3072,4.5249,2.5575,6.3376,-4.3747,2.567,-6.5446,-4.2439,2.5451,-6.318,4.5137,-0.2627,5.5646,5.1405,-0.2313,6.0723,-4.4469,-0.2165,-6.3784,-4.4378,-0.2587
-6.4991,4.3,2.5023,6.225,4.4737,2.5277,6.2549,-4.3257,2.5371,-6.4593,-4.1967,2.5155,-6.2359,4.464,-0.2484,5.4926,5.0826,-0.2174,5.9936,-4.3982,-0.2029,-6.2956,-4.3893,-0.2445
-6.4162,4.2529,2.474,6.1456,4.4244,2.499,6.1751,-4.2785,2.5082,-6.377,-4.1511,2.4869,-6.1566,4.416,-0.2346,5.4231,5.0266,-0.204,5.9176,-4.3513,-0.1898,-6.2156,-4.3425,-0.2308
-6.3361,4.2073,2.4466,6.0688,4.3766,2.4713,6.0979,-4.2327,2.4803,-6.2973,-4.107,2.4593,-6.0799,4.3696,-0.2212,5.3558,4.9725,-0.191,5.8441,-4.3058,-0.177,-6.1382,-4.2972,-0.2176
-6.2584,4.1631,2.42,5.9944,4.3303,2.4443,6.0231,-4.1884,2.4532,-6.2201,-4.0642,2.4324,-6.0056,4.3246,-0.2083,5.2906,4.9201,-0.1785,5.7728,-4.2618,-0.1647,-6.0631,-4.2532,-0.2048
-6.1829,4.1202,2.3941,5.9221,4.2853,2.4182,5.9504,-4.1454,2.4269,-6.1452,-4.0227,2.4064,-5.9334,4.2809,-0.1957,5.2273,4.8691,-0.1663,5.7036,-4.219,-0.1528,-5.9903,-4.2106,-0.1923
-6.1095,4.0784,2.369,5.8517,4.2416,2.3928,5.8797,-4.1035,2.4013,-6.0722,-3.9823,2.3811,-5.8632,4.2384,-0.1835,5.1657,4.8195,-0.1544,5.6363,-4.1774,-0.1411,-5.9194,-4.1691,-0.1802
-6.0379,4.0377,2.3446,5.7832,4.199,2.368,5.8108,-4.0627,2.3763,-6.0011,-3.9429,2.3564,-5.7947,4.197,-0.1715,5.1057,4.7713,-0.1428,5.5707,-4.1369,-0.1298,-5.8503,-4.1287,-0.1684
-5.9681,3.9981,2.3207,5.7164,4.1574,2.3438,5.7436,-4.0229,2.352,-5.9318,-3.9045,2.3323,-5.728,4.1566,-0.1599,5.0472,4.7242,-0.1315,5.5067,-4.0974,-0.1187,-5.7829,-4.0892,-0.1568
-5.9,3.9593,2.2973,5.651,4.1168,2.3202,5.678,-3.984,2.3282,-5.8641,-3.867,2.3088,-5.6628,4.1171,-0.1486,4.99,4.6781,-0.1205,5.4442,-4.0587,-0.1079,-5.7171,-4.0507,-0.1456
-5.8333,3.9213,2.2745,5.5872,4.0771,2.2971,5.6138,-3.946,2.305,-5.7978,-3.8303,2.2858,-5.599,4.0785,-0.1374,4.934,4.6331,-0.1097,5.383,-4.0209,-0.0973,-5.6527,-4.013,-0.1346
-5.768,3.8842,2.2522,5.5246,4.0381,2.2745,5.5509,-3.9087,2.2822,-5.7329,-3.7944,2.2633,-5.5365,4.0407,-0.1266,4.8793,4.589,-0.0992,5.3231,-3.9839,-0.087,-5.5896,-3.9761,-0.1238
-5.7039,3.8478,2.2303,5.4632,4,2.2523,5.4892,-3.8722,2.2599,-5.6693,-3.7591,2.2412,-5.4752,4.0036,-0.1159,4.8255,4.5458,-0.0888,5.2644,-3.9476,-0.0768,-5.5278,-3.9399,-0.1132
-5.641,3.812,2.2088,5.403,3.9625,2.2305,5.4287,-3.8363,2.238,-5.6068,-3.7245,2.2195,-5.4151,3.9672,-0.1054,4.7728,4.5033,-0.0786,5.2067,-3.912,-0.0669,-5.4671,-3.9044,-0.1029
-5.5792,3.7769,2.1876,5.3438,3.9257,2.2091,5.3691,-3.8011,2.2164,-5.5454,-3.6905,2.1981,-5.3559,3.9314,-0.0951,4.7209,4.4616,-0.0686,5.15,-3.877,-0.0571,-5.4074,-3.8694,-0.0927
-5.5184,3.7422,2.1668,5.2855,3.8894,2.1881,5.3105,-3.7664,2.1952,-5.4849,-3.657,2.1772,-5.2977,3.8961,-0.085,4.6699,4.4205,-0.0588,5.0942,-3.8425,-0.0474,-5.3486,-3.835,-0.0826
-5.4584,3.7081,2.1463,5.228,3.8537,2.1673,5.2528,-3.7322,2.1743,-5.4253,-3.624,2.1565,-5.2403,3.8614,-0.075,4.6196,4.38,-0.0491,5.0392,-3.8085,-0.0379,-5.2907,-3.8011,-0.0727
-5.3992,3.6745,2.126,5.1713,3.8184,2.1468,5.1958,-3.6984,2.1537,-5.3665,-3.5914,2.136,-5.1837,3.8271,-0.0651,4.5699,4.3401,-0.0395,4.9849,-3.7749,-0.0285,-5.2336,-3.7677,-0.0629
-5.3407,3.6412,2.106,5.1152,3.7836,2.1265,5.1394,-3.665,2.1333,-5.3084,-3.5592,2.1159,-5.1277,3.7933,-0.0554,4.5208,4.3006,-0.0301,4.9312,-3.7418,-0.0193,-5.1771,-3.7346,-0.0533
-5.2828,3.6083,2.0862,5.0598,3.7491,2.1065,5.0837,-3.632,2.1131,-5.2509,-3.5274,2.0959,-5.0724,3.7597,-0.0457,4.4722,4.2615,-0.0207,4.8781,-3.709,-0.0101,-5.1212,-3.7019,-0.0437
-5.2254,3.5756,2.0666,5.0048,3.7149,2.0866,5.0284,-3.5993,2.0931,-5.1938,-3.4958,2.0761,-5.0174,3.7265,-0.0362,4.4241,4.2227,-0.0114,4.8255,-3.6764,-0.001,-5.0657,-3.6694,-0.0342
-5.1684,3.5432,2.0471,4.9502,3.681,2.0669,4.9736,-3.5668,2.0732,-5.1372,-3.4644,2.0564,-4.963,3.6935,-0.0267,4.3763,4.1843,-0.0022,4.7733,-3.6442,0.008,-5.0107,-3.6373,-0.0248
-5.1118,3.511,2.0277,4.896,3.6472,2.0473,4.9191,-3.5345,2.0535,-5.081,-3.4333,2.0369,-4.9088,3.6608,-0.0173,4.3288,4.1461,0.0069,4.7214,-3.6121,0.017,-4.9561,-3.6053,-0.0155
-5.0555,3.479,2.0084,4.8421,3.6137,2.0278,4.8649,-3.5024,2.0339,-5.0251,-3.4023,2.0175,-4.855,3.6282,-0.0079,4.2816,4.1081,0.016,4.6697,-3.5802,0.0259,-4.9017,-3.5734,-0.0062
-4.9995,3.4471,1.9893,4.7884,3.5803,2.0084,4.8109,-3.4704,2.0143,-4.9694,-3.3714,1.9981,-4.8013,3.5957,0.0015,4.2346,4.0702,0.0251,4.6183,-3.5484,0.0348,-4.8476,-3.5418,0.003
-4.9436,3.4154,1.9701,4.7348,3.547,1.989,4.7571,-3.4386,1.9949,-4.9139,-3.3407,1.9789,-4.7479,3.5634,0.0108,4.1877,4.0325,0.0341,4.5671,-3.5168,0.0437,-4.7937,-3.5102,0.0123
-4.8879,3.3837,1.9511,4.6814,3.5138,1.9697,4.7034,-3.4068,1.9754,-4.8585,-3.31,1.9596,-4.6946,3.5311,0.0201,4.141,3.9949,0.0432,4.516,-3.4852,0.0525,-4.7399,-3.4787,0.0215
-4.8322,3.352,1.9321,4.6281,3.4807,1.9504,4.6498,-3.3751,1.956,-4.8032,-3.2794,1.9405,-4.6414,3.4989,0.0293,4.0943,3.9573,0.0521,4.4649,-3.4537,0.0613,-4.6861,-3.4472,0.0307
-4.7767,3.3204,1.913,4.5749,3.4476,1.9312,4.5963,-3.3434,1.9367,-4.748,-3.2488,1.9213,-4.5882,3.4667,0.0386,4.0477,3.9198,0.0611,4.414,-3.4222,0.0701,-4.6325,-3.4159,0.0398
-4.7212,3.2889,1.8941,4.5218,3.4145,1.912,4.5429,-3.3117,1.9173,-4.6929,-3.2183,1.9021,-4.5351,3.4346,0.0478,4.0011,3.8824,0.0701,4.3631,-3.3907,0.0789,-4.5789,-3.3845,0.049
-4.6657,3.2573,1.8751,4.4686,3.3815,1.8928,4.4895,-3.2801,1.898,-4.6378,-3.1878,1.883,-4.4821,3.4025,0.0571,3.9546,3.8449,0.0791,4.3122,-3.3593,0.0877,-4.5254,-3.3531,0.0581
-4.6103,3.2258,1.8561,4.4155,3.3484,1.8736,4.4361,-3.2485,1.8787,-4.5827,-3.1573,1.8639,-4.4291,3.3704,0.0663,3.9081,3.8075,0.088,4.2614,-3.3279,0.0965,-4.4718,-3.3218,0.0673
-4.5548,3.1943,1.8372,4.3624,3.3154,1.8544,4.3827,-3.2169,1.8593,-4.5277,-3.1268,1.8448,-4.376,3.3383,0.0755,3.8616,3.7701,0.097,4.2106,-3.2965,0.1053,-4.4183,-3.2905,0.0764
-4.4994,3.1628,1.8182,4.3093,3.2824,1.8352,4.3294,-3.1853,1.84,-4.4726,-3.0963,1.8257,-4.323,3.3062,0.0848,3.8151,3.7327,0.106,4.1597,-3.2651,0.1141,-4.3648,-3.2592,0.0856
-4.444,3.1312,1.7992,4.2563,3.2494,1.816,4.276,-3.1537,1.8207,-4.4175,-3.0658,1.8065,-4.27,3.2741,0.094,3.7687,3.6953,0.1149,4.1089,-3.2337,0.1229,-4.3113,-3.2279,0.0947
-4.3886,3.0997,1.7803,4.2032,3.2164,1.7968,4.2227,-3.1221,1.8014,-4.3625,-3.0353,1.7874,-4.217,3.242,0.1032,3.7222,3.6579,0.1239,4.0581,-3.2023,0.1317,-4.2578,-3.1965,0.1039
-4.3332,3.0682,1.7613,4.1501,3.1834,1.7776,4.1693,-3.0905,1.7821,-4.3074,-3.0048,1.7683,-4.164,3.2099,0.1125,3.6757,3.6205,0.1328,4.0073,-3.1709,0.1404,-4.2043,-3.1652,0.113
-4.2778,3.0367,1.7424,4.097,3.1504,1.7584,4.116,-3.0589,1.7628,-4.2524,-2.9743,1.7492,-4.111,3.1779,0.1217,3.6292,3.5831,0.1418,3.9565,-3.1395,0.1492,-4.1508,-3.1339,0.1222
-4.2224,3.0052,1.7234,4.0439,3.1174,1.7392,4.0626,-3.0273,1.7435,-4.1974,-2.9438,1.7301,-4.058,3.1458,0.1309,3.5827,3.5457,0.1508,3.9057,-3.1081,0.158,-4.0973,-3.1026,0.1313
-4.167,2.9737,1.7045,3.9909,3.0844,1.7201,4.0093,-2.9957,1.7241,-4.1423,-2.9133,1.711,-4.005,3.1137,0.1402,3.5363,3.5083,0.1597,3.8549,-3.0767,0.1668,-4.0438,-3.0713,0.1405
-4.1116,2.9422,1.6855,3.9378,3.0513,1.7009,3.9559,-2.9641,1.7048,-4.0873,-2.8828,1.6919,-3.952,3.0816,0.1494,3.4898,3.4709,0.1687,3.8041,-3.0453,0.1756,-3.9903,-3.04,0.1496
-4.0562,2.9107,1.6666,3.8847,3.0183,1.6817,3.9025,-2.9324,1.6855,-4.0322,-2.8524,1.6727,-3.899,3.0495,0.1586,3.4433,3.4335,0.1776,3.7532,-3.0139,0.1844,-3.9368,-3.0087,0.1588
-4.0007,2.8791,1.6476,3.8316,2.9853,1.6625,3.8492,-2.9008,1.6662,-3.9771,-2.8219,1.6536,-3.846,3.0175,0.1679,3.3968,3.3961,0.1866,3.7024,-2.9825,0.1931,-3.8833,-2.9773,0.1679
-3.9453,2.8476,1.6286,3.7785,2.9523,1.6433,3.7958,-2.8692,1.6469,-3.9221,-2.7913,1.6345,-3.793,2.9854,0.1771,3.3503,3.3586,0.1956,3.6516,-2.9511,0.2019,-3.8298,-2.946,0.1771
-3.8898,2.8161,1.6097,3.7254,2.9192,1.6241,3.7424,-2.8376,1.6275,-3.8669,-2.7608,1.6154,-3.7399,2.9532,0.1863,3.3038,3.3212,0.2045,3.6007,-2.9197,0.2107,-3.7762,-2.9147,0.1862
-3.8343,2.7845,1.5907,3.6722,2.8862,1.6049,3.6889,-2.8059,1.6082,-3.8118,-2.7303,1.5962,-3.6868,2.9211,0.1956,3.2572,3.2837,0.2135,3.5498,-2.8882,0.2195,-3.7227,-2.8833,0.1954
-3.7788,2.7529,1.5717,3.619,2.8531,1.5856,3.6355,-2.7743,1.5888,-3.7566,-2.6997,1.5771,-3.6337,2.8889,0.2048,3.2106,3.2462,0.2225,3.4989,-2.8567,0.2283,-3.669,-2.8519,0.2046
-3.7232,2.7213,1.5526,3.5657,2.8199,1.5664,3.5819,-2.7425,1.5694,-3.7013,-2.6691,1.5579,-3.5805,2.8567,0.2141,3.1639,3.2087,0.2315,3.4478,-2.8252,0.2371,-3.6153,-2.8205,0.2137
-3.6674,2.6896,1.5336,3.5123,2.7867,1.5471,3.5282,-2.7107,1.55,-3.646,-2.6384,1.5387,-3.5272,2.8245,0.2234,3.1172,3.171,0.2405,3.3967,-2.7936,0.246,-3.5615,-2.789,0.2229
-3.6116,2.6578,1.5145,3.4588,2.7534,1.5277,3.4744,-2.6789,1.5305,-3.5905,-2.6077,1.5194,-3.4737,2.7921,0.2327,3.0703,3.1333,0.2495,3.3455,-2.762,0.2548,-3.5076,-2.7574,0.2322
-3.5555,2.6259,1.4953,3.4051,2.7201,1.5083,3.4204,-2.6469,1.511,-3.5348,-2.5768,1.5,-3.4201,2.7597,0.242,3.0233,3.0955,0.2586,3.2941,-2.7302,0.2637,-3.4534,-2.7257,0.2414
-3.4992,2.5939,1.476,3.3511,2.6865,1.4888,3.3662,-2.6148,1.4914,-3.4788,-2.5459,1.4806,-3.3662,2.7271,0.2514,2.9761,3.0575,0.2677,3.2424,-2.6983,0.2726,-3.3991,-2.6939,0.2507
-3.4426,2.5617,1.4567,3.2969,2.6528,1.4692,3.3117,-2.5825,1.4716,-3.4226,-2.5147,1.4611,-3.3121,2.6943,0.2608,2.9286,3.0193,0.2769,3.1905,-2.6662,0.2816,-3.3444,-2.6619,0.2601
-3.3856,2.5293,1.4372,3.2423,2.6189,1.4495,3.2569,-2.55,1.4518,-3.366,-2.4834,1.4415,-3.2576,2.6613,0.2703,2.8808,2.9808,0.2861,3.1383,-2.6339,0.2907,-3.2894,-2.6297,0.2695
-3.3282,2.4967,1.4175,3.1873,2.5847,1.4296,3.2016,-2.5173,1.4318,-3.309,-2.4518,1.4217,-3.2027,2.6281,0.2799,2.8327,2.9421,0.2954,3.0857,-2.6014,0.2997,-3.234,-2.5973,0.2789
-3.2703,2.4637,1.3977,3.1319,2.5502,1.4095,3.1458,-2.4843,1.4116,-3.2514,-2.4199,1.4017,-3.1473,2.5945,0.2896,2.7841,2.903,0.3047,3.0326,-2.5686,0.3089,-3.1781,-2.5645,0.2885
-3.2118,2.4305,1.3777,3.0758,2.5153,1.3893,3.0895,-2.4509,1.3912,-3.1933,-2.3877,1.3815,-3.0913,2.5607,0.2993,2.735,2.8635,0.3142,2.9789,-2.5355,0.3182,-3.1216,-2.5315,0.2981
-3.1526,2.3968,1.3575,3.0191,2.48,1.3688,3.0325,-2.4171,1.3706,-3.1345,-2.3551,1.3611,-3.0347,2.5264,0.3092,2.6853,2.8235,0.3238,2.9246,-2.5019,0.3276,-3.0644,-2.498,0.3079
-3.0926,2.3627,1.3369,2.9616,2.4443,1.348,2.9747,-2.3829,1.3497,-3.0749,-2.3221,1.3404,-2.9773,2.4917,0.3192,2.635,2.783,0.3335,2.8696,-2.4679,0.3371,-3.0065,-2.4641,0.3178
-3.0318,2.3281,1.3161,2.9034,2.4081,1.3269,2.9162,-2.3482,1.3285,-3.0145,-2.2886,1.3194,-2.9191,2.4564,0.3293,2.584,2.742,0.3433,2.8138,-2.4334,0.3467,-2.9478,-2.4297,0.3279
-2.97,2.2929,1.295,2.8441,2.3712,1.3055,2.8566,-2.313,1.3069,-2.953,-2.2546,1.2981,-2.86,2.4206,0.3396,2.5321,2.7002,0.3533,2.7571,-2.3984,0.3565,-2.8881,-2.3948,0.3381
-2.9071,2.2572,1.2735,2.7839,2.3338,1.2838,2.7961,-2.2771,1.285,-2.8906,-2.22,1.2764,-2.7998,2.3842,0.3501,2.4794,2.6578,0.3635,2.6994,-2.3628,0.3665,-2.8274,-2.3593,0.3485
-2.843,2.2207,1.2516,2.7225,2.2956,1.2616,2.7344,-2.2406,1.2627,-2.8269,-2.1848,1.2543,-2.7386,2.3472,0.3607,2.4257,2.6146,0.3738,2.6407,-2.3265,0.3767,-2.7655,-2.3231,0.359
-2.7777,2.1836,1.2292,2.66,2.2567,1.239,2.6715,-2.2033,1.2399,-2.762,-2.1488,1.2318,-2.6761,2.3093,0.3716,2.3709,2.5705,0.3844,2.5808,-2.2895,0.387,-2.7025,-2.2861,0.3698
-2.711,2.1457,1.2064,2.5961,2.217,1.2159,2.6073,-2.1653,1.2167,-2.6958,-2.1121,1.2088,-2.6123,2.2707,0.3827,2.3149,2.5254,0.3952,2.5196,-2.2517,0.3976,-2.6381,-2.2485,0.3808
-2.6429,2.1069,1.1831,2.5308,2.1763,1.1923,2.5416,-2.1264,1.1929,-2.628,-2.0746,1.1852,-2.5471,2.2312,0.3941,2.2577,2.4794,0.4062,2.4571,-2.213,0.4084,-2.5723,-2.2099,0.3921
-2.5731,2.0672,1.1592,2.4639,2.1348,1.1681,2.4744,-2.0866,1.1686,-2.5587,-2.0362,1.1612,-2.4803,2.1908,0.4057,2.1992,2.4323,0.4175,2.3931,-2.1735,0.4195,-2.5049,-2.1705,0.4036
-2.5015,2.0265,1.1347,2.3954,2.0921,1.1433,2.4055,-2.0458,1.1436,-2.4876,-1.9968,1.1365,-2.4119,2.1494,0.4177,2.1392,2.384,0.429,2.3275,-2.133,0.4308,-2.4358,-2.1301,0.4154
-2.4281,1.9847,1.1096,2.325,2.0484,1.1179,2.3349,-2.0039,1.118,-2.4147,-1.9564,1.1112,-2.3417,2.1069,0.4299,2.0776,2.3345,0.4409,2.2602,-2.0914,0.4425,-2.3649,-2.0886,0.4275
-2.3526,1.9418,1.0838,2.2527,2.0034,1.0918,2.2622,-1.9609,1.0917,-2.3397,-1.9149,1.0851,-2.2695,2.0632,0.4425,2.0143,2.2835,0.4531,2.191,-2.0486,0.4544,-2.2921,-2.0459,0.44
-2.2749,1.8976,1.0572,2.1783,1.9571,1.0648,2.1873,-1.9166,1.0646,-2.2625,-1.8721,1.0583,-2.1951,2.0182,0.4554,1.9491,2.2311,0.4657,2.1197,-2.0046,0.4667,-2.217,-2.002,0.4528
-2.1948,1.852,1.0298,2.1015,1.9094,1.0371,2.1102,-1.8708,1.0367,-2.1828,-1.828,1.0307,-2.1185,1.9718,0.4688,1.8818,2.1769,0.4787,2.0462,-1.9591,0.4794,-2.1396,-1.9567,0.4661
-2.1119,1.8049,1.0015,2.0221,1.86,1.0084,2.0304,-1.8236,1.0078,-2.1005,-1.7824,1.0021,-2.0392,1.9238,0.4826,1.8123,2.121,0.4921,1.9702,-1.9122,0.4926,-2.0596,-1.9099,0.4797
-2.0261,1.7561,0.9721,1.9399,1.8089,0.9787,1.9477,-1.7746,0.9779,-2.0152,-1.7352,0.9725,-1.9571,1.8741,0.4969,1.7403,2.063,0.5059,1.8915,-1.8635,0.5062,-1.9767,-1.8613,0.4939
-1.9369,1.7054,0.9416,1.8544,1.7557,0.9478,1.8618,-1.7237,0.9468,-1.9266,-1.6861,0.9417,-1.8718,1.8225,0.5117,1.6655,2.0028,0.5204,1.8097,-1.813,0.5203,-1.8906,-1.8109,0.5086
-1.8439,1.6525,0.9098,1.7654,1.7004,0.9156,1.7723,-1.6707,0.9144,-1.8342,-1.6349,0.9097,-1.7828,1.7687,0.5272,1.5875,1.9401,0.5354,1.7244,-1.7603,0.5351,-1.8009,-1.7584,0.524
-1.7466,1.5972,0.8765,1.6722,1.6424,0.8819,1.6786,-1.6153,0.8805,-1.7376,-1.5814,0.8761,-1.6898,1.7123,0.5434,1.5059,1.8744,0.5511,1.6352,-1.7052,0.5505,-1.7069,-1.7034,0.54
-1.6444,1.539,0.8416,1.5743,1.5815,0.8465,1.5802,-1.557,0.8449,-1.636,-1.5252,0.8409,-1.592,1.6532,0.5605,1.4202,1.8054,0.5677,1.5415,-1.6473,0.5667,-1.6082,-1.6457,0.5569
-1.5364,1.4776,0.8046,1.4708,1.5172,0.8091,1.4762,-1.4953,0.8072,-1.5287,-1.4657,0.8036,-1.4887,1.5906,0.5785,1.3296,1.7325,0.5851,1.4424,-1.5861,0.5838,-1.5039,-1.5846,0.5748
-1.4215,1.4122,0.7653,1.3607,1.4487,0.7693,1.3655,-1.4298,0.7672,-1.4145,-1.4025,0.764,-1.3788,1.5241,0.5976,1.2332,1.6549,0.6037,1.337,-1.5209,0.602,-1.393,-1.5197,0.5937
-1.2982,1.3422,0.7231,1.2426,1.3753,0.7266,1.2469,-1.3595,0.7242,-1.2921,-1.3347,0.7215,-1.2609,1.4527,0.6182,1.1298,1.5717,0.6236,1.224,-1.4511,0.6216,-1.274,-1.45,0.6141
-1.1645,1.2661,0.6774,1.1145,1.2956,0.6804,1.1181,-1.2833,0.6776,-1.1593,-1.2611,0.6753,-1.133,1.3753,0.6404,1.0176,1.4815,0.6453,1.1014,-1.3754,0.6428,-1.1449,-1.3745,0.6361
-1.0168,1.1821,0.6269,0.973,1.2076,0.6292,0.9759,-1.199,0.6262,-1.0125,-1.1798,0.6244,-0.9917,1.2898,0.6651,0.8937,1.3818,0.6692,0.9659,-1.2917,0.6662,-1.0023,-1.291,0.6605
-0.8488,1.0866,0.5694,0.8121,1.1075,0.571,0.8141,-1.1032,0.5676,-0.8456,-1.0874,0.5665,-0.831,1.1925,0.6931,0.7528,1.2684,0.6963,0.8119,-1.1965,0.6928,-0.8401,-1.196,0.6883
-0.6493,0.9731,0.5012,0.621,0.9887,0.502,0.622,-0.9894,0.4981,-0.6474,-0.9776,0.4976,-0.6401,1.077,0.7263,0.5854,1.1337,0.7286,0.6289,-1.0834,0.7245,-0.6475,-1.0833,0.7212
-0.3992,0.8308,0.4156,0.3813,0.8396,0.4153,0.3811,-0.8467,0.4109,-0.3988,-0.8399,0.4114,-0.4009,0.9322,0.768,0.3756,0.9648,0.7691,0.3995,-0.9417,0.7641,-0.4059,-0.9419,0.7625
-0.0669,0.6419,0.302,0.0631,0.6417,0.3003,0.0612,-0.6573,0.2951,-0.0688,-0.6571,0.2968,-0.0831,0.7398,0.8234,0.0969,0.7406,0.8228,0.0948,-0.7534,0.8168,-0.0852,-0.7542,0.8174
