x,y,z,u,v,w
-0.635750209903435,-0.340585091128477,0.123333751683567,0.659815916554421,-0.718413034835789,-0.220285423120735
-0.635750209903435,-0.340585091128477,0.123333751683567,0.557458440771972,0.66456410600974,-0.497588822036384
-0.635750209903435,-0.340585091128477,0.123333751683567,0.503868081022733,0.205517056181493,0.838975384945805
