x1,y1,z1,x2,y2,z2,x3,y3,z3,x4,y4,z4,x5,y5,z5,x6,y6,z6,x7,y7,z7,x8,y8,z8
-8.544,5.463,3.202,8.184,5.692,3.236,8.224,-5.492,3.25,-8.491,-5.322,3.221,-8.192,5.648,-0.589,7.208,6.463,-0.548,7.869,-5.557,-0.527,-8.27,-5.545,-0.582
-8.2118,5.274,3.0845,7.8658,5.4941,3.1171,7.9041,-5.3026,3.1304,-8.1609,-5.1392,3.1026,-7.8742,5.4556,-0.5375,6.9293,6.2387,-0.4981,7.5643,-5.3688,-0.4781,-7.9493,-5.3573,-0.531
-7.9616,5.1317,2.996,7.6261,5.345,3.0276,7.6632,-5.1599,3.0403,-7.9124,-5.0016,3.0134,-7.6349,5.3108,-0.4987,6.7195,6.0698,-0.4606,7.3349,-5.227,-0.4413,-7.7077,-5.2159,-0.4925
-7.7621,5.0183,2.9255,7.435,5.2261,2.9562,7.4711,-5.0462,2.9685,-7.7142,-4.8918,2.9423,-7.4441,5.1953,-0.4678,6.5521,5.9351,-0.4306,7.1519,-5.114,-0.412,-7.5151,-5.1032,-0.4619
-7.5941,4.9227,2.866,7.2741,5.126,2.8961,7.3094,-4.9504,2.908,-7.5473,-4.7994,2.8824,-7.2834,5.098,-0.4417,6.4112,5.8217,-0.4054,6.9978,-5.0188,-0.3873,-7.3529,-5.0082,-0.4361
-7.4464,4.8387,2.8138,7.1326,5.038,2.8432,7.1671,-4.8661,2.8548,-7.4005,-4.7181,2.8298,-7.1421,5.0124,-0.4188,6.2873,5.722,-0.3832,6.8624,-4.9351,-0.3656,-7.2103,-4.9248,-0.4134
-7.3127,4.7626,2.7665,7.0045,4.9583,2.7954,7.0384,-4.7899,2.8067,-7.2677,-4.6446,2.7821,-7.0142,4.935,-0.3981,6.1751,5.6317,-0.3631,6.7398,-4.8594,-0.3459,-7.0812,-4.8492,-0.3928
-7.1895,4.6925,2.7229,6.8865,4.8849,2.7513,6.9197,-4.7196,2.7623,-7.1453,-4.5768,2.7382,-6.8963,4.8637,-0.379,6.0717,5.5485,-0.3446,6.6267,-4.7895,-0.3278,-6.9622,-4.7796,-0.3739
-7.0746,4.6272,2.6823,6.7764,4.8164,2.7101,6.8091,-4.6541,2.721,-7.0311,-4.5135,2.6972,-6.7864,4.7971,-0.3612,5.9753,5.471,-0.3273,6.5214,-4.7244,-0.3109,-6.8513,-4.7146,-0.3563
-6.9665,4.5657,2.6441,6.6729,4.7521,2.6715,6.7051,-4.5925,2.6821,-6.9238,-4.4541,2.6587,-6.6831,4.7346,-0.3444,5.8847,5.398,-0.3111,6.4223,-4.6632,-0.295,-6.747,-4.6536,-0.3397
-6.8643,4.5076,2.6079,6.575,4.6912,2.6349,6.6066,-4.5342,2.6453,-6.8222,-4.3979,2.6223,-6.5853,4.6754,-0.3286,5.799,5.329,-0.2958,6.3285,-4.6053,-0.2799,-6.6483,-4.5958,-0.324
-6.767,4.4523,2.5735,6.4818,4.6332,2.6001,6.513,-4.4788,2.6102,-6.7256,-4.3444,2.5876,-6.4922,4.6191,-0.3135,5.7174,5.2634,-0.2812,6.2393,-4.5502,-0.2656,-6.5544,-4.5409,-0.309
-6.6741,4.3994,2.5407,6.3927,4.5778,2.5668,6.4235,-4.4257,2.5768,-6.6332,-4.2932,2.5545,-6.4033,4.5652,-0.2991,5.6394,5.2006,-0.2672,6.1541,-4.4975,-0.252,-6.4646,-4.4883,-0.2947
-6.5849,4.3486,2.5091,6.3073,4.5247,2.5349,6.3376,-4.3749,2.5447,-6.5446,-4.2441,2.5227,-6.318,4.5136,-0.2853,5.5646,5.1404,-0.2538,6.0723,-4.447,-0.2388,-6.3785,-4.4379,-0.281
-6.499,4.2998,2.4788,6.2251,4.4735,2.5042,6.2549,-4.3259,2.5138,-6.4593,-4.1969,2.4921,-6.2359,4.4639,-0.2719,5.4926,5.0824,-0.2409,5.9935,-4.3983,-0.2262,-6.2956,-4.3894,-0.2678
-6.4162,4.2527,2.4495,6.1457,4.4241,2.4745,6.1751,-4.2787,2.4839,-6.377,-4.1513,2.4626,-6.1566,4.4159,-0.2591,5.423,5.0265,-0.2285,5.9175,-4.3514,-0.214,-6.2156,-4.3426,-0.2551
-6.336,4.2071,2.4211,6.0689,4.3764,2.4459,6.0979,-4.233,2.4551,-6.2973,-4.1072,2.434,-6.0799,4.3695,-0.2467,5.3558,4.9724,-0.2164,5.844,-4.306,-0.2022,-6.1382,-4.2973,-0.2428
-6.2583,4.1629,2.3936,5.9945,4.3301,2.418,6.0231,-4.1887,2.4271,-6.2201,-4.0644,2.4063,-6.0056,4.3245,-0.2346,5.2906,4.9199,-0.2048,5.7728,-4.262,-0.1908,-6.0632,-4.2534,-0.2309
-6.1828,4.1199,2.3669,5.9222,4.2851,2.391,5.9504,-4.1456,2.3999,-6.1451,-4.0229,2.3794,-5.9334,4.2808,-0.2229,5.2273,4.869,-0.1934,5.7035,-4.2192,-0.1797,-5.9903,-4.2107,-0.2193
-6.1094,4.0782,2.341,5.8518,4.2414,2.3648,5.8798,-4.1038,2.3735,-6.0722,-3.9825,2.3533,-5.8632,4.2382,-0.2115,5.1657,4.8194,-0.1824,5.6362,-4.1776,-0.1689,-5.9195,-4.1692,-0.208
-6.0379,4.0375,2.3157,5.7833,4.1987,2.3392,5.8109,-4.063,2.3477,-6.0011,-3.9432,2.3278,-5.7948,4.1968,-0.2004,5.1057,4.7711,-0.1717,5.5706,-4.1371,-0.1584,-5.8504,-4.1288,-0.197
-5.9681,3.9978,2.291,5.7164,4.1572,2.3142,5.7437,-4.0232,2.3226,-5.9318,-3.9048,2.3029,-5.728,4.1564,-0.1896,5.0472,4.724,-0.1612,5.5066,-4.0975,-0.1481,-5.783,-4.0894,-0.1863
-5.8999,3.959,2.2669,5.6511,4.1165,2.2898,5.678,-3.9843,2.2981,-5.8641,-3.8673,2.2786,-5.6628,4.1169,-0.179,4.99,4.678,-0.1509,5.4441,-4.0589,-0.1381,-5.7172,-4.0509,-0.1758
-5.8332,3.9211,2.2433,5.5872,4.0768,2.2659,5.6138,-3.9463,2.2741,-5.7978,-3.8306,2.2548,-5.599,4.0783,-0.1687,4.934,4.6329,-0.1409,5.3829,-4.0211,-0.1283,-5.6528,-4.0132,-0.1655
-5.7679,3.8839,2.2202,5.5247,4.0379,2.2426,5.5509,-3.909,2.2505,-5.7329,-3.7946,2.2315,-5.5365,4.0405,-0.1586,4.8792,4.5888,-0.1311,5.323,-3.9841,-0.1187,-5.5897,-3.9763,-0.1555
-5.7038,3.8475,2.1976,5.4633,3.9997,2.2196,5.4892,-3.8725,2.2275,-5.6693,-3.7594,2.2087,-5.4752,4.0034,-0.1486,4.8255,4.5456,-0.1215,5.2643,-3.9478,-0.1092,-5.5279,-3.9401,-0.1457
-5.6409,3.8117,2.1753,5.4031,3.9622,2.1971,5.4287,-3.8366,2.2048,-5.6068,-3.7248,2.1863,-5.4151,3.967,-0.1389,4.7727,4.5031,-0.1121,5.2066,-3.9122,-0.1,-5.4672,-3.9045,-0.136
-5.5791,3.7766,2.1535,5.3439,3.9254,2.175,5.3692,-3.8014,2.1826,-5.5454,-3.6908,2.1643,-5.356,3.9312,-0.1293,4.7209,4.4614,-0.1028,5.1499,-3.8771,-0.0909,-5.4075,-3.8696,-0.1265
-5.5183,3.7419,2.1319,5.2856,3.8891,2.1532,5.3106,-3.7667,2.1607,-5.4849,-3.6573,2.1426,-5.2978,3.896,-0.1199,4.6698,4.4203,-0.0936,5.0941,-3.8427,-0.0819,-5.3487,-3.8352,-0.1172
-5.4583,3.7078,2.1107,5.2281,3.8534,2.1318,5.2528,-3.7325,2.1391,-5.4253,-3.6243,2.1212,-5.2404,3.8612,-0.1106,4.6195,4.3798,-0.0846,5.0391,-3.8087,-0.0731,-5.2908,-3.8013,-0.1079
-5.3991,3.6742,2.0898,5.1714,3.8181,2.1106,5.1958,-3.6987,2.1178,-5.3665,-3.5917,2.1001,-5.1838,3.827,-0.1014,4.5699,4.3399,-0.0757,4.9848,-3.7751,-0.0644,-5.2337,-3.7679,-0.0988
-5.3406,3.6409,2.0691,5.1154,3.7833,2.0897,5.1395,-3.6654,2.0967,-5.3084,-3.5595,2.0793,-5.1278,3.7931,-0.0923,4.5208,4.3004,-0.0669,4.9311,-3.742,-0.0558,-5.1772,-3.7348,-0.0899
-5.2827,3.6079,2.0486,5.0599,3.7488,2.0689,5.0837,-3.6324,2.0759,-5.2508,-3.5277,2.0586,-5.0724,3.7595,-0.0833,4.4722,4.2613,-0.0583,4.878,-3.7092,-0.0473,-5.1213,-3.7021,-0.081
-5.2253,3.5753,2.0283,5.0049,3.7146,2.0484,5.0284,-3.5996,2.0552,-5.1938,-3.4961,2.0382,-5.0175,3.7263,-0.0744,4.4241,4.2225,-0.0496,4.8254,-3.6767,-0.0388,-5.0659,-3.6696,-0.0721
-5.1683,3.5429,2.0082,4.9503,3.6806,2.028,4.9736,-3.5671,2.0347,-5.1372,-3.4648,2.0179,-4.963,3.6933,-0.0656,4.3763,4.1841,-0.0411,4.7731,-3.6444,-0.0305,-5.0109,-3.6375,-0.0634
-5.1117,3.5107,1.9882,4.8961,3.6469,2.0078,4.9191,-3.5349,2.0143,-5.081,-3.4336,1.9977,-4.9089,3.6605,-0.0568,4.3288,4.1459,-0.0326,4.7212,-3.6123,-0.0221,-4.9562,-3.6055,-0.0547
-5.0554,3.4787,1.9683,4.8422,3.6134,1.9876,4.8649,-3.5028,1.9941,-5.0251,-3.4026,1.9776,-4.855,3.6279,-0.0481,4.2816,4.1079,-0.0241,4.6696,-3.5804,-0.0138,-4.9019,-3.5737,-0.046
-4.9994,3.4468,1.9484,4.7885,3.5799,1.9676,4.8109,-3.4708,1.9739,-4.9694,-3.3718,1.9577,-4.8014,3.5955,-0.0394,4.2345,4.07,-0.0157,4.6182,-3.5487,-0.0056,-4.8477,-3.542,-0.0374
-4.9435,3.415,1.9287,4.735,3.5467,1.9476,4.7571,-3.4389,1.9538,-4.9139,-3.3411,1.9377,-4.7479,3.5631,-0.0307,4.1877,4.0323,-0.0073,4.5669,-3.517,0.0026,-4.7938,-3.5104,-0.0288
-4.8877,3.3833,1.909,4.6816,3.5134,1.9276,4.7034,-3.4072,1.9337,-4.8585,-3.3104,1.9179,-4.6946,3.5309,-0.0221,4.1409,3.9947,0.0011,4.5158,-3.4854,0.0108,-4.74,-3.4789,-0.0203
-4.8321,3.3517,1.8893,4.6283,3.4803,1.9077,4.6499,-3.3754,1.9137,-4.8032,-3.2798,1.8981,-4.6414,3.4986,-0.0135,4.0943,3.9571,0.0094,4.4648,-3.4539,0.019,-4.6863,-3.4475,-0.0117
-4.7766,3.3201,1.8696,4.5751,3.4472,1.8878,4.5964,-3.3438,1.8937,-4.748,-3.2492,1.8783,-4.5883,3.4665,-0.0049,4.0476,3.9196,0.0178,4.4139,-3.4224,0.0272,-4.6326,-3.4161,-0.0032
-4.7211,3.2885,1.85,4.5219,3.4141,1.868,4.5429,-3.3121,1.8737,-4.6929,-3.2187,1.8585,-4.5352,3.4343,0.0038,4.0011,3.8821,0.0261,4.363,-3.391,0.0353,-4.5791,-3.3847,0.0053
-4.6656,3.2569,1.8304,4.4688,3.3811,1.8481,4.4895,-3.2805,1.8537,-4.6378,-3.1882,1.8387,-4.4821,3.4022,0.0124,3.9546,3.8447,0.0344,4.3121,-3.3596,0.0435,-4.5255,-3.3534,0.0139
-4.6102,3.2254,1.8108,4.4157,3.348,1.8283,4.4362,-3.2489,1.8338,-4.5827,-3.1577,1.819,-4.4291,3.3701,0.021,3.9081,3.8073,0.0428,4.2612,-3.3282,0.0517,-4.472,-3.3221,0.0224
-4.5547,3.1939,1.7912,4.3626,3.315,1.8085,4.3828,-3.2173,1.8138,-4.5276,-3.1272,1.7992,-4.3761,3.338,0.0295,3.8616,3.7698,0.0511,4.2104,-3.2967,0.0598,-4.4185,-3.2907,0.0309
-4.4993,3.1624,1.7716,4.3095,3.282,1.7886,4.3294,-3.1857,1.7939,-4.4726,-3.0967,1.7794,-4.3231,3.3059,0.0381,3.8151,3.7324,0.0594,4.1596,-3.2654,0.068,-4.365,-3.2594,0.0394
-4.4439,3.1308,1.752,4.2564,3.249,1.7688,4.2761,-3.1541,1.7739,-4.4175,-3.0662,1.7597,-4.2701,3.2739,0.0467,3.7686,3.695,0.0677,4.1088,-3.234,0.0761,-4.3115,-3.2281,0.0479
-4.3885,3.0993,1.7324,4.2033,3.216,1.749,4.2227,-3.1225,1.754,-4.3625,-3.0357,1.74,-4.2171,3.2418,0.0553,3.7221,3.6576,0.076,4.058,-3.2026,0.0843,-4.258,-3.1968,0.0564
-4.3331,3.0678,1.7128,4.1502,3.183,1.7292,4.1694,-3.0909,1.734,-4.3074,-3.0052,1.7202,-4.1641,3.2097,0.0639,3.6756,3.6202,0.0844,4.0071,-3.1712,0.0924,-4.2045,-3.1655,0.065
-4.2777,3.0363,1.6932,4.0972,3.1499,1.7093,4.116,-3.0593,1.7141,-4.2524,-2.9748,1.7005,-4.1111,3.1776,0.0725,3.6292,3.5828,0.0927,3.9563,-3.1398,0.1006,-4.151,-3.1342,0.0735
-4.2223,3.0048,1.6736,4.0441,3.1169,1.6895,4.0627,-3.0277,1.6941,-4.1973,-2.9443,1.6807,-4.0581,3.1455,0.0811,3.5827,3.5454,0.101,3.9055,-3.1084,0.1087,-4.0975,-3.1029,0.082
-4.1669,2.9733,1.6541,3.991,3.0839,1.6697,4.0093,-2.9961,1.6742,-4.1423,-2.9138,1.661,-4.0051,3.1134,0.0897,3.5362,3.508,0.1093,3.8547,-3.077,0.1169,-4.044,-3.0716,0.0905
-4.1115,2.9417,1.6345,3.9379,3.0509,1.6499,3.956,-2.9645,1.6542,-4.0872,-2.8833,1.6412,-3.9521,3.0814,0.0983,3.4897,3.4706,0.1177,3.8039,-3.0456,0.125,-3.9905,-3.0402,0.099
-4.056,2.9102,1.6149,3.8848,3.0179,1.63,3.9026,-2.9329,1.6343,-4.0322,-2.8528,1.6215,-3.8991,3.0493,0.1069,3.4432,3.4332,0.126,3.7531,-3.0142,0.1332,-3.937,-3.0089,0.1075
-4.0006,2.8787,1.5953,3.8317,2.9849,1.6102,3.8492,-2.9013,1.6143,-3.9771,-2.8223,1.6017,-3.846,3.0172,0.1155,3.3967,3.3958,0.1343,3.7022,-2.9828,0.1413,-3.8835,-2.9776,0.116
-3.9452,2.8472,1.5757,3.7786,2.9518,1.5904,3.7958,-2.8697,1.5944,-3.922,-2.7918,1.582,-3.793,2.9851,0.1241,3.3502,3.3583,0.1426,3.6514,-2.9514,0.1495,-3.83,-2.9463,0.1246
-3.8897,2.8156,1.556,3.7255,2.9188,1.5705,3.7424,-2.8381,1.5744,-3.8669,-2.7613,1.5622,-3.74,2.953,0.1327,3.3037,3.3209,0.151,3.6005,-2.92,0.1577,-3.7764,-2.9149,0.1331
-3.8342,2.784,1.5364,3.6723,2.8857,1.5507,3.689,-2.8064,1.5544,-3.8118,-2.7308,1.5424,-3.6869,2.9208,0.1413,3.2572,3.2834,0.1593,3.5496,-2.8885,0.1658,-3.7228,-2.8836,0.1416
-3.7787,2.7524,1.5168,3.6191,2.8526,1.5308,3.6355,-2.7747,1.5344,-3.7566,-2.7002,1.5226,-3.6337,2.8886,0.1499,3.2106,3.2459,0.1676,3.4987,-2.857,0.174,-3.6692,-2.8522,0.1501
-3.723,2.7208,1.4971,3.5658,2.8195,1.5109,3.5819,-2.743,1.5144,-3.7013,-2.6696,1.5028,-3.5805,2.8564,0.1585,3.1639,3.2084,0.176,3.4477,-2.8255,0.1822,-3.6155,-2.8208,0.1587
-3.6673,2.6891,1.4774,3.5124,2.7862,1.4909,3.5283,-2.7112,1.4944,-3.6459,-2.6389,1.4829,-3.5272,2.8242,0.1672,3.1171,3.1707,0.1844,3.3965,-2.7939,0.1904,-3.5617,-2.7893,0.1673
-3.6114,2.6573,1.4576,3.4589,2.753,1.4709,3.4745,-2.6794,1.4742,-3.5904,-2.6082,1.463,-3.4738,2.7918,0.1758,3.0703,3.133,0.1928,3.3453,-2.7623,0.1986,-3.5077,-2.7577,0.1758
-3.5553,2.6254,1.4378,3.4052,2.7195,1.4509,3.4205,-2.6474,1.4541,-3.5347,-2.5773,1.4431,-3.4201,2.7593,0.1845,3.0232,3.0952,0.2012,3.2939,-2.7305,0.2068,-3.4536,-2.726,0.1845
-3.499,2.5934,1.4179,3.3513,2.686,1.4307,3.3663,-2.6153,1.4338,-3.4788,-2.5464,1.423,-3.3663,2.7267,0.1933,2.976,3.0572,0.2096,3.2422,-2.6986,0.2151,-3.3993,-2.6942,0.1931
-3.4424,2.5612,1.3979,3.2971,2.6523,1.4105,3.3118,-2.583,1.4134,-3.4226,-2.5152,1.4028,-3.3121,2.694,0.202,2.9285,3.0189,0.2181,3.1903,-2.6666,0.2235,-3.3446,-2.6622,0.2018
-3.3855,2.5288,1.3778,3.2425,2.6183,1.3901,3.2569,-2.5506,1.3929,-3.366,-2.4839,1.3825,-3.2577,2.661,0.2109,2.8808,2.9805,0.2267,3.1381,-2.6343,0.2318,-3.2896,-2.63,0.2106
-3.3281,2.4962,1.3575,3.1875,2.5841,1.3696,3.2017,-2.5178,1.3723,-3.3089,-2.4523,1.3621,-3.2028,2.6278,0.2198,2.8326,2.9417,0.2353,3.0855,-2.6018,0.2403,-3.2342,-2.5976,0.2194
-3.2702,2.4632,1.337,3.132,2.5496,1.3489,3.1459,-2.4848,1.3514,-3.2514,-2.4204,1.3414,-3.1474,2.5942,0.2288,2.784,2.9026,0.244,3.0324,-2.569,0.2488,-3.1783,-2.5649,0.2283
-3.2117,2.4299,1.3163,3.076,2.5148,1.3279,3.0896,-2.4514,1.3304,-3.1933,-2.3883,1.3206,-3.0914,2.5603,0.2378,2.7349,2.8631,0.2528,2.9787,-2.5358,0.2574,-3.1218,-2.5318,0.2373
-3.1525,2.3963,1.2954,3.0193,2.4795,1.3067,3.0326,-2.4177,1.309,-3.1345,-2.3557,1.2995,-3.0348,2.5261,0.247,2.6853,2.8232,0.2617,2.9244,-2.5023,0.2661,-3.0646,-2.4983,0.2464
-3.0925,2.3621,1.2742,2.9618,2.4438,1.2853,2.9748,-2.3835,1.2875,-3.0749,-2.3227,1.2781,-2.9774,2.4913,0.2563,2.635,2.7827,0.2707,2.8694,-2.4683,0.2749,-3.0067,-2.4645,0.2556
-3.0316,2.3275,1.2526,2.9035,2.4075,1.2635,2.9162,-2.3488,1.2656,-3.0144,-2.2892,1.2564,-2.9192,2.4561,0.2658,2.5839,2.7416,0.2798,2.8136,-2.4338,0.2839,-2.948,-2.4301,0.2649
-2.9698,2.2924,1.2308,2.8443,2.3707,1.2414,2.8567,-2.3135,1.2433,-2.953,-2.2552,1.2344,-2.8601,2.4203,0.2754,2.5321,2.6999,0.2891,2.7569,-2.3988,0.293,-2.8883,-2.3951,0.2744
-2.9069,2.2566,1.2086,2.7841,2.3332,1.2189,2.7961,-2.2777,1.2207,-2.8905,-2.2206,1.212,-2.7999,2.3839,0.2851,2.4793,2.6574,0.2986,2.6992,-2.3631,0.3023,-2.8276,-2.3596,0.2841
-2.8429,2.2202,1.1859,2.7227,2.295,1.196,2.7345,-2.2412,1.1976,-2.8269,-2.1854,1.1892,-2.7386,2.3468,0.295,2.4256,2.6142,0.3082,2.6405,-2.3269,0.3117,-2.7658,-2.3234,0.2939
-2.7776,2.183,1.1628,2.6602,2.2561,1.1726,2.6716,-2.2039,1.1741,-2.762,-2.1494,1.1659,-2.6762,2.309,0.3052,2.3708,2.5701,0.318,2.5806,-2.2898,0.3213,-2.7027,-2.2865,0.304
-2.7109,2.1451,1.1392,2.5963,2.2164,1.1487,2.6073,-2.1659,1.1501,-2.6957,-2.1127,1.1421,-2.6124,2.2704,0.3155,2.3148,2.5251,0.328,2.5194,-2.2521,0.3311,-2.6383,-2.2488,0.3142
-2.6427,2.1063,1.1151,2.5309,2.1757,1.1244,2.5417,-2.127,1.1256,-2.628,-2.0752,1.1178,-2.5472,2.2309,0.3261,2.2577,2.479,0.3383,2.4569,-2.2134,0.3411,-2.5725,-2.2103,0.3247
-2.5729,2.0666,1.0904,2.4641,2.1342,1.0994,2.4745,-2.0872,1.1004,-2.5586,-2.0368,1.093,-2.4804,2.1905,0.3369,2.1991,2.4319,0.3488,2.3929,-2.1739,0.3514,-2.5051,-2.1708,0.3354
-2.5014,2.0259,1.0652,2.3956,2.0915,1.0738,2.4056,-2.0464,1.0747,-2.4876,-1.9975,1.0675,-2.412,2.149,0.348,2.1391,2.3836,0.3595,2.3273,-2.1334,0.3619,-2.436,-2.1304,0.3464
-2.4279,1.9841,1.0392,2.3252,2.0478,1.0475,2.3349,-2.0045,1.0483,-2.4146,-1.9571,1.0413,-2.3417,2.1065,0.3594,2.0775,2.3341,0.3705,2.2599,-2.0918,0.3727,-2.3651,-2.0889,0.3577
-2.3525,1.9412,1.0125,2.2529,2.0028,1.0205,2.2622,-1.9615,1.0211,-2.3396,-1.9155,1.0144,-2.2695,2.0628,0.3711,2.0142,2.2831,0.3819,2.1907,-2.049,0.3838,-2.2923,-2.0463,0.3693
-2.2747,1.897,0.985,2.1785,1.9565,0.9927,2.1874,-1.9172,0.9931,-2.2624,-1.8728,0.9867,-2.1952,2.0178,0.3832,1.949,2.2306,0.3935,2.1195,-2.005,0.3953,-2.2173,-2.0024,0.3813
-2.1946,1.8514,0.9567,2.1017,1.9087,0.964,2.1102,-1.8715,0.9643,-2.1828,-1.8287,0.9582,-2.1185,1.9714,0.3956,1.8818,2.1765,0.4056,2.0459,-1.9596,0.4071,-2.1399,-1.9571,0.3936
-2.1117,1.8043,0.9274,2.0223,1.8594,0.9344,2.0304,-1.8242,0.9344,-2.1005,-1.7831,0.9286,-2.0393,1.9234,0.4084,1.8123,2.1206,0.418,1.9699,-1.9126,0.4193,-2.0599,-1.9103,0.4063
-2.0259,1.7554,0.897,1.9401,1.8082,0.9037,1.9478,-1.7753,0.9035,-2.0152,-1.7358,0.898,-1.9571,1.8737,0.4218,1.7402,2.0626,0.4309,1.8912,-1.864,0.4319,-1.977,-1.8617,0.4195
-1.9367,1.7047,0.8655,1.8546,1.7551,0.8718,1.8619,-1.7244,0.8714,-1.9266,-1.6868,0.8663,-1.8718,1.8221,0.4356,1.6654,2.0024,0.4443,1.8094,-1.8134,0.445,-1.8909,-1.8113,0.4332
-1.8437,1.6518,0.8326,1.7656,1.6997,0.8385,1.7724,-1.6714,0.838,-1.8342,-1.6356,0.8331,-1.7829,1.7682,0.45,1.5874,1.9397,0.4583,1.7242,-1.7608,0.4587,-1.8011,-1.7588,0.4475
-1.7464,1.5965,0.7982,1.6724,1.6417,0.8037,1.6787,-1.616,0.803,-1.7376,-1.5821,0.7985,-1.6899,1.7119,0.4651,1.5059,1.874,0.4729,1.635,-1.7056,0.473,-1.7072,-1.7038,0.4624
-1.6442,1.5384,0.7621,1.5745,1.5808,0.7671,1.5803,-1.5577,0.7662,-1.636,-1.5259,0.7621,-1.5921,1.6527,0.481,1.4201,1.805,0.4883,1.5412,-1.6477,0.4881,-1.6085,-1.6461,0.4782
-1.5362,1.4769,0.7239,1.471,1.5164,0.7285,1.4763,-1.4961,0.7273,-1.5287,-1.4664,0.7236,-1.4888,1.5902,0.4977,1.3295,1.732,0.5045,1.4421,-1.5865,0.5039,-1.5042,-1.585,0.4948
-1.4213,1.4115,0.6833,1.3609,1.448,0.6874,1.3656,-1.4305,0.6859,-1.4145,-1.4032,0.6826,-1.3788,1.5236,0.5156,1.2331,1.6545,0.5218,1.3367,-1.5214,0.5209,-1.3933,-1.5201,0.5124
-1.298,1.3414,0.6397,1.2429,1.3745,0.6433,1.2469,-1.3603,0.6416,-1.292,-1.3354,0.6387,-1.261,1.4523,0.5347,1.1297,1.5713,0.5403,1.2237,-1.4516,0.539,-1.2743,-1.4505,0.5314
-1.1643,1.2654,0.5924,1.1148,1.2949,0.5955,1.1182,-1.284,0.5934,-1.1592,-1.2618,0.5911,-1.1331,1.3749,0.5554,1.0176,1.481,0.5604,1.1011,-1.3758,0.5587,-1.1452,-1.3749,0.5519
-1.0166,1.1814,0.5402,0.9733,1.2069,0.5426,0.976,-1.1998,0.5403,-1.0125,-1.1806,0.5384,-0.9918,1.2893,0.5783,0.8937,1.3813,0.5825,0.9657,-1.2922,0.5804,-1.0026,-1.2915,0.5746
-0.8486,1.0858,0.4808,0.8123,1.1067,0.4825,0.8142,-1.104,0.4798,-0.8455,-1.0881,0.4786,-0.8311,1.1921,0.6044,0.7527,1.2679,0.6078,0.8116,-1.197,0.6051,-0.8404,-1.1965,0.6004
-0.6491,0.9723,0.4103,0.6212,0.9879,0.4111,0.6221,-0.9902,0.408,-0.6473,-0.9784,0.4075,-0.6402,1.0765,0.6353,0.5854,1.1332,0.6378,0.6286,-1.0839,0.6345,-0.6478,-1.0838,0.6311
-0.3989,0.83,0.3219,0.3816,0.8388,0.3217,0.3812,-0.8476,0.318,-0.3988,-0.8407,0.3184,-0.4009,0.9317,0.6742,0.3755,0.9643,0.6754,0.3992,-0.9422,0.6713,-0.4062,-0.9424,0.6696
-0.0667,0.641,0.2044,0.0633,0.6409,0.2028,0.0613,-0.6581,0.1984,-0.0687,-0.6579,0.2,-0.0832,0.7393,0.7257,0.0968,0.74,0.7253,0.0945,-0.754,0.7202,-0.0855,-0.7547,0.7206
