xi,sx,sy,cx,cy,ex,ey,ne
0,0,-0,0,0,0,-0,0
0.01,-0.0109444405,-0.0139468208,-0.0062957136,-0.0080763615,-0.0046487269,-0.0058704593,0.0074881876
0.02,-0.0211663271,-0.0268257627,-0.0126226144,-0.0161267721,-0.0085437128,-0.0106989905,0.0136917284
0.03,-0.030763061,-0.0387799932,-0.0189809215,-0.0241508581,-0.0117821395,-0.0146291351,0.0187837803
0.04,-0.0398209537,-0.0499354806,-0.0253708542,-0.0321482392,-0.0144500995,-0.0177872413,0.0229170532
0.05,-0.048416313,-0.060402744,-0.0317926324,-0.0401185287,-0.0166236806,-0.0202842153,0.0262258679
0.06,-0.0566164398,-0.0702784584,-0.0382464758,-0.0480613332,-0.018369964,-0.0222171252,0.0288280459
0.07,-0.0644805434,-0.0796469225,-0.0447326044,-0.0559762524,-0.019747939,-0.0236706701,0.0308266397
0.08,-0.0720605795,-0.0885814006,-0.0512512381,-0.0638628794,-0.0208093414,-0.0247185211,0.0323115146
0.09,-0.0794020165,-0.097145344,-0.0578025968,-0.0717208001,-0.0215994198,-0.0254245439,0.0333607909
0.1,-0.0865445345,-0.1053935032,-0.0643869001,-0.0795495934,-0.0221576345,-0.0258439099,0.0340421568
0.11,-0.0935226617,-0.1133729359,-0.0710043675,-0.0873488309,-0.0225182942,-0.026024105,0.0344140613
0.12,-0.1003663525,-0.1211239197,-0.077655218,-0.0951180771,-0.0227111345,-0.0260058426,0.0345267936
0.13,-0.1071015118,-0.1286807763,-0.0843396702,-0.102856889,-0.0227618416,-0.0258238873,0.0344234598
0.14,-0.113750469,-0.1360726136,-0.0910579421,-0.1105648161,-0.0226925269,-0.0255077975,0.0341408627
0.15,-0.1203324057,-0.1433239915,-0.0978102509,-0.1182414002,-0.0225221548,-0.0250825913,0.0337102929
0.16,-0.1268637406,-0.1504555191,-0.1045968132,-0.1258861755,-0.0222669274,-0.0245693436,0.0331582373
0.17,-0.1333584747,-0.1574843862,-0.1114178444,-0.1334986683,-0.0219406303,-0.0239857179,0.0325070134
0.18,-0.1398285008,-0.1644248375,-0.118273559,-0.1410783971,-0.0215549419,-0.0233464404,0.0317753332
0.19,-0.1462838795,-0.171288592,-0.1251641702,-0.1486248723,-0.0211197093,-0.0226637197,0.0309788042
0.2,-0.1527330841,-0.1780852136,-0.13208989,-0.156137596,-0.0206431941,-0.0219476176,0.0301303731
0.21,-0.1591832192,-0.1848224376,-0.1390509287,-0.1636160623,-0.0201322905,-0.0212063752,0.029240716
0.22,-0.1656402125,-0.1915064554,-0.1460474951,-0.171059757,-0.0195927173,-0.0204466984,0.0283185813
0.23,-0.1721089846,-0.1981421646,-0.1530797962,-0.1784681573,-0.0190291884,-0.0196740073,0.0273710901
0.24,-0.1785935981,-0.204733384,-0.160148037,-0.1858407319,-0.0184455611,-0.0188926522,0.0264039965
0.25,-0.1850973872,-0.2112830407,-0.1672524202,-0.1931769409,-0.017844967,-0.0181060998,0.0254219137
0.26,-0.1916230715,-0.2177933298,-0.1743931465,-0.2004762358,-0.017229925,-0.017317094,0.0244285091
0.27,-0.1981728541,-0.2242658508,-0.181570414,-0.2077380592,-0.0166024401,-0.0165277915,0.0234266709
0.28,-0.2047485064,-0.2307017235,-0.1887844179,-0.2149618449,-0.0159640885,-0.0157398786,0.0224186507
0.29,-0.2113514411,-0.2371016849,-0.1960353508,-0.2221470176,-0.0153160904,-0.0149546674,0.0214061837
0.3,-0.217982775,-0.2434661706,-0.203323402,-0.229292993,-0.014659373,-0.0141731776,0.0203905905
0.31,-0.2246433816,-0.2497953813,-0.2106487578,-0.2363991779,-0.0139946237,-0.0133962033,0.0193728614
0.32,-0.2313339363,-0.2560893378,-0.2180116007,-0.2434649696,-0.0133223356,-0.0126243682,0.0183537271
0.33,-0.2380549548,-0.2623479255,-0.2254121097,-0.2504897564,-0.0126428452,-0.0118581692,0.017333716
0.34,-0.2448068245,-0.2685709295,-0.2328504595,-0.257472917,-0.011956365,-0.0110980125,0.0163132016
0.35,-0.2515898311,-0.2747580623,-0.240326821,-0.264413821,-0.0112630101,-0.0103442413,0.0152924401
0.36,-0.2584041808,-0.2809089851,-0.2478413603,-0.2713118285,-0.0105628205,-0.0095971566,0.0142716009
0.37,-0.2652500187,-0.287023324,-0.2553942392,-0.2781662901,-0.0098557795,-0.0088570338,0.0132507901
0.38,-0.2721274431,-0.2931006815,-0.2629856141,-0.2849765469,-0.009141829,-0.0081241346,0.0122300695
0.39,-0.2790365183,-0.2991406448,-0.2706156364,-0.2917419304,-0.0084208819,-0.0073987144,0.0112094704
0.4,-0.2859772846,-0.3051427912,-0.2782844521,-0.2984617627,-0.0076928326,-0.0066810285,0.0101890046
0.41,-0.2929497658,-0.311106691,-0.2859922011,-0.3051353562,-0.0069575647,-0.0059713348,0.009168672
0.42,-0.299953976,-0.3170319091,-0.2937390175,-0.3117620137,-0.0062149585,-0.0052698953,0.0081484665
0.43,-0.3069899248,-0.3229180051,-0.3015250288,-0.3183410286,-0.005464896,-0.0045769765,0.00712838
0.44,-0.3140576211,-0.3287645327,-0.309350356,-0.3248716843,-0.0047072652,-0.0038928484,0.0061084052
0.45,-0.3211570768,-0.3345710383,-0.3172151129,-0.3313532552,-0.0039419639,-0.0032177831,0.0050885369
0.46,-0.3282883086,-0.340337059,-0.3251194061,-0.3377850058,-0.0031689025,-0.0025520532,0.0040687736
0.47,-0.3354513401,-0.3460621209,-0.3330633345,-0.3441661912,-0.0023880056,-0.0018959298,0.003049118
0.48,-0.3426462032,-0.3517457367,-0.341046989,-0.350496057,-0.0015992141,-0.0012496797,0.0020295776
0.49,-0.3498729381,-0.3573874036,-0.3490704522,-0.3567738396,-0.0008024859,-0.000613564,0.0010101704
0.5,-0.3571315943,-0.3629866014,-0.3571337979,-0.362998766,2.2036e-06,1.21646e-05,1.23626e-05
0.51,-0.3644222299,-0.3685427906,-0.3652370909,-0.3691700539,0.0008148609,0.0006272633,0.0010283276
0.52,-0.3717449112,-0.3740554104,-0.3733803865,-0.3752869121,0.0016354753,0.0012315017,0.002047285
0.53,-0.3790997113,-0.3795238777,-0.3815637305,-0.3813485403,0.0024640191,0.0018246625,0.0030660697
0.54,-0.386486709,-0.3849475859,-0.3897871581,-0.3873541292,0.003300449,0.0024065433,0.004084656
0.55,-0.3939059868,-0.3903259041,-0.3980506942,-0.3933028611,0.0041447074,0.002976957,0.0051030258
0.56,-0.4013576289,-0.3956581774,-0.4063543527,-0.3991939095,0.0049967238,0.0035357322,0.0061211642
0.57,-0.4088417189,-0.4009437274,-0.4146981362,-0.4050264398,0.0058564173,0.0040827124,0.0071390591
0.58,-0.4163583374,-0.4061818538,-0.4230820355,-0.4107996089,0.0067236981,0.0046177551,0.0081567014
0.59,-0.4239075601,-0.4113718365,-0.4315060293,-0.4165125659,0.0075984692,0.0051407294,0.0091740848
0.6,-0.4314894552,-0.4165129394,-0.4399700836,-0.4221644524,0.0084806284,0.005651513,0.0101912049
0.61,-0.4391040829,-0.4216044145,-0.4484741518,-0.4277544022,0.0093700689,0.0061499877,0.0112080569
0.62,-0.4467514948,-0.4266455083,-0.4570181735,-0.4332815421,0.0102666788,0.0066360338,0.0122246324
0.63,-0.4544317351,-0.4316354688,-0.4656020748,-0.4387449919,0.0111703397,0.0071095231,0.0132409142
0.64,-0.4621448445,-0.4365735545,-0.4742257675,-0.4441438651,0.012080923,0.0075703106,0.0142568686
0.65,-0.4698908658,-0.4414590447,-0.4828891488,-0.4494772687,0.012998283,0.0080182239,0.0152724352
0.66,-0.4776698536,-0.4462912519,-0.4915921008,-0.4547443037,0.0139222472,0.0084530518,0.0162875122
0.67,-0.4854818888,-0.4510695356,-0.5003344904,-0.459944066,0.0148526016,0.0088745304,0.0173019382
0.68,-0.4933270977,-0.4557933184,-0.5091161683,-0.4650756461,0.0157890706,0.0092823276,0.0183154677
0.69,-0.5012056785,-0.460462104,-0.5179369691,-0.4701381299,0.0167312907,0.0096760259,0.0193277408
0.7,-0.5091179354,-0.4650754964,-0.526796711,-0.4751305992,0.0176787755,0.0100551028,0.0203382446
0.71,-0.5170643227,-0.4696332223,-0.5356951946,-0.4800521318,0.0186308719,0.0104189095,0.0213462658
0.72,-0.5250454989,-0.4741351547,-0.5446322036,-0.4849018026,0.0195867047,0.0107666479,0.0223508323
0.73,-0.5330623956,-0.4785813384,-0.5536075035,-0.4896786836,0.0205451079,0.0110973452,0.023350643
0.74,-0.5411162997,-0.4829720176,-0.5626208417,-0.4943818445,0.021504542,0.0114098269,0.0243439824
0.75,-0.549208954,-0.4873076655,-0.5716719471,-0.4990103537,0.0224629932,0.0117026882,0.0253286196
0.76,-0.557342677,-0.4915890151,-0.5807605297,-0.5035632783,0.0234178527,0.0119742633,0.0263016883
0.77,-0.5655205052,-0.4958170914,-0.58988628,-0.5080396853,0.0243657748,0.0122225939,0.0272595448
0.78,-0.573746361,-0.4999932457,-0.5990488692,-0.5124386418,0.0253025081,0.0124453961,0.0281976028
0.79,-0.5820252482,-0.5041191901,-0.6082479484,-0.5167592159,0.0262227002,0.0126400258,0.0291101401
0.8,-0.5903634798,-0.5081970331,-0.6174831487,-0.5210004773,0.0271196689,0.0128034441,0.0299900754
0.81,-0.5987689411,-0.5122293161,-0.6267540805,-0.525161498,0.0279851394,0.0129321819,0.0308287099
0.82,-0.6072513919,-0.5162190492,-0.6360603337,-0.5292413533,0.0288089418,0.0130223041,0.0316154319
0.83,-0.615822812,-0.5201697473,-0.6454014772,-0.5332391222,0.0295786651,0.0130693749,0.0323373776
0.84,-0.6244977947,-0.5240854655,-0.6547770585,-0.5371538884,0.0302792639,0.0130684229,0.0329790463
0.85,-0.6332939924,-0.5279708329,-0.6641866042,-0.540984741,0.0308926118,0.013013908,0.0335218625
0.86,-0.6422326204,-0.5318310851,-0.6736296189,-0.5447307754,0.0313969985,0.0128996902,0.0339436816
0.87,-0.6513390229,-0.5356720937,-0.6831055858,-0.5483910942,0.0317665629,0.0127190004,0.0342182333
0.88,-0.6606433079,-0.5395003932,-0.6926139665,-0.5519648078,0.0319706586,0.0124644146,0.0343144961
0.89,-0.6701810562,-0.543323204,-0.7021542004,-0.5554510358,0.0319731442,0.0121278318,0.0341959976
0.9,-0.6799941117,-0.5471484508,-0.7117257052,-0.5588489072,0.0317315935,0.0117004564,0.0338200341
0.91,-0.6901314588,-0.5509847755,-0.7213278769,-0.5621575619,0.0311964181,0.0111727865,0.0331368022
0.92,-0.7006501941,-0.5548415438,-0.7309600894,-0.5653761513,0.0303098952,0.0105346075,0.0320884357
0.93,-0.7116166004,-0.5587288449,-0.7406216947,-0.5685038393,0.0290050943,0.0097749944,0.0306079403
0.94,-0.7231073298,-0.562657482,-0.7503120234,-0.5715398034,0.0272046936,0.0088823214,0.0286180186
0.95,-0.7352107047,-0.5666389538,-0.7600303843,-0.5744832352,0.0248196796,0.0078442814,0.0260297762
0.96,-0.7480281451,-0.5706854256,-0.7697760648,-0.577333342,0.0217479197,0.0066479164,0.0227413017
0.97,-0.761675731,-0.574809688,-0.7795483311,-0.5800893472,0.0178726,0.0052796592,0.018636111
0.98,-0.7762859092,-0.579025102,-0.7893464285,-0.5827504915,0.0130605192,0.0037253895,0.0135814465
0.99,-0.7920093543,-0.5833455306,-0.7991695815,-0.5853160339,0.0071602272,0.0019705033,0.0074264215
1,-0.8090169944,-0.5877852523,-0.8090169944,-0.5877852523,0,-0,0
