xi,s1,s2
0,-7.3222891267537e-26,1.00508583008776e-25
0.01,-0.0277017366606439,0.00735920781981756
0.02,-0.0510858698117743,0.0140819060599726
0.03,-0.0711660077673695,0.0202835273565589
0.04,-0.088712080507773,0.0260582873839871
0.05,-0.104305344987905,0.0314830763532663
0.06,-0.118382388941592,0.0366206821055872
0.07,-0.131269984546877,0.0415224462589507
0.08,-0.143212398193797,0.0462304422488128
0.09,-0.154392540185396,0.0507792526169894
0.1,-0.164948137397826,0.0551974124922142
0.11,-0.174983931619849,0.0595085768165946
0.12,-0.184580745378933,0.0637324604506094
0.13,-0.193802114434033,0.0678855927810636
0.14,-0.202699060667149,0.0719819218073925
0.15,-0.211313469730354,0.0760332968377294
0.16,-0.219680443395421,0.0800498538330449
0.17,-0.227829916002777,0.0840403230412659
0.18,-0.235787756608667,0.0880122748094246
0.19,-0.24357652227732,0.0919723162964071
0.2,-0.251215982352061,0.0959262491775868
0.21,-0.258723497358832,0.0998791962813974
0.22,-0.266114308341035,0.103835703372532
0.23,-0.273401771789043,0.107799820942798
0.24,-0.280597560804729,0.111775169834544
0.25,-0.287711843624052,0.115764993748817
0.26,-0.294753445002581,0.11977220112689
0.27,-0.30172999314335,0.123799398485298
0.28,-0.308648053721952,0.127848916977643
0.29,-0.315513252186988,0.131922833704451
0.3,-0.322330385330877,0.136022989067829
0.31,-0.329103522981563,0.140151001262579
0.32,-0.335836100543314,0.144308278808424
0.33,-0.342531003012925,0.148496031858423
0.34,-0.349190641014476,0.152715282865867
0.35,-0.355817019329987,0.156966877055413
0.36,-0.362411798353256,0.16125149302318
0.37,-0.368976348858272,0.165569653684481
0.38,-0.375511800450467,0.169921737696136
0.39,-0.382019084057025,0.174307991402227
0.4,-0.388498968810062,0.178728541287227
0.41,-0.394952093682189,0.183183406867871
0.42,-0.401378994246162,0.187672513914447
0.43,-0.407780124947578,0.192195707862678
0.44,-0.414155877300282,0.19675276725844
0.45,-0.420506594436791,0.201343417068563
0.46,-0.426832582469124,0.205967341691351
0.47,-0.433134119137328,0.210624197509461
0.48,-0.439411460242311,0.215313624844962
0.49,-0.445664844374604,0.220035259200945
0.5,-0.451894496460086,0.224788741705503
0.51,-0.458100630645736,0.229573728711528
0.52,-0.464283453041792,0.234389900548958
0.53,-0.470443164819665,0.239236969474328
0.54,-0.476579966136715,0.244114686914869
0.55,-0.482694061319807,0.249022850160345
0.56,-0.488785665691342,0.253961308714205
0.57,-0.494855014366424,0.258929970575524
0.58,-0.500902373290296,0.263928808783581
0.59,-0.506928052723556,0.268957868616762
0.6,-0.51293242332123,0.274017275895748
0.61,-0.518915934892847,0.279107246896712
0.62,-0.524879137876644,0.28422810043234
0.63,-0.530822707514195,0.289380272706118
0.64,-0.536747470674448,0.294564335587221
0.65,-0.542654435250731,0.299781018988734
0.66,-0.548544822043058,0.305031238059613
0.67,-0.554420099043395,0.310316125919873
0.68,-0.560282018065704,0.31563707267792
0.69,-0.566132653707998,0.320995771467645
0.7,-0.571974444702559,0.326394272230018
0.71,-0.577810237805269,0.331835043938211
0.72,-0.583643334498034,0.337321045926015
0.73,-0.589477540931816,0.342855808925165
0.74,-0.595317221724214,0.348443526347442
0.75,-0.601167358447206,0.354089156260833
0.76,-0.607033613899789,0.359798534404715
0.77,-0.612922403559528,0.365578498466222
0.78,-0.618840975956301,0.371437023710709
0.79,-0.624797504192937,0.377383370058052
0.8,-0.630801191739999,0.383428241309826
0.81,-0.636862397451863,0.389583959298696
0.82,-0.642992788056553,0.395864660211566
0.83,-0.64920553173824,0.402286528205726
0.84,-0.655515554434634,0.408868093666482
0.85,-0.66193989168761,0.415630641019418
0.86,-0.668498183890075,0.422598794884533
0.87,-0.675213382141132,0.429801384516979
0.88,-0.682112756230912,0.437272725893917
0.89,-0.689229326101747,0.445054509453097
0.9,-0.696603874049591,0.453198540340118
0.91,-0.70428773751447,0.461770648051857
0.92,-0.712346632137189,0.470856164547269
0.93,-0.720865812407275,0.480567465207592
0.94,-0.729956943270079,0.491054176439886
0.95,-0.739767131074883,0.502516778204801
0.96,-0.75049064680664,0.5152244702854
0.97,-0.762383969227329,0.529538328672744
0.98,-0.7757848809348,0.545940953999771
0.99,-0.791136467003156,0.565074008481678
1,-0.809016994374947,0.587785252292473
