x1,y1,z1,x2,y2,z2,x3,y3,z3,x4,y4,z4,x5,y5,z5,x6,y6,z6,x7,y7,z7,x8,y8,z8
-8.544,5.463,3.202,8.184,5.692,3.236,8.224,-5.492,3.25,-8.491,-5.322,3.221,-8.192,5.648,-0.589,7.208,6.463,-0.548,7.869,-5.557,-0.527,-8.27,-5.545,-0.582
-8.2118,5.2742,3.0945,7.8657,5.4942,3.1271,7.9041,-5.3024,3.1403,-8.161,-5.1391,3.1125,-7.8742,5.4557,-0.5275,6.9293,6.2388,-0.4881,7.5643,-5.3687,-0.4682,-7.9492,-5.3572,-0.521
-7.9617,5.132,3.0136,7.626,5.3452,3.0451,7.6632,-5.1597,3.0577,-7.9125,-5.0014,3.0308,-7.635,5.311,-0.4811,6.7194,6.07,-0.443,7.3349,-5.2269,-0.424,-7.7077,-5.2157,-0.4751
-7.7622,5.0186,2.949,7.4349,5.2264,2.9797,7.4711,-5.0458,2.9919,-7.7143,-4.8915,2.9657,-7.4441,5.1955,-0.4442,6.5521,5.9354,-0.407,7.152,-5.1138,-0.3887,-7.5151,-5.1029,-0.4385
-7.5943,4.9231,2.8947,7.2739,5.1264,2.9247,7.3093,-4.95,2.9364,-7.5474,-4.799,2.9108,-7.2834,5.0982,-0.4131,6.4111,5.822,-0.3767,6.9979,-5.0185,-0.3589,-7.3529,-5.0079,-0.4077
-7.4466,4.8391,2.8469,7.1324,5.0384,2.8763,7.167,-4.8657,2.8876,-7.4006,-4.7177,2.8626,-7.1421,5.0128,-0.3857,6.2872,5.7223,-0.3501,6.8624,-4.9348,-0.3328,-7.2103,-4.9244,-0.3806
-7.3129,4.7631,2.8037,7.0043,4.9588,2.8325,7.0383,-4.7894,2.8435,-7.2678,-4.6441,2.819,-7.0143,4.9354,-0.3609,6.1751,5.6321,-0.326,6.7398,-4.859,-0.3091,-7.0812,-4.8489,-0.356
-7.1897,4.6931,2.7638,6.8862,4.8855,2.7921,6.9196,-4.7191,2.8028,-7.1454,-4.5762,2.7787,-6.8964,4.8641,-0.3381,6.0717,5.549,-0.3038,6.6268,-4.7891,-0.2873,-6.9622,-4.7792,-0.3334
-7.0748,4.6277,2.7266,6.7761,4.817,2.7544,6.8089,-4.6535,2.7649,-7.0312,-4.513,2.7412,-6.7865,4.7976,-0.3168,5.9753,5.4714,-0.2831,6.5214,-4.724,-0.267,-6.8512,-4.7142,-0.3123
-6.9668,4.5663,2.6917,6.6726,4.7527,2.719,6.7049,-4.5919,2.7292,-6.9239,-4.4535,2.7059,-6.6831,4.735,-0.2968,5.8846,5.3985,-0.2636,6.4223,-4.6627,-0.2479,-6.7469,-4.6531,-0.2925
-6.8646,4.5082,2.6586,6.5747,4.6918,2.6855,6.6065,-4.5335,2.6955,-6.8224,-4.3972,2.6726,-6.5854,4.6759,-0.2779,5.7989,5.3295,-0.2452,6.3286,-4.6048,-0.2298,-6.6482,-4.5953,-0.2737
-6.7673,4.4529,2.6271,6.4815,4.6339,2.6536,6.5128,-4.478,2.6633,-6.7257,-4.3436,2.6408,-6.4923,4.6196,-0.2599,5.7173,5.2639,-0.2276,6.2394,-4.5497,-0.2126,-6.5543,-4.5403,-0.2559
-6.6744,4.4001,2.5971,6.3924,4.5786,2.6232,6.4233,-4.425,2.6327,-6.6334,-4.2925,2.6105,-6.4034,4.5658,-0.2427,5.6393,5.2012,-0.2109,6.1541,-4.497,-0.1961,-6.4646,-4.4878,-0.2388
-6.5852,4.3494,2.5682,6.307,4.5255,2.5939,6.3374,-4.3741,2.6032,-6.5448,-4.2434,2.5813,-6.3181,4.5142,-0.2261,5.5645,5.141,-0.1948,6.0723,-4.4464,-0.1803,-6.3785,-4.4374,-0.2225
-6.4994,4.3006,2.5404,6.2247,4.4743,2.5658,6.2547,-4.3251,2.5749,-6.4595,-4.1961,2.5533,-6.236,4.4645,-0.2102,5.4925,5.0831,-0.1793,5.9936,-4.3977,-0.1652,-6.2956,-4.3888,-0.2067
-6.4165,4.2535,2.5136,6.1453,4.425,2.5386,6.1749,-4.2778,2.5475,-6.3772,-4.1505,2.5263,-6.1567,4.4165,-0.1949,5.4229,5.0271,-0.1644,5.9176,-4.3507,-0.1505,-6.2156,-4.342,-0.1915
-6.3364,4.2079,2.4877,6.0685,4.3773,2.5124,6.0977,-4.2321,2.521,-6.2975,-4.1063,2.5001,-6.08,4.3701,-0.18,5.3557,4.973,-0.1499,5.8441,-4.3053,-0.1363,-6.1382,-4.2966,-0.1768
-6.2587,4.1638,2.4626,5.9941,4.331,2.4869,6.0229,-4.1877,2.4954,-6.2203,-4.0635,2.4747,-6.0057,4.3251,-0.1656,5.2905,4.9206,-0.1359,5.7728,-4.2613,-0.1226,-6.0631,-4.2527,-0.1625
-6.1832,4.1209,2.4381,5.9217,4.286,2.4622,5.9502,-4.1447,2.4705,-6.1454,-4.022,2.4501,-5.9335,4.2815,-0.1517,5.2272,4.8697,-0.1223,5.7036,-4.2185,-0.1092,-5.9903,-4.21,-0.1487
-6.1098,4.0791,2.4144,5.8514,4.2423,2.4381,5.8795,-4.1028,2.4462,-6.0724,-3.9816,2.4261,-5.8633,4.239,-0.1381,5.1656,4.8201,-0.1091,5.6363,-4.1768,-0.0962,-5.9194,-4.1685,-0.1352
-6.0383,4.0385,2.3913,5.7829,4.1997,2.4147,5.8106,-4.062,2.4226,-6.0014,-3.9422,2.4027,-5.7949,4.1976,-0.1248,5.1056,4.7719,-0.0962,5.5707,-4.1363,-0.0835,-5.8503,-4.1281,-0.1221
-5.9685,3.9988,2.3687,5.716,4.1582,2.3918,5.7434,-4.0221,2.3996,-5.932,-3.9037,2.38,-5.7281,4.1572,-0.1119,5.047,4.7248,-0.0836,5.5067,-4.0967,-0.0712,-5.7829,-4.0886,-0.1092
-5.9003,3.96,2.3466,5.6507,4.1176,2.3694,5.6778,-3.9832,2.3771,-5.8643,-3.8662,2.3577,-5.6629,4.1177,-0.0993,4.9898,4.6788,-0.0713,5.4442,-4.0581,-0.0591,-5.7171,-4.0501,-0.0967
-5.8336,3.9221,2.3251,5.5868,4.0779,2.3476,5.6135,-3.9452,2.3551,-5.798,-3.8295,2.3359,-5.5991,4.0791,-0.0869,4.9339,4.6338,-0.0593,5.383,-4.0203,-0.0473,-5.6527,-4.0124,-0.0845
-5.7683,3.885,2.3039,5.5242,4.039,2.3262,5.5506,-3.9079,2.3335,-5.7331,-3.7935,2.3146,-5.5366,4.0413,-0.0748,4.8791,4.5897,-0.0475,5.3231,-3.9832,-0.0358,-5.5896,-3.9754,-0.0725
-5.7043,3.8486,2.2832,5.4628,4.0008,2.3052,5.4889,-3.8714,2.3124,-5.6695,-3.7583,2.2937,-5.4754,4.0042,-0.0629,4.8254,4.5465,-0.0359,5.2644,-3.9469,-0.0244,-5.5278,-3.9392,-0.0608
-5.6414,3.8129,2.2629,5.4026,3.9634,2.2846,5.4284,-3.8355,2.2916,-5.607,-3.7236,2.2732,-5.4152,3.9679,-0.0513,4.7726,4.504,-0.0246,5.2067,-3.9113,-0.0133,-5.4671,-3.9037,-0.0492
-5.5796,3.7777,2.2429,5.3434,3.9266,2.2643,5.3689,-3.8002,2.2712,-5.5456,-3.6896,2.253,-5.3561,3.9321,-0.0398,4.7208,4.4623,-0.0134,5.15,-3.8762,-0.0024,-5.4074,-3.8687,-0.0379
-5.5188,3.7431,2.2232,5.2851,3.8903,2.2444,5.3103,-3.7655,2.2511,-5.4852,-3.6561,2.2331,-5.2979,3.8969,-0.0286,4.6697,4.4213,-0.0025,5.0942,-3.8417,0.0084,-5.3486,-3.8343,-0.0267
-5.4588,3.709,2.2038,5.2276,3.8546,2.2247,5.2525,-3.7312,2.2313,-5.4256,-3.6231,2.2135,-5.2405,3.8621,-0.0175,4.6194,4.3808,0.0083,5.0392,-3.8077,0.019,-5.2907,-3.8004,-0.0157
-5.3996,3.6754,2.1846,5.1709,3.8194,2.2053,5.1955,-3.6975,2.2118,-5.3668,-3.5905,2.1942,-5.1839,3.8279,-0.0065,4.5697,4.3408,0.019,4.9849,-3.7742,0.0295,-5.2336,-3.7669,-0.0048
-5.3411,3.6421,2.1657,5.1148,3.7845,2.1862,5.1391,-3.6641,2.1924,-5.3087,-3.5583,2.1751,-5.1279,3.794,0.0044,4.5206,4.3013,0.0296,4.9312,-3.741,0.0398,-5.1771,-3.7339,0.0059
-5.2832,3.6092,2.147,5.0593,3.7501,2.1672,5.0834,-3.631,2.1733,-5.2511,-3.5264,2.1562,-5.0725,3.7605,0.0151,4.4721,4.2623,0.04,4.8781,-3.7082,0.0501,-5.1212,-3.7011,0.0165
-5.2258,3.5766,2.1284,5.0043,3.7159,2.1484,5.0281,-3.5983,2.1544,-5.1941,-3.4948,2.1374,-5.0176,3.7273,0.0257,4.4239,4.2235,0.0504,4.8255,-3.6756,0.0602,-5.0658,-3.6687,0.0271
-5.1688,3.5442,2.11,4.9498,3.682,2.1297,4.9733,-3.5658,2.1356,-5.1375,-3.4634,2.1189,-4.9632,3.6943,0.0363,4.3761,4.1851,0.0606,4.7733,-3.6434,0.0703,-5.0108,-3.6365,0.0375
-5.1123,3.512,2.0917,4.8955,3.6483,2.1112,4.9188,-3.5335,2.1169,-5.0813,-3.4323,2.1004,-4.909,3.6616,0.0467,4.3287,4.1469,0.0708,4.7214,-3.6113,0.0803,-4.9561,-3.6045,0.0479
-5.056,3.48,2.0735,4.8416,3.6147,2.0927,4.8645,-3.5014,2.0983,-5.0254,-3.4013,2.082,-4.8552,3.629,0.0572,4.2814,4.1089,0.081,4.6697,-3.5794,0.0903,-4.9018,-3.5726,0.0583
-4.9999,3.4482,2.0553,4.7879,3.5814,2.0743,4.8105,-3.4694,2.0798,-4.9697,-3.3704,2.0637,-4.8015,3.5965,0.0676,4.2344,4.0711,0.0911,4.6183,-3.5476,0.1002,-4.8476,-3.5409,0.0685
-4.944,3.4164,2.0372,4.7343,3.5481,2.056,4.7567,-3.4375,2.0613,-4.9142,-3.3396,2.0454,-4.7481,3.5642,0.0779,4.1875,4.0334,0.1012,4.5671,-3.5159,0.1101,-4.7937,-3.5093,0.0788
-4.8883,3.3847,2.0192,4.6809,3.5149,2.0378,4.7031,-3.4057,2.043,-4.8588,-3.3089,2.0273,-4.6948,3.5319,0.0882,4.1408,3.9958,0.1112,4.5159,-3.4843,0.12,-4.7399,-3.4778,0.089
-4.8327,3.3531,2.0012,4.6276,3.4818,2.0195,4.6495,-3.3739,2.0246,-4.8035,-3.2783,2.0091,-4.6416,3.4997,0.0985,4.0941,3.9582,0.1212,4.4649,-3.4528,0.1298,-4.6862,-3.4464,0.0992
-4.7772,3.3215,1.9833,4.5744,3.4487,2.0013,4.596,-3.3422,2.0062,-4.7484,-3.2477,1.991,-4.5884,3.4676,0.1088,4.0475,3.9208,0.1313,4.414,-3.4213,0.1396,-4.6325,-3.415,0.1094
-4.7217,3.29,1.9653,4.5212,3.4156,1.9831,4.5426,-3.3106,1.9879,-4.6932,-3.2172,1.9728,-4.5354,3.4355,0.1191,4.0009,3.8833,0.1413,4.3631,-3.3898,0.1495,-4.5789,-3.3836,0.1196
-4.6662,3.2585,1.9474,4.4681,3.3826,1.965,4.4891,-3.2789,1.9696,-4.6381,-3.1866,1.9547,-4.4823,3.4034,0.1294,3.9544,3.8459,0.1513,4.3122,-3.3584,0.1593,-4.5254,-3.3522,0.1298
-4.6108,3.2269,1.9294,4.415,3.3496,1.9468,4.4358,-3.2473,1.9513,-4.583,-3.1561,1.9366,-4.4293,3.3713,0.1397,3.9079,3.8085,0.1613,4.2614,-3.3269,0.1691,-4.4719,-3.3209,0.14
-4.5554,3.1954,1.9115,4.3619,3.3166,1.9286,4.3824,-3.2157,1.933,-4.528,-3.1256,1.9185,-4.3763,3.3392,0.1499,3.8614,3.7711,0.1713,4.2106,-3.2955,0.1789,-4.4183,-3.2896,0.1502
-4.5,3.1639,1.8936,4.3088,3.2836,1.9105,4.329,-3.184,1.9147,-4.4729,-3.0951,1.9004,-4.3233,3.3071,0.1602,3.8149,3.7337,0.1813,4.1597,-3.2641,0.1887,-4.3648,-3.2582,0.1603
-4.4446,3.1324,1.8757,4.2557,3.2506,1.8923,4.2757,-3.1524,1.8964,-4.4179,-3.0646,1.8824,-4.2703,3.2751,0.1705,3.7684,3.6963,0.1912,4.1089,-3.2327,0.1985,-4.3113,-3.2269,0.1705
-4.3892,3.1009,1.8577,4.2026,3.2176,1.8742,4.2223,-3.1208,1.8781,-4.3628,-3.0341,1.8643,-4.2173,3.243,0.1807,3.7219,3.6589,0.2012,4.0581,-3.2013,0.2083,-4.2578,-3.1956,0.1807
-4.3338,3.0694,1.8398,4.1495,3.1846,1.856,4.1689,-3.0892,1.8599,-4.3078,-3.0036,1.8462,-4.1643,3.2109,0.191,3.6755,3.6215,0.2112,4.0073,-3.1699,0.2181,-4.2043,-3.1642,0.1908
-4.2784,3.038,1.8219,4.0964,3.1516,1.8378,4.1156,-3.0576,1.8416,-4.2528,-2.9731,1.8281,-4.1113,3.1789,0.2012,3.629,3.5841,0.2212,3.9565,-3.1385,0.2279,-4.1509,-3.1329,0.201
-4.223,3.0065,1.804,4.0434,3.1186,1.8197,4.0622,-3.026,1.8233,-4.1977,-2.9426,1.81,-4.0583,3.1468,0.2115,3.5825,3.5467,0.2312,3.9057,-3.1071,0.2377,-4.0974,-3.1016,0.2112
-4.1676,2.975,1.786,3.9903,3.0857,1.8015,4.0089,-2.9943,1.805,-4.1427,-2.912,1.7919,-4.0053,3.1147,0.2218,3.536,3.5093,0.2412,3.8549,-3.0757,0.2475,-4.0439,-3.0703,0.2213
-4.1122,2.9435,1.7681,3.9372,3.0527,1.7834,3.9555,-2.9627,1.7867,-4.0876,-2.8815,1.7738,-3.9523,3.0827,0.232,3.4895,3.4719,0.2512,3.804,-3.0442,0.2573,-3.9904,-3.0389,0.2315
-4.0567,2.912,1.7502,3.8841,3.0197,1.7652,3.9021,-2.9311,1.7684,-4.0326,-2.851,1.7557,-3.8993,3.0506,0.2423,3.443,3.4345,0.2612,3.7532,-3.0128,0.2672,-3.9369,-3.0076,0.2417
-4.0013,2.8805,1.7323,3.831,2.9867,1.747,3.8488,-2.8995,1.7501,-3.9775,-2.8205,1.7376,-3.8463,3.0185,0.2526,3.3965,3.3971,0.2712,3.7024,-2.9814,0.277,-3.8833,-2.9763,0.2519
-3.9459,2.849,1.7143,3.7779,2.9536,1.7289,3.7954,-2.8678,1.7318,-3.9224,-2.79,1.7195,-3.7932,2.9864,0.2628,3.35,3.3597,0.2812,3.6516,-2.95,0.2868,-3.8298,-2.9449,0.262
-3.8904,2.8174,1.6964,3.7247,2.9206,1.7107,3.742,-2.8362,1.7135,-3.8673,-2.7594,1.7014,-3.7402,2.9543,0.2731,3.3035,3.3223,0.2912,3.6007,-2.9185,0.2966,-3.7763,-2.9136,0.2722
-3.835,2.7859,1.6784,3.6715,2.8876,1.6925,3.6885,-2.8045,1.6952,-3.8122,-2.7289,1.6833,-3.6871,2.9222,0.2834,3.257,3.2849,0.3012,3.5498,-2.8871,0.3064,-3.7227,-2.8822,0.2824
-3.7794,2.7543,1.6605,3.6183,2.8545,1.6743,3.635,-2.7728,1.6768,-3.757,-2.6983,1.6652,-3.634,2.8901,0.2937,3.2103,3.2474,0.3112,3.4988,-2.8556,0.3162,-3.669,-2.8508,0.2926
-3.7238,2.7227,1.6425,3.565,2.8214,1.6561,3.5815,-2.7411,1.6585,-3.7018,-2.6677,1.647,-3.5807,2.8579,0.304,3.1637,3.2098,0.3212,3.4478,-2.824,0.3261,-3.6153,-2.8193,0.3028
-3.6681,2.691,1.6244,3.5116,2.7882,1.6378,3.5278,-2.7093,1.6401,-3.6464,-2.637,1.6288,-3.5274,2.8256,0.3143,3.1169,3.1722,0.3313,3.3967,-2.7925,0.3359,-3.5615,-2.7878,0.313
-3.6122,2.6592,1.6064,3.4581,2.7549,1.6195,3.474,-2.6774,1.6216,-3.5909,-2.6062,1.6106,-3.474,2.7933,0.3247,3.0701,3.1345,0.3414,3.3455,-2.7608,0.3458,-3.5076,-2.7562,0.3233
-3.5561,2.6274,1.5882,3.4044,2.7215,1.6011,3.42,-2.6454,1.6031,-3.5352,-2.5754,1.5923,-3.4204,2.7608,0.3351,3.023,3.0967,0.3515,3.2941,-2.729,0.3558,-3.4534,-2.7245,0.3336
-3.4998,2.5954,1.57,3.3504,2.688,1.5827,3.3658,-2.6133,1.5845,-3.4792,-2.5444,1.5739,-3.3665,2.7282,0.3455,2.9758,3.0587,0.3616,3.2424,-2.6971,0.3657,-3.3991,-2.6927,0.3439
-3.4433,2.5632,1.5517,3.2962,2.6543,1.5641,3.3113,-2.581,1.5659,-3.423,-2.5132,1.5554,-3.3124,2.6955,0.356,2.9283,3.0205,0.3718,3.1905,-2.665,0.3757,-3.3444,-2.6607,0.3543
-3.3863,2.5308,1.5333,3.2416,2.6204,1.5455,3.2564,-2.5485,1.547,-3.3664,-2.4818,1.5368,-3.2579,2.6625,0.3665,2.8805,2.9821,0.3821,3.1383,-2.6327,0.3858,-3.2894,-2.6285,0.3648
-3.3289,2.4982,1.5147,3.1866,2.5862,1.5267,3.2011,-2.5157,1.5281,-3.3094,-2.4502,1.5181,-3.203,2.6293,0.3771,2.8324,2.9433,0.3924,3.0857,-2.6002,0.396,-3.234,-2.596,0.3753
-3.271,2.4653,1.496,3.1312,2.5517,1.5077,3.1454,-2.4827,1.509,-3.2519,-2.4184,1.4992,-3.1476,2.5958,0.3879,2.7838,2.9043,0.4029,3.0325,-2.5673,0.4062,-3.1781,-2.5633,0.3859
-3.2125,2.432,1.4771,3.0751,2.5169,1.4885,3.089,-2.4493,1.4897,-3.1938,-2.3861,1.4801,-3.0916,2.5619,0.3987,2.7347,2.8648,0.4134,2.9789,-2.5342,0.4166,-3.1216,-2.5302,0.3967
-3.1533,2.3984,1.4579,3.0184,2.4816,1.4691,3.032,-2.4155,1.4701,-3.135,-2.3535,1.4607,-3.035,2.5277,0.4097,2.685,2.8248,0.4241,2.9246,-2.5006,0.427,-3.0645,-2.4968,0.4075
-3.0934,2.3643,1.4385,2.9609,2.4459,1.4495,2.9743,-2.3813,1.4503,-3.0754,-2.3205,1.4412,-2.9776,2.493,0.4208,2.6347,2.7844,0.4349,2.8696,-2.4666,0.4377,-3.0066,-2.4628,0.4185
-3.0325,2.3297,1.4188,2.9026,2.4097,1.4295,2.9157,-2.3466,1.4302,-3.0149,-2.287,1.4213,-2.9194,2.4577,0.4321,2.5837,2.7433,0.4459,2.8138,-2.4321,0.4484,-2.9478,-2.4284,0.4297
-2.9707,2.2945,1.3988,2.8434,2.3729,1.4093,2.8561,-2.3113,1.4098,-2.9535,-2.253,1.4011,-2.8603,2.422,0.4435,2.5318,2.7016,0.457,2.7571,-2.3971,0.4594,-2.8881,-2.3935,0.4411
-2.9078,2.2588,1.3785,2.7831,2.3354,1.3887,2.7956,-2.2754,1.3891,-2.891,-2.2184,1.3806,-2.8002,2.3856,0.4552,2.4791,2.6591,0.4684,2.6994,-2.3614,0.4705,-2.8274,-2.3579,0.4526
-2.8438,2.2224,1.3578,2.7218,2.2973,1.3677,2.7339,-2.2389,1.3679,-2.8274,-2.1831,1.3597,-2.7389,2.3485,0.467,2.4253,2.6159,0.4799,2.6407,-2.3251,0.4818,-2.7656,-2.3217,0.4644
-2.7785,2.1853,1.3367,2.6592,2.2584,1.3463,2.671,-2.2016,1.3464,-2.7625,-2.1471,1.3384,-2.6764,2.3107,0.4791,2.3705,2.5719,0.4917,2.5808,-2.2881,0.4934,-2.7025,-2.2848,0.4763
-2.7118,2.1474,1.3151,2.5953,2.2187,1.3244,2.6068,-2.1635,1.3244,-2.6963,-2.1104,1.3166,-2.6126,2.2721,0.4915,2.3146,2.5268,0.5037,2.5196,-2.2503,0.5052,-2.6381,-2.2471,0.4886
-2.6436,2.1086,1.293,2.53,2.1781,1.3021,2.5411,-2.1246,1.3019,-2.6285,-2.0729,1.2943,-2.5474,2.2326,0.5041,2.2574,2.4808,0.516,2.4571,-2.2116,0.5173,-2.5723,-2.2085,0.5011
-2.5738,2.0689,1.2705,2.4631,2.1365,1.2792,2.4739,-2.0848,1.2788,-2.5592,-2.0344,1.2715,-2.4807,2.1922,0.517,2.1988,2.4337,0.5286,2.3931,-2.1721,0.5296,-2.5049,-2.1691,0.5139
-2.5023,2.0283,1.2473,2.3946,2.0939,1.2558,2.405,-2.044,1.2552,-2.4881,-1.9951,1.2482,-2.4122,2.1508,0.5303,2.1388,2.3855,0.5415,2.3275,-2.1315,0.5423,-2.4358,-2.1286,0.527
-2.4289,1.9865,1.2236,2.3242,2.0502,1.2317,2.3343,-2.0021,1.231,-2.4152,-1.9546,1.2242,-2.342,2.1083,0.5439,2.0772,2.3359,0.5548,2.2602,-2.0899,0.5553,-2.3649,-2.0871,0.5405
-2.3535,1.9436,1.1992,2.2519,2.0053,1.207,2.2616,-1.959,1.2061,-2.3402,-1.9131,1.1996,-2.2698,2.0647,0.5579,2.0139,2.285,0.5684,2.1909,-2.0471,0.5686,-2.2921,-2.0445,0.5544
-2.2758,1.8995,1.174,2.1774,1.959,1.1815,2.1868,-1.9147,1.1804,-2.263,-1.8703,1.1742,-2.1955,2.0197,0.5723,1.9487,2.2326,0.5824,2.1197,-2.003,0.5824,-2.217,-2.0005,0.5686
-2.1956,1.8539,1.1481,2.1006,1.9113,1.1552,2.1096,-1.8689,1.1539,-2.1834,-1.8262,1.148,-2.1188,1.9733,0.5871,1.8815,2.1785,0.5968,2.0462,-1.9576,0.5966,-2.1396,-1.9552,0.5833
-2.1127,1.8068,1.1213,2.0212,1.8619,1.1281,2.0298,-1.8216,1.1266,-2.1011,-1.7805,1.121,-2.0396,1.9253,0.6025,1.812,2.1226,0.6118,1.9702,-1.9106,0.6112,-2.0596,-1.9083,0.5986
-2.0269,1.758,1.0935,1.939,1.8108,1.1,1.9471,-1.7727,1.0982,-2.0158,-1.7333,1.093,-1.9574,1.8757,0.6184,1.74,2.0646,0.6273,1.8914,-1.862,0.6264,-1.9767,-1.8598,0.6143
-1.9377,1.7073,1.0647,1.8535,1.7577,1.0707,1.8612,-1.7218,1.0688,-1.9272,-1.6842,1.0639,-1.8721,1.824,0.6349,1.6651,2.0044,0.6433,1.8096,-1.8114,0.6422,-1.8906,-1.8094,0.6307
-1.8448,1.6545,1.0346,1.7645,1.7023,1.0403,1.7717,-1.6687,1.0381,-1.8348,-1.633,1.0335,-1.7832,1.7702,0.6521,1.5871,1.9417,0.6601,1.7244,-1.7587,0.6587,-1.8009,-1.7568,0.6478
-1.7475,1.5992,1.0031,1.6713,1.6444,1.0084,1.678,-1.6132,1.006,-1.7382,-1.5794,1.0018,-1.6902,1.7139,0.6701,1.5056,1.8761,0.6776,1.6352,-1.7036,0.6759,-1.707,-1.7018,0.6656
-1.6453,1.5411,0.9701,1.5733,1.5836,0.9749,1.5796,-1.5549,0.9723,-1.6366,-1.5231,0.9684,-1.5924,1.6548,0.6891,1.4198,1.8071,0.6961,1.5414,-1.6456,0.694,-1.6083,-1.644,0.6844
-1.5373,1.4797,0.9351,1.4698,1.5192,0.9395,1.4756,-1.4932,0.9366,-1.5293,-1.4637,0.9331,-1.4891,1.5923,0.7091,1.3292,1.7342,0.7156,1.4424,-1.5844,0.7131,-1.504,-1.583,0.7042
-1.4224,1.4143,0.898,1.3597,1.4508,0.9018,1.3649,-1.4277,0.8987,-1.4152,-1.4004,0.8956,-1.3792,1.5258,0.7304,1.2328,1.6567,0.7363,1.337,-1.5192,0.7334,-1.393,-1.518,0.7253
-1.2992,1.3443,0.8581,1.2416,1.3774,0.8615,1.2462,-1.3573,0.858,-1.2927,-1.3325,0.8554,-1.2613,1.4544,0.7532,1.1294,1.5735,0.7585,1.224,-1.4494,0.7552,-1.274,-1.4483,0.7479
-1.1655,1.2683,0.8149,1.1136,1.2978,0.8177,1.1175,-1.2811,0.8139,-1.1599,-1.2589,0.8117,-1.1334,1.3771,0.778,1.0172,1.4833,0.7826,1.1014,-1.3736,0.7789,-1.145,-1.3727,0.7725
-1.0178,1.1843,0.7671,0.972,1.2099,0.7693,0.9752,-1.1968,0.7651,-1.0132,-1.1776,0.7635,-0.9921,1.2916,0.8053,0.8933,1.3836,0.8092,0.9659,-1.2898,0.805,-1.0023,-1.2892,0.7996
-0.8498,1.0888,0.7127,0.8111,1.1098,0.7142,0.8134,-1.1009,0.7097,-0.8463,-1.0851,0.7087,-0.8314,1.1943,0.8365,0.7524,1.2702,0.8395,0.8118,-1.1946,0.8348,-0.8401,-1.1942,0.8304
-0.6504,0.9754,0.6482,0.6199,0.991,0.6488,0.6213,-0.9871,0.6438,-0.6481,-0.9752,0.6435,-0.6406,1.0789,0.8734,0.585,1.1356,0.8755,0.6289,-1.0815,0.8701,-0.6475,-1.0814,0.867
-0.4002,0.8332,0.5673,0.3802,0.8421,0.5669,0.3804,-0.8443,0.5612,-0.3995,-0.8375,0.5619,-0.4013,0.9341,0.9198,0.3751,0.9668,0.9206,0.3994,-0.9397,0.9143,-0.406,-0.94,0.9129
-0.0681,0.6444,0.4599,0.0619,0.6442,0.458,0.0605,-0.6547,0.4516,-0.0695,-0.6546,0.4534,-0.0836,0.7418,0.9813,0.0965,0.7426,0.9805,0.0948,-0.7514,0.9731,-0.0852,-0.7522,0.9739
