n,w1,wr1,wd1,we1,wp1,w2,wr2,wd2,we2,wp2,w3,wr3,wd3,we3,wp3,w4,wr4,wd4,we4,wp4,w5,wr5,wd5,we5,wp5,w6,wr6,wd6,we6,wp6,w7,wr7,wd7,we7,wp7,w8,wr8,wd8,we8,wp8,w9,wr9,wd9,we9,wp9,w10,wr10,wd10,we10,wp10,w11,wr11,wd11,we11,wp11,w12,wr12,wd12,we12,wp12,w13,wr13,wd13,we13,wp13,w14,wr14,wd14,we14,wp14,w15,wr15,wd15,we15,wp15,w16,wr16,wd16,we16,wp16,w17,wr17,wd17,we17,wp17,w18,wr18,wd18,we18,wp18,w19,wr19,wd19,we19,wp19,w20,wr20,wd20,we20,wp20
1,87.709187016277,87.1366137093974,0.00654946592372512,0.572573306879619,0.00657098414208709,87.4100762403514,87.1366137093974,0.00313340265613376,0.27346253095395,0.00313831946540812,87.1710911023799,87.1366137093974,0.000395592300635371,0.0344773929824811,0.000395670562749477,87.1547102228718,87.1366137093974,0.000207658224931426,0.0180965134743616,0.000207679788139506,87.143533033698,87.1366137093974,7.94046187115992e-05,0.00691932430056852,7.94077713835039e-05,87.1394625909779,87.1366137093974,3.26938916798441e-05,0.00284888158047636,3.26944261338574e-05,87.137486480343,87.1366137093974,1.00160717473808e-05,0.000872770945605339,1.00161219084787e-05,87.1364841814126,87.1366137093974,1.48649431716848e-06,-0.000129527984825017,-1.48649321233662e-06,87.1359299192196,87.1366137093974,7.84736555210328e-06,-0.000683790177774313,-7.84733476165104e-06,87.1356056958622,87.1366137093974,1.15682641632553e-05,-0.00100801353519842,-1.15681972512745e-05,87.1354062293082,87.1366137093974,1.38574177272942e-05,-0.00120748008923499,-1.38573217139464e-05,87.1352783455103,87.1366137093974,1.53250632836417e-05,-0.00133536388715072,-1.53249458557592e-05,87.135193402422,87.1366137093974,1.62999052912985e-05,-0.00142030697543305,-1.62997724489249e-05,87.1351352425087,87.1366137093974,1.69673730553947e-05,-0.00147846688874154,-1.69672291107416e-05,87.1350943558522,87.1366137093974,1.74366058851636e-05,-0.00151935354523403,-1.74364538688766e-05,87.13506493988,87.1366137093974,1.77741963518735e-05,-0.00154876951744143,-1.77740383922493e-05,87.1350433396555,87.1366137093974,1.80220899769407e-05,-0.00157036974188429,-1.80219275805405e-05,87.1350271876076,87.1366137093974,1.8207457985318e-05,-0.00158652178983232,-1.82072922310638e-05,87.1350149113763,87.1366137093974,1.83483454396817e-05,-0.00159879802113494,-1.83481771103358e-05,87.1350054431804,87.1366137093974,1.84570066528103e-05,-0.00160826621704757,-1.84568363238348e-05
2,NaN,NaN,NaN,NaN,NaN,181.608425976279,174.297146519832,0.0410855014444985,7.31127945644701,0.0419472125759393,175.973433940387,174.297146519832,0.00957138574614663,1.67628742055572,0.00961741172489588,174.790809600319,174.297146519832,0.00282830198998321,0.493663080486897,0.00283230730016987,174.527393698708,174.297146519832,0.00132013177015538,0.230247178876169,0.00132100371964478,174.411690044055,174.297146519832,0.000656957967293775,0.114543524223194,0.000657173835087204,174.358085817155,174.297146519832,0.000349567662670941,0.0609392973230172,0.000349628772127279,174.329549648376,174.297146519832,0.000185890116278647,0.0324031285442743,0.000185907395452326,174.313431517781,174.297146519832,9.34280195470978e-05,0.0162849979496116,9.3432384148404e-05,174.303788870694,174.297146519832,3.81086232905314e-05,0.00664235086276221,3.81093494379522e-05,174.297761500525,174.297146519832,3.52834008181978e-06,0.000614980693143252,3.52834630642263e-06,174.293848073142,174.297146519832,1.89244515250775e-05,-0.00329844668962664,-1.89242724593391e-05,174.291223546987,174.297146519832,3.39826187724547e-05,-0.00592297284424603,-3.39820413730761e-05,174.289413029399,174.297146519832,4.43705600292847e-05,-0.00773349043294047,-4.43695756778241e-05,174.288132758619,174.297146519832,5.17162470598028e-05,-0.00901376121228736,-5.17149098092766e-05,174.287207410171,174.297146519832,5.70255638192083e-05,-0.00993910966070644,-5.70239379081031e-05,174.286525436249,174.297146519832,6.09385030753045e-05,-0.0106210835827483,-6.0936646381298e-05,174.28601398464,174.297146519832,6.38730521303749e-05,-0.0111325351913365,-6.38710123121254e-05,174.285624347799,174.297146519832,6.61086720045867e-05,-0.0115221720328691,-6.61064868985568e-05,174.285323266154,174.297146519832,6.78361920191079e-05,-0.0118232536774485,-6.78338912226728e-05
3,NaN,NaN,NaN,NaN,NaN,NaN,NaN,NaN,NaN,NaN,280.213003992339,261.505506593308,0.069067225998262,18.7074973990304,0.0715376805740621,267.286463994639,261.505506593308,0.0218647699771334,5.78095740133028,0.0221064461572535,263.591996736053,261.505506593308,0.00794705794453345,2.08649014274414,0.00797876178565155,262.469165402426,261.505506593308,0.00367826484989011,0.963658809117305,0.00368504213035935,262.015466558423,261.505506593308,0.00194819306682136,0.509959965114888,0.00195009264530698,261.797165104339,261.505506593308,0.00111468382183048,0.291658511031017,0.00111530542828913,261.677861752765,261.505506593308,0.00065887094232942,0.172355159456629,0.000659088069318075,261.607413332797,261.505506593308,0.000389616603247925,0.101906739488356,0.000389692518585626,261.563409543661,261.505506593308,0.000221397022710949,0.057902950352684,0.000221421533745116,261.534745083034,261.505506593308,0.000111802063538343,0.0292384897255147,0.000111808313738441,261.515428140817,261.505506593308,3.79393896111715e-05,0.00992154750883856,3.79401093234663e-05,261.502035986423,261.505506593308,1.32717278546142e-05,-0.00347060688551437,-1.32716397858185e-05,261.492522125584,261.505506593308,4.96539834224144e-05,-0.0129844677239817,-4.96527506939845e-05,261.485617637557,261.505506593308,7.6058482943934e-05,-0.0198889557510711,-7.60555906075135e-05,261.480511196693,261.505506593308,9.55872461774958e-05,-0.0249953966149405,-9.55826779350127e-05,261.476670160649,261.505506593308,0.000110276923156627,-0.0288364326590909,-0.000110270842991987,261.473736618129,261.505506593308,0.000121496122808118,-0.0317699751796567,-0.000121488742602523,261.471465035359,261.505506593308,0.000130183774033196,-0.0340415579495357,-0.000130175300677232
4,NaN,NaN,NaN,NaN,NaN,NaN,NaN,NaN,NaN,NaN,NaN,NaN,NaN,NaN,NaN,376.591689063327,348.785580234771,0.076666611997539,27.8061088285558,0.0797226445251528,361.408557707024,348.785580234771,0.0355479630086378,12.6229774722532,0.0361912251755263,354.183026664393,348.785580234771,0.0153561521144746,5.39744642962194,0.0154749701119779,351.416600951875,348.785580234771,0.00751503148032162,2.63102071710375,0.00754337583375088,350.223207228508,348.785580234771,0.00411333024568844,1.43762699373735,0.00412180742325893,349.634433293778,348.785580234771,0.00243078102736077,0.848853059007126,0.00243373897061844,349.309690988735,348.785580234771,0.00150154506288487,0.524110753964464,0.00150267322866869,349.115290892312,348.785580234771,0.000944863865861443,0.329710657540602,0.000945310460709615,348.991714359839,348.785580234771,0.000590830703908769,0.206134125068445,0.000591005295946277,348.909560596766,348.785580234771,0.000355399815017616,0.123980361995109,0.000355462980756419,348.853010034457,348.785580234771,0.000193308686264337,0.0674297996861242,0.000193327372194506,348.812974482123,348.785580234771,7.8538715904537e-05,0.0273942473521629,7.85418001906029e-05,348.783958751533,348.785580234771,4.64895081520486e-06,-0.00162148323846623,-4.64894000885813e-06,348.762503404796,348.785580234771,6.61655605294819e-05,-0.0230768299751389,-6.61633716611957e-05,348.746358091816,348.785580234771,0.000112459776534659,-0.0392221429549977,-0.000112453453289545,348.734018526134,348.785580234771,0.000147843039045754,-0.0515617086373936,-0.00014783211107147,348.724455497841,348.785580234771,0.000175265541134753,-0.0611247369297985,-0.000175250183475632
5,NaN,NaN,NaN,NaN,NaN,NaN,NaN,NaN,NaN,NaN,NaN,NaN,NaN,NaN,NaN,NaN,NaN,NaN,NaN,NaN,471.266033265599,436.161221015983,0.0773721796077374,35.1048122496153,0.0804858629289486,457.10783628918,436.161221015983,0.0468987817318749,20.9466152731962,0.0480249372569246,446.636751563042,436.161221015983,0.0237325659379454,10.4755305470581,0.024017565162388,441.681285730812,436.161221015983,0.0125764352316128,5.52006471482883,0.0126560190334449,439.304059276791,436.161221015983,0.00717981245300076,3.14283826080793,0.00720568016910601,438.069162053688,436.161221015983,0.00436484724084938,1.90794103770418,0.00437439402168736,437.371931656793,436.161221015983,0.00277198555568283,1.21071064080951,0.0027758328399515,436.949081706144,436.161221015983,0.00180472200981699,0.787860690160301,0.00180635199141519,436.677464912904,436.161221015983,0.00118290791928193,0.516243896920457,0.0011836079689018,436.494923891589,436.161221015983,0.000764798088119896,0.333702875605695,0.000765090658056156,436.367780465158,436.161221015983,0.000473472970694441,0.206559449174165,0.00047358508556311,436.27663596825,436.161221015983,0.000264580339659112,0.115414952266178,0.00026461534566813,436.209730136066,436.161221015983,0.000111212139787406,0.048509120082997,0.000111218324201315,436.159626343763,436.161221015983,3.6561598288538e-06,-0.00159467221999421,-3.65615314511368e-06,436.121455520984,436.161221015983,9.11757073006913e-05,-0.0397654949996991,-9.11715509853679e-05,436.091935985182,436.161221015983,0.000158864499933257,-0.0692850308010975,-0.000158851881970861
6,NaN,NaN,NaN,NaN,NaN,NaN,NaN,NaN,NaN,NaN,NaN,NaN,NaN,NaN,NaN,NaN,NaN,NaN,NaN,NaN,NaN,NaN,NaN,NaN,NaN,564.738495851693,523.65623896207,0.0754914656889688,41.0822568896237,0.0784527211421222,553.369401805182,523.65623896207,0.0551763332615653,29.7131628431124,0.0567417336648301,540.631440713705,523.65623896207,0.0318996490813588,16.9752017516354,0.0324166895925496,533.34351650184,523.65623896207,0.0183297630670095,9.68727753977021,0.0184993070243395,529.441556398471,523.65623896207,0.0109872368205287,5.78531743640144,0.0110479299317973,527.279449933806,523.65623896207,0.0068952096879356,3.62321097173606,0.00691906388610506,526.012929569228,523.65623896207,0.00449034929825724,2.35669060715838,0.00450045360259536,525.22839145582,523.65623896207,0.00299776056995652,1.57215249375008,0.00300226059917899,524.717694542937,523.65623896207,0.00202495607138686,1.06145558086735,0.00202700837284253,524.371045972529,523.65623896207,0.00136410000146803,0.714807010458912,0.00136503102087682,524.127458967186,523.65623896207,0.000899460463162163,0.471220005116606,0.00089986515972884,523.951328133812,523.65623896207,0.000563358228808582,0.295089171742802,0.000563516959766761,523.820906576157,523.65623896207,0.00031440803226736,0.164667614086852,0.000314457466243956,523.722375595725,523.65623896207,0.000126289830125663,0.0661366336548781,0.000126297805189844,523.646649550476,523.65623896207,1.83125850190868e-05,-0.00958941159331061,-1.83124173452371e-05
7,NaN,NaN,NaN,NaN,NaN,NaN,NaN,NaN,NaN,NaN,NaN,NaN,NaN,NaN,NaN,NaN,NaN,NaN,NaN,NaN,NaN,NaN,NaN,NaN,NaN,NaN,NaN,NaN,NaN,NaN,657.370157149767,611.294389821194,0.0726366436873839,46.075767328573,0.0753741046798259,649.630166280129,611.294389821194,0.0608058210516042,38.3357764589352,0.0627124624358955,635.736262676734,611.294389821194,0.0392001155810894,24.4418728555401,0.0399838003792075,626.306811271103,611.294389821194,0.0242605153205404,15.0124214499094,0.0245584152249469,620.706555880532,611.294389821194,0.0152794786273105,9.41216605933789,0.0153971085226072,617.388696645885,611.294389821194,0.00992006302001646,6.09430682469088,0.00996951211424251,615.359331268068,611.294389821194,0.00662769186933227,4.06494144687474,0.00664972804357611,614.066923151956,611.294389821194,0.00452525031010671,2.77253333076226,0.00453551247472308,613.210291956577,611.294389821194,0.00312926877927784,1.91590213538336,0.00313417261353204,612.62153982661,611.294389821194,0.00216869471712474,1.327150005416,0.00217104888825202,612.203902975224,611.294389821194,0.00148674200754485,0.909513154029923,0.00148784803062884,611.899515699063,611.294389821194,0.000989419380097142,0.605125877869227,0.000989909097720051,611.672486237243,611.294389821194,0.000618326503278817,0.378096416049516,0.000618517726230255,611.499778494259,611.294389821194,0.000335933353931686,0.205388673065158,0.000335989789020042
8,NaN,NaN,NaN,NaN,NaN,NaN,NaN,NaN,NaN,NaN,NaN,NaN,NaN,NaN,NaN,NaN,NaN,NaN,NaN,NaN,NaN,NaN,NaN,NaN,NaN,NaN,NaN,NaN,NaN,NaN,NaN,NaN,NaN,NaN,NaN,749.413120791413,699.099364437527,0.0694695515115754,50.313756353886,0.0719693922113158,745.632199458885,699.099364437527,0.0644172747162243,46.5328350213578,0.0665611176156576,731.567262772624,699.099364437527,0.0453884891386759,32.4678983350971,0.0464424658163145,720.387763189258,699.099364437527,0.0299944935567294,21.2883987517309,0.0304511773785675,713.078357037442,699.099364437527,0.0197977809553801,13.9789925999146,0.0199957163616672,708.457987900776,699.099364437527,0.0132976797680062,9.3586234632487,0.0133866856977883,705.502377419809,699.099364437527,0.00911719356664781,6.40301298228201,0.00915894550617088,703.560696970627,699.099364437527,0.00636124554458464,4.46133253309972,0.00638154282501625,702.245641179428,699.099364437527,0.0044903670820383,3.14627674190058,0.00450047146650172,701.327919817141,699.099364437527,0.00318267917894736,2.22855537961357,0.00318775197486639,700.669575039006,699.099364437527,0.0022435282812683,1.57021060147827,0.00224604781716774,700.1855322678,699.099364437527,0.00155246130767249,1.08616783027276,0.00155366731186582,699.821863463464,699.099364437527,0.00103293739708322,0.722499025936258,0.00103347115258438
9,NaN,NaN,NaN,NaN,NaN,NaN,NaN,NaN,NaN,NaN,NaN,NaN,NaN,NaN,NaN,NaN,NaN,NaN,NaN,NaN,NaN,NaN,NaN,NaN,NaN,NaN,NaN,NaN,NaN,NaN,NaN,NaN,NaN,NaN,NaN,NaN,NaN,NaN,NaN,NaN,841.04799203559,787.094778247231,0.0662757772513856,53.9532137883591,0.0685472897031621,841.283955028934,787.094778247231,0.0665559868528605,54.1891767817031,0.0688470795122997,827.833166791021,787.094778247231,0.0504522677546767,40.7383885437898,0.0517579199731314,815.381705813632,787.094778247231,0.0353040158127228,28.2869275664005,0.0359384007468481,806.479222974015,787.094778247231,0.0243282642813307,19.3844447267841,0.0246278405885896,800.495696774777,787.094778247231,0.0168820848176982,13.4009185275456,0.017025800320246,796.495577327401,787.094778247231,0.0118727662707428,9.40079908017003,0.0119436684627797,793.781986257005,787.094778247231,0.00846012562133063,6.68720800977428,0.00849606450784227,791.900499153673,787.094778247231,0.00608706178570945,4.80572090644137,0.00610564450337626,790.564616759005,787.094778247231,0.00439871688750687,3.4698385117739,0.00440841256690945,789.593826909608,787.094778247231,0.00316999647768553,2.49904866237705,0.00317502889288904,788.872913458047,787.094778247231,0.00225656302495864,1.77813521081578,0.00225911193919426
10,NaN,NaN,NaN,NaN,NaN,NaN,NaN,NaN,NaN,NaN,NaN,NaN,NaN,NaN,NaN,NaN,NaN,NaN,NaN,NaN,NaN,NaN,NaN,NaN,NaN,NaN,NaN,NaN,NaN,NaN,NaN,NaN,NaN,NaN,NaN,NaN,NaN,NaN,NaN,NaN,NaN,NaN,NaN,NaN,NaN,932.408967386535,875.304160916679,0.0631790581987492,57.1048064698558,0.0652399577422912,936.577941646239,875.304160916679,0.0676355052493619,61.2737807295596,0.0700028441146555,924.331889924788,875.304160916679,0.0544862712493283,49.0277290081091,0.0560122197485773,911.098204241309,875.304160916679,0.0400738870735475,35.7940433246297,0.0408932630768528,900.804051298848,875.304160916679,0.0287143431991239,25.4998903821695,0.0291326050083713,893.472878957112,875.304160916679,0.0205438194083861,18.1687180404334,0.020757033785154,888.359572283899,875.304160916679,0.0148048759198874,13.05541136722,0.0149152853946764,884.77861411753,875.304160916679,0.0107659177570971,9.4744532008508,0.0108241838938918,882.235098495119,875.304160916679,0.00788709275348902,6.93093757843963,0.00791831901173767,880.395655081704,875.304160916679,0.00579995978655374,5.09149416502521,0.00581682847216566,879.039900424263,875.304160916679,0.00425884476130524,3.73573950758441,0.00426793299334038
11,NaN,NaN,NaN,NaN,NaN,NaN,NaN,NaN,NaN,NaN,NaN,NaN,NaN,NaN,NaN,NaN,NaN,NaN,NaN,NaN,NaN,NaN,NaN,NaN,NaN,NaN,NaN,NaN,NaN,NaN,NaN,NaN,NaN,NaN,NaN,NaN,NaN,NaN,NaN,NaN,NaN,NaN,NaN,NaN,NaN,NaN,NaN,NaN,NaN,NaN,1023.59933802713,963.750946141583,0.0602293338645983,59.848391885551,0.0620994377490954,1031.54705929417,963.750946141583,0.0679558772352677,67.7961131525831,0.0703460924464019,1020.93256319261,963.750946141583,0.0576229074127875,57.1816170510251,0.0593323589252536,1007.37585605291,963.750946141583,0.0442639305221329,43.6249099113255,0.0452657505406139,995.940654691764,963.750946141583,0.0328518104955829,32.1897085501813,0.033400443007661,987.337864661933,963.750946141583,0.0241782110478467,23.5869185203499,0.0244740807931562,981.089811098574,963.750946141583,0.0178306268957422,17.338864956991,0.0179910225005826,976.576627789057,963.750946141583,0.0132201199630352,12.8256816474741,0.0133080872177841,973.292973287061,963.750946141583,0.00985215363448532,9.5420271454783,0.00990092635828811,970.873170506888,963.750946141583,0.00736290249254566,7.12222436530499,0.00739010881786328
12,NaN,NaN,NaN,NaN,NaN,NaN,NaN,NaN,NaN,NaN,NaN,NaN,NaN,NaN,NaN,NaN,NaN,NaN,NaN,NaN,NaN,NaN,NaN,NaN,NaN,NaN,NaN,NaN,NaN,NaN,NaN,NaN,NaN,NaN,NaN,NaN,NaN,NaN,NaN,NaN,NaN,NaN,NaN,NaN,NaN,NaN,NaN,NaN,NaN,NaN,NaN,NaN,NaN,NaN,NaN,1114.70114434147,1052.45846162504,0.057441715455631,62.2426827164327,0.0591402748763382,1126.24215993423,1052.45846162504,0.0677318375724222,73.7836983091938,0.0701060431356777,1117.55686567332,1052.45846162504,0.0599981052938719,65.0984040482813,0.0618536563882691,1104.08571552716,1052.45846162504,0.0478796163316273,51.6272539021261,0.0490539586924995,1091.78181378418,1052.45846162504,0.0366781210204058,39.3233521591437,0.0373633293787452,1082.02764902652,1052.45846162504,0.0277061417771005,29.5691874014819,0.028095348633357,1074.66430527698,1052.45846162504,0.0208787607348878,22.2058436519399,0.0210990214451344,1069.18446201843,1052.45846162504,0.0157670267762808,16.7260003933966,0.0158923140468375,1065.10252608059,1052.45846162504,0.0119421018133235,12.6440644555512,0.0120138370459089
13,NaN,NaN,NaN,NaN,NaN,NaN,NaN,NaN,NaN,NaN,NaN,NaN,NaN,NaN,NaN,NaN,NaN,NaN,NaN,NaN,NaN,NaN,NaN,NaN,NaN,NaN,NaN,NaN,NaN,NaN,NaN,NaN,NaN,NaN,NaN,NaN,NaN,NaN,NaN,NaN,NaN,NaN,NaN,NaN,NaN,NaN,NaN,NaN,NaN,NaN,NaN,NaN,NaN,NaN,NaN,NaN,NaN,NaN,NaN,NaN,1205.78137041657,1141.44991925179,0.0548147525537391,64.3314511647825,0.0563594162825394,1220.7206471885,1141.44991925179,0.0671168535100081,79.2707279367128,0.069447398961379,1214.16371423757,1141.44991925179,0.0617366056572488,72.7137949857859,0.0637030094438565,1201.1293355331,1141.44991925179,0.0509518866090953,59.6794162813092,0.0522838674520461,1188.23154494784,1141.44991925179,0.0401613923748404,46.7816256960571,0.0409843874067835,1177.4758724243,1141.44991925179,0.0310712428158117,36.025953172508,0.0315615714407539,1169.05022712763,1141.44991925179,0.0238911976864297,27.6003078758376,0.024180042777461,1162.59733595674,1141.44991925179,0.0183567560579718,21.1474167049512,0.0185268020508628
14,NaN,NaN,NaN,NaN,NaN,NaN,NaN,NaN,NaN,NaN,NaN,NaN,NaN,NaN,NaN,NaN,NaN,NaN,NaN,NaN,NaN,NaN,NaN,NaN,NaN,NaN,NaN,NaN,NaN,NaN,NaN,NaN,NaN,NaN,NaN,NaN,NaN,NaN,NaN,NaN,NaN,NaN,NaN,NaN,NaN,NaN,NaN,NaN,NaN,NaN,NaN,NaN,NaN,NaN,NaN,NaN,NaN,NaN,NaN,NaN,NaN,NaN,NaN,NaN,NaN,1296.89605107025,1230.74840547528,0.0523393592193567,66.147645594976,0.0537458714556952,1315.04077349098,1230.74840547528,0.0662210121027664,84.2923680157082,0.0684887078794607,1310.73777120965,1230.74840547528,0.0629469217406587,79.989365734376,0.0649924593674258,1298.43470930039,1230.74840547528,0.0535242414277466,67.6863038251165,0.0549960524214356,1285.20771703307,1230.74840547528,0.0432911457164083,54.4593115577993,0.044248939357162,1273.61798954033,1230.74840547528,0.0342358723151513,42.8695840650551,0.0348321264316407,1264.20902038798,1230.74840547528,0.0268225938974746,33.4606149127094,0.0271872096391528
15,NaN,NaN,NaN,NaN,NaN,NaN,NaN,NaN,NaN,NaN,NaN,NaN,NaN,NaN,NaN,NaN,NaN,NaN,NaN,NaN,NaN,NaN,NaN,NaN,NaN,NaN,NaN,NaN,NaN,NaN,NaN,NaN,NaN,NaN,NaN,NaN,NaN,NaN,NaN,NaN,NaN,NaN,NaN,NaN,NaN,NaN,NaN,NaN,NaN,NaN,NaN,NaN,NaN,NaN,NaN,NaN,NaN,NaN,NaN,NaN,NaN,NaN,NaN,NaN,NaN,NaN,NaN,NaN,NaN,NaN,1388.093077975,1320.37687193316,0.0500032913742585,67.7162060418407,0.0512855136145314,1409.25889183097,1320.37687193316,0.0651237216904288,88.8820198978083,0.0673156443339364,1407.28116470986,1320.37687193316,0.0637208122200348,86.9042927766995,0.0658177938617351,1395.95174449281,1320.37687193316,0.0556448671951074,75.5748725596466,0.057237349552327,1382.64252492455,1320.37687193316,0.0460711847379047,62.2656529913857,0.0471574853475149,1370.39436671955,1320.37687193316,0.0371770695835373,50.0174947863864,0.0378812260723378
16,NaN,NaN,NaN,NaN,NaN,NaN,NaN,NaN,NaN,NaN,NaN,NaN,NaN,NaN,NaN,NaN,NaN,NaN,NaN,NaN,NaN,NaN,NaN,NaN,NaN,NaN,NaN,NaN,NaN,NaN,NaN,NaN,NaN,NaN,NaN,NaN,NaN,NaN,NaN,NaN,NaN,NaN,NaN,NaN,NaN,NaN,NaN,NaN,NaN,NaN,NaN,NaN,NaN,NaN,NaN,NaN,NaN,NaN,NaN,NaN,NaN,NaN,NaN,NaN,NaN,NaN,NaN,NaN,NaN,NaN,NaN,NaN,NaN,NaN,NaN,1479.41416769722,1410.35812630619,0.047793413712438,69.056041391023,0.048963479631861,1503.42824585786,1410.35812630619,0.0638825965010881,93.0701195516626,0.0659904160622086,1503.80764852845,1410.35812630619,0.06413466456112,93.4495222222581,0.0662594276441032,1493.64800788026,1410.35812630619,0.057362056225409,83.289881574068,0.0590558383863883,1480.48179179048,1410.35812630619,0.0485143885313822,70.1236654842855,0.0497204675722636
17,NaN,NaN,NaN,NaN,NaN,NaN,NaN,NaN,NaN,NaN,NaN,NaN,NaN,NaN,NaN,NaN,NaN,NaN,NaN,NaN,NaN,NaN,NaN,NaN,NaN,NaN,NaN,NaN,NaN,NaN,NaN,NaN,NaN,NaN,NaN,NaN,NaN,NaN,NaN,NaN,NaN,NaN,NaN,NaN,NaN,NaN,NaN,NaN,NaN,NaN,NaN,NaN,NaN,NaN,NaN,NaN,NaN,NaN,NaN,NaN,NaN,NaN,NaN,NaN,NaN,NaN,NaN,NaN,NaN,NaN,NaN,NaN,NaN,NaN,NaN,NaN,NaN,NaN,NaN,NaN,1570.89627322482,1500.7148234343,0.0456968330833672,70.1814497905252,0.0467653472162813,1597.59855765379,1500.7148234343,0.0625396609722313,96.8837342194884,0.0645583909125223,1600.33853190629,1500.7148234343,0.064251528146344,99.6237084719901,0.0663841703409093,1591.50502331321,1500.7148234343,0.0587216979248152,90.7901998789127,0.0604979696749744
18,NaN,NaN,NaN,NaN,NaN,NaN,NaN,NaN,NaN,NaN,NaN,NaN,NaN,NaN,NaN,NaN,NaN,NaN,NaN,NaN,NaN,NaN,NaN,NaN,NaN,NaN,NaN,NaN,NaN,NaN,NaN,NaN,NaN,NaN,NaN,NaN,NaN,NaN,NaN,NaN,NaN,NaN,NaN,NaN,NaN,NaN,NaN,NaN,NaN,NaN,NaN,NaN,NaN,NaN,NaN,NaN,NaN,NaN,NaN,NaN,NaN,NaN,NaN,NaN,NaN,NaN,NaN,NaN,NaN,NaN,NaN,NaN,NaN,NaN,NaN,NaN,NaN,NaN,NaN,NaN,NaN,NaN,NaN,NaN,NaN,1662.57261601681,1591.46945670293,0.0437014382266107,71.1031593138771,0.0446776776107173,1691.81602093866,1591.46945670293,0.0611257016297005,100.346564235724,0.0630527741598092,1696.8998650277,1591.46945670293,0.0641232161047394,105.430408324764,0.0662472081262469
19,NaN,NaN,NaN,NaN,NaN,NaN,NaN,NaN,NaN,NaN,NaN,NaN,NaN,NaN,NaN,NaN,NaN,NaN,NaN,NaN,NaN,NaN,NaN,NaN,NaN,NaN,NaN,NaN,NaN,NaN,NaN,NaN,NaN,NaN,NaN,NaN,NaN,NaN,NaN,NaN,NaN,NaN,NaN,NaN,NaN,NaN,NaN,NaN,NaN,NaN,NaN,NaN,NaN,NaN,NaN,NaN,NaN,NaN,NaN,NaN,NaN,NaN,NaN,NaN,NaN,NaN,NaN,NaN,NaN,NaN,NaN,NaN,NaN,NaN,NaN,NaN,NaN,NaN,NaN,NaN,NaN,NaN,NaN,NaN,NaN,NaN,NaN,NaN,NaN,NaN,1754.47345326426,1682.64434971159,0.0417961255156767,71.8291035526729,0.0426882267574753,1786.12349030881,1682.64434971159,0.0596633417799517,103.479140597221,0.0614979277201136
20,NaN,NaN,NaN,NaN,NaN,NaN,NaN,NaN,NaN,NaN,NaN,NaN,NaN,NaN,NaN,NaN,NaN,NaN,NaN,NaN,NaN,NaN,NaN,NaN,NaN,NaN,NaN,NaN,NaN,NaN,NaN,NaN,NaN,NaN,NaN,NaN,NaN,NaN,NaN,NaN,NaN,NaN,NaN,NaN,NaN,NaN,NaN,NaN,NaN,NaN,NaN,NaN,NaN,NaN,NaN,NaN,NaN,NaN,NaN,NaN,NaN,NaN,NaN,NaN,NaN,NaN,NaN,NaN,NaN,NaN,NaN,NaN,NaN,NaN,NaN,NaN,NaN,NaN,NaN,NaN,NaN,NaN,NaN,NaN,NaN,NaN,NaN,NaN,NaN,NaN,NaN,NaN,NaN,NaN,NaN,1846.62665665769,1774.26164823546,0.0399708592637037,72.3650084222375,0.0407859846907056
