cable,fx,fy,fz,fn
1,136.13296387,-56.29201779,135.27388839,200
2,322.70808573,99.06402802,300.19617238,451.74321483
3,-313.76113025,84.85960895,275.47638921,426.06858731
4,-136.22293116,-58.46678271,134.25702346,200
5,176.00078734,-70.16829962,179.22563979,260.8096957
6,145.50177943,40.15006736,131.53408899,200.20992056
7,-146.54392766,37.08041993,130.35231943,199.60412685
8,-183.81562731,-76.22702413,185.18447838,271.83089428
