xi,s1,s2
0,-2.83315033900728e-24,1.75981099627585e-24
0.01,0.013066645546615,-0.00379547967228802
0.02,0.0260081218872458,-0.00751428298756012
0.03,0.0388244290218922,-0.0111564099458163
0.04,0.0515155669505544,-0.0147218605470566
0.05,0.0640815356732323,-0.0182106347912809
0.06,0.0765223351899259,-0.0216227326784893
0.07,0.0888379655006352,-0.0249581542086818
0.08,0.10102842660536,-0.0282168993818584
0.09,0.113093718504101,-0.0313989681980191
0.1,0.125033841196857,-0.0345043606571638
0.11,0.13684879468363,-0.0375330767592927
0.12,0.148538578964417,-0.0404851165044056
0.13,0.160103194039221,-0.0433604798925026
0.14,0.17154263990804,-0.0461591669235836
0.15,0.182856916570875,-0.0488811775976488
0.16,0.194046024027726,-0.051526511914698
0.17,0.205109962278593,-0.0540951698747313
0.18,0.216048731323475,-0.0565871514777487
0.19,0.226862331162373,-0.0590024567237502
0.2,0.237550761795286,-0.0613410856127357
0.21,0.248114023222215,-0.0636030381447053
0.22,0.25855211544316,-0.0657883143196591
0.23,0.268865038458121,-0.0678969141375969
0.24,0.279052792267098,-0.0699288375985187
0.25,0.28911537687009,-0.0718840847024247
0.26,0.299052792267098,-0.0737626554493147
0.27,0.308865038458121,-0.0755645498391888
0.28,0.31855211544316,-0.077289767872047
0.29,0.328114023222215,-0.0789383095478893
0.3,0.337550761795286,-0.0805101748667156
0.31,0.346862331162373,-0.0820053638285261
0.32,0.356048731323475,-0.0834238764333206
0.33,0.365109962278593,-0.0847657126810992
0.34,0.374046024027726,-0.0860308725718619
0.35,0.382856916570875,-0.0872193561056086
0.36,0.39154263990804,-0.0883311632823394
0.37,0.400103194039221,-0.0893662941020544
0.38,0.408538578964417,-0.0903247485647534
0.39,0.41684879468363,-0.0912065266704364
0.4,0.425033841196857,-0.0920116284191036
0.41,0.433093718504101,-0.0927400538107548
0.42,0.44102842660536,-0.0933918028453901
0.43,0.448837965500635,-0.0939668755230095
0.44,0.456522335189926,-0.094465271843613
0.45,0.464081535673232,-0.0948869918072006
0.46,0.471515566950554,-0.0952320354137722
0.47,0.478824429021892,-0.0955004026633279
0.48,0.486008121887246,-0.0956920935558677
0.49,0.493066645546615,-0.0958071080913916
0.5,0.5,-0.0958454462698996
0.51,0.506933354453385,-0.0958071080913916
0.52,0.513991878112754,-0.0956920935558677
0.53,0.521175570978108,-0.095500402663328
0.54,0.528484433049446,-0.0952320354137722
0.55,0.535918464326768,-0.0948869918072006
0.56,0.543477664810074,-0.094465271843613
0.57,0.551162034499365,-0.0939668755230096
0.58,0.55897157339464,-0.0933918028453902
0.59,0.566906281495899,-0.0927400538107549
0.6,0.574966158803143,-0.0920116284191036
0.61,0.58315120531637,-0.0912065266704365
0.62,0.591461421035583,-0.0903247485647534
0.63,0.599896805960779,-0.0893662941020544
0.64,0.60845736009196,-0.0883311632823395
0.65,0.617143083429125,-0.0872193561056086
0.66,0.625953975972274,-0.0860308725718619
0.67,0.634890037721408,-0.0847657126810992
0.68,0.643951268676525,-0.0834238764333206
0.69,0.653137668837627,-0.0820053638285261
0.7,0.662449238204714,-0.0805101748667157
0.71,0.671885976777784,-0.0789383095478893
0.72,0.68144788455684,-0.0772897678720471
0.73,0.691134961541879,-0.0755645498391889
0.74,0.700947207732903,-0.0737626554493147
0.75,0.71088462312991,-0.0718840847024247
0.76,0.720947207732902,-0.0699288375985188
0.77,0.731134961541879,-0.0678969141375969
0.78,0.74144788455684,-0.0657883143196591
0.79,0.751885976777785,-0.0636030381447054
0.8,0.762449238204714,-0.0613410856127357
0.81,0.773137668837627,-0.0590024567237502
0.82,0.783951268676525,-0.0565871514777488
0.83,0.794890037721407,-0.0540951698747314
0.84,0.805953975972274,-0.051526511914698
0.85,0.817143083429125,-0.0488811775976488
0.86,0.82845736009196,-0.0461591669235837
0.87,0.839896805960779,-0.0433604798925026
0.88,0.851461421035583,-0.0404851165044056
0.89,0.86315120531637,-0.0375330767592927
0.9,0.874966158803143,-0.0345043606571639
0.91,0.886906281495899,-0.0313989681980191
0.92,0.89897157339464,-0.0282168993818584
0.93,0.911162034499365,-0.0249581542086818
0.94,0.923477664810074,-0.0216227326784894
0.95,0.935918464326768,-0.0182106347912809
0.96,0.948484433049446,-0.0147218605470566
0.97,0.961175570978108,-0.0111564099458163
0.98,0.973991878112754,-0.00751428298756014
0.99,0.986933354453385,-0.00379547967228803
1,1,2.0169411544728e-24
