%!TEX root=../../../source.tex
%!TEX file=figures/material/kelvinvoigt/step-strain-response.tikz

\begin{tikzpicture}

% Left axis: Strain => Stress
\begin{axis}[%
    % General adjustments
    material step strain2stress,%
    tufte-like,%
    cycle multiindex* list={%
      /ustutt/linestyles*\nextlist%
      /ustutt/color list%
    },%
    each nth point=10,%
    %
    % X-axis
    %
    % Y-Axis
    %
    % Title
    title={Strain-step response of spring-damper element},%
  ]

\addplot+[%
    /ustutt/semithick,%
  ]%
  table[%
      x=t,%
      y=y,%
      col sep=comma,%
    ]{data/material/kelvinvoigt/step/input_strain/step.dat};
% \label{kelvinvoigt:strain2stress:step}
\addlegendentry{$\cabforce_{\cabindex, \ms{model}} \of{t}$}

\end{axis}

% % Right axis: Stress => Strain
% \begin{axis}[%
%     % General adjustments
%     material step stress2strain,%
%     tufte-like right,%
%     each nth point=10,%
%     %
%     % X-axis
%     %
%     % Y-Axis
%   ]

% % Add other axis' data to legend
% \addlegendimage{refstyle={kelvinvoigt:strain2stress:step}};
% \addlegendentry{$\cabforce \of{t}$}

% \pgfplotsset{cycle list shift=1}
% \addplot+[%
%   ]%
%   table[%
%       x=t,%
%       y=y,%
%       col sep=comma,%
%     ]{data/material/kelvinvoigt/step/input_stress/step.dat};
% \addlegendentry{$\strain* \of{t}$}

% \end{axis}

\end{tikzpicture}
