xi,s1,s2
0,-4.07126921806532e-27,-3.04113479335953e-26
0.01,-0.0151020582767378,-0.0191060393208511
0.02,-0.0288413713463662,-0.036290711385945
0.03,-0.0413405947487666,-0.0517295515263293
0.04,-0.0527223840238202,-0.0655980950730518
0.05,-0.0631093947114083,-0.07807187735716
0.06,-0.072624282351412,-0.0893264337097017
0.07,-0.0813897024837127,-0.0995372994617245
0.08,-0.0895283106481915,-0.108880009944276
0.09,-0.0971627623847299,-0.117530100488404
0.1,-0.104415713233209,-0.125663106425156
0.11,-0.111394110826978,-0.133430575660523
0.12,-0.11814207117326,-0.140888106400264
0.13,-0.124688002372746,-0.148067309425082
0.14,-0.131060312526125,-0.154999795515681
0.15,-0.13728740973409,-0.161717175452763
0.16,-0.14339770209733,-0.168251060017031
0.17,-0.149419597716537,-0.174633059989188
0.18,-0.155381504692402,-0.180894786149937
0.19,-0.161311831125614,-0.18706784927998
0.2,-0.167238985116865,-0.19318386016002
0.21,-0.173186658717953,-0.199269100384273
0.22,-0.179159679785104,-0.205328534801008
0.23,-0.185158160125651,-0.211361799072003
0.24,-0.191182211546926,-0.21736852885904
0.25,-0.197231945856264,-0.2233483598239
0.26,-0.203307474860998,-0.229300927628362
0.27,-0.209408910368459,-0.235225867934208
0.28,-0.215536364185983,-0.241122816403218
0.29,-0.221689948120901,-0.246991408697172
0.3,-0.227869773980547,-0.252831280477851
0.31,-0.234075948771923,-0.258642065748977
0.32,-0.240308560300705,-0.264423391882039
0.33,-0.246567691572237,-0.270174884590467
0.34,-0.252853425591865,-0.275896169587692
0.35,-0.259165845364932,-0.281586872587144
0.36,-0.265505033896783,-0.287246619302254
0.37,-0.271871074192764,-0.292875035446452
0.38,-0.278264049258218,-0.298471746733169
0.39,-0.284684042098491,-0.304036378875835
0.4,-0.291131135718927,-0.309568557587881
0.41,-0.297605412628881,-0.315067893926782
0.42,-0.304106953353745,-0.3205339403262
0.43,-0.310635837922924,-0.325966234563841
0.44,-0.317192146365821,-0.331364314417412
0.45,-0.323775958711839,-0.33672771766462
0.46,-0.330387354990381,-0.34205598208317
0.47,-0.33702641523085,-0.34734864545077
0.48,-0.34369321946265,-0.352605245545127
0.49,-0.350387847715185,-0.357825320143946
0.5,-0.357110380017856,-0.363008407024935
0.51,-0.363860876185822,-0.368154050829706
0.52,-0.370639315177251,-0.373261823655502
0.53,-0.377445655736065,-0.378331304463468
0.54,-0.384279856606188,-0.383362072214752
0.55,-0.391141876531541,-0.388353705870503
0.56,-0.398031674256047,-0.393305784391867
0.57,-0.404949208523629,-0.398217886739991
0.58,-0.411894438078208,-0.403089591876024
0.59,-0.418867321663708,-0.407920478761113
0.6,-0.425867818024051,-0.412710126356404
0.61,-0.432895901401097,-0.417458079752827
0.62,-0.43995160802846,-0.422163748560426
0.63,-0.447034989637689,-0.426826508519029
0.64,-0.454146097960335,-0.431445735368462
0.65,-0.461284984727951,-0.436020804848553
0.66,-0.468451701672085,-0.440551092699127
0.67,-0.47564630052429,-0.445035974660012
0.68,-0.482868833016115,-0.449474826471033
0.69,-0.490119350879112,-0.453867023872018
0.7,-0.497397905844831,-0.458211942602793
0.71,-0.504704484913122,-0.462509009632431
0.72,-0.512038816157031,-0.466757856846991
0.73,-0.519400562917901,-0.470958167361776
0.74,-0.526789388537077,-0.475109624292092
0.75,-0.534204956355903,-0.479211910753242
0.76,-0.541646929715723,-0.483264709860532
0.77,-0.549114971957882,-0.487267704729266
0.78,-0.556608746423722,-0.491220578474748
0.79,-0.56412791645459,-0.495123014212283
0.8,-0.571672145391828,-0.498974695057176
0.81,-0.579247723009108,-0.502777878923145
0.82,-0.586887444809406,-0.506545122917566
0.83,-0.594630732728026,-0.510291558946229
0.84,-0.602517008700271,-0.514032318914923
0.85,-0.610585694661445,-0.517782534729439
0.86,-0.61887621254685,-0.521557338295566
0.87,-0.627427984291791,-0.525371861519093
0.88,-0.63628043183157,-0.529241236305812
0.89,-0.645472977101491,-0.533180594561511
0.9,-0.655045042036858,-0.53720506819198
0.91,-0.665064753468591,-0.54133211418592
0.92,-0.675715057810085,-0.545588489863667
0.93,-0.687207606370353,-0.55000327762847
0.94,-0.699754050458408,-0.554605559883577
0.95,-0.713566041383261,-0.559424419032236
0.96,-0.728855230453925,-0.564488937477693
0.97,-0.745833268979414,-0.569828197623198
0.98,-0.764711808268738,-0.575471281871998
0.99,-0.785702499630912,-0.58144727262734
1,-0.809016994374947,-0.587785252292473
