xi,s1,s2
0,0,0
0.01,0.00676010953189304,0.00742728055405826
0.02,0.0133460149247473,0.0150110150167915
0.03,0.0197632917862231,0.0227395174838962
0.04,0.0260175738242796,0.0306020582489961
0.05,0.0321144904426518,0.0385887943857518
0.06,0.0380596173403265,0.0466907015635408
0.07,0.0438584380764561,0.0548995083326167
0.08,0.0495163147848011,0.063207633688002
0.09,0.0550384664497492,0.071608128396785
0.1,0.0604299533755307,0.0800946203319716
0.11,0.065695666683434,0.0886612638806329
0.12,0.0708403218546469,0.0973026933702929
0.13,0.0758684554974384,0.106013980373317
0.14,0.080784424657113,0.114790594694774
0.15,0.0855924081068245,0.123628368817135
0.16,0.0902964091587965,0.132523465559206
0.17,0.0949002596208221,0.141472348702255
0.18,0.0994076245941721,0.15047175633983
0.19,0.103822007868215,0.159518676716626
0.2,0.108146757715938,0.168610326334041
0.21,0.112385072934748,0.177744130114258
0.22,0.116540009009889,0.186917703429835
0.23,0.120614484304633,0.19612883582114
0.24,0.124611286203282,0.205375476239043
0.25,0.128533077150667,0.214655719664728
0.26,0.132382400546093,0.223967794972171
0.27,0.136161686461149,0.233310053911568
0.28,0.139873257159914,0.242680961103758
0.29,0.1435193324074,0.25207908494654
0.3,0.147102034557794,0.261503089343582
0.31,0.15062339341856,0.270951726175641
0.32,0.154085350889984,0.280423828441865
0.33,0.157489765382388,0.289918304006292
0.34,0.160838416015296,0.299434129891249
0.35,0.164133006604326,0.308970347065251
0.36,0.167375169442651,0.318526055678343
0.37,0.170566468884644,0.328100410702572
0.38,0.173708404739758,0.337692617939578
0.39,0.176802415485018,0.347301930361072
0.4,0.179849881304564,0.356927644751455
0.41,0.182852126964678,0.366569098624846
0.42,0.18581042453264,0.376225667391574
0.43,0.188725995947534,0.385896761751629
0.44,0.191600015450907,0.395581825294782
0.45,0.194433611884915,0.405280332289045
0.46,0.197227870865261,0.414991785640941
0.47,0.199983836835951,0.424715715012602
0.48,0.202702515012523,0.434451675082178
0.49,0.205384873220131,0.444199243935302
0.5,0.208031843632486,0.45395802157649
0.51,0.210644324417375,0.46372762855043
0.52,0.213223181294156,0.473507704664001
0.53,0.215769249008313,0.483297907800733
0.54,0.218283332727898,0.493097912820143
0.55,0.220766209366361,0.502907410535103
0.56,0.223218628836061,0.512726106760966
0.57,0.225641315236444,0.52255372143076
0.58,0.228034967980676,0.532389987771253
0.59,0.230400262864276,0.542234651535137
0.6,0.232737853079076,0.552087470285003
0.61,0.235048370175641,0.561948212725145
0.62,0.237332424977094,0.571816658077551
0.63,0.239590608447104,0.581692595498785
0.64,0.241823492514629,0.59157582353469
0.65,0.244031630857862,0.601466149610145
0.66,0.246215559649647,0.611363389551289
0.67,0.248375798266543,0.621267367137884
0.68,0.250512849963522,0.631177913683632
0.69,0.252627202516227,0.641094867642467
0.7,0.254719328832555,0.651018074238989
0.71,0.25678968753524,0.660947385121348
0.72,0.258838723517022,0.670882658035024
0.73,0.260866868469868,0.680823756516072
0.74,0.262874541389645,0.690770549602492
0.75,0.264862149057554,0.70072291156252
0.76,0.266830086499557,0.710680721638693
0.77,0.268778737424944,0.720643863806642
0.78,0.270708474645158,0.730612226547648
0.79,0.272619660473877,0.74058570263407
0.8,0.27451264710934,0.750564188926789
0.81,0.276387776999821,0.760547586183922
0.82,0.278245383193117,0.770535798880078
0.83,0.28008578967085,0.780528735035486
0.84,0.28190931166836,0.790526306054388
0.85,0.283716255980904,0.800528426572109
0.86,0.28550692125684,0.810535014310283
0.87,0.287281598278446,0.82054598993973
0.88,0.289040570230971,0.830561276950514
0.89,0.290784112960504,0.840580801528765
0.9,0.292512495221186,0.850604492439848
0.91,0.2942259789123,0.860632280917513
0.92,0.295924819305699,0.870664100558664
0.93,0.297609265264049,0.880699887223436
0.94,0.29927955945031,0.890739578940257
0.95,0.300935938528873,0.900783115815614
0.96,0.302578633358736,0.910830439948264
0.97,0.304207869179087,0.92088149534762
0.98,0.305823865787647,0.930936227856105
0.99,0.307426837712104,0.94099458507522
1,0.309016994374947,0.951056516295154
