xi,s1,s2
0,7.40977636687072e-26,1.93499888944649e-25
0.01,-0.0453042639998166,0.0123357462445589
0.02,-0.0726623787593756,0.0207587047871189
0.03,-0.0934923834302696,0.0277182903710037
0.04,-0.11100538725399,0.0339282271218155
0.05,-0.126370718326235,0.0396531665476346
0.06,-0.140199480858685,0.0450291019297595
0.07,-0.152861466401824,0.0501371432068212
0.08,-0.164597396672616,0.0550302186281766
0.09,-0.175574661230117,0.0597456108119061
0.1,-0.185915571639193,0.0643108927371384
0.11,-0.195712642671583,0.0687470289511408
0.12,-0.205037838392868,0.073070317584751
0.13,-0.213948588167354,0.077293746669275
0.14,-0.22249182325637,0.0814279715426122
0.15,-0.23070679575236,0.0854820448012621
0.16,-0.238627163344557,0.0894639954642252
0.17,-0.246282614297897,0.0933813182647502
0.18,-0.253700160894007,0.097241396666781
0.19,-0.260905138641804,0.101051849249707
0.2,-0.267921899043214,0.104820767258267
0.21,-0.274774167816319,0.108556806311819
0.22,-0.2814850568535,0.112269108274776
0.23,-0.288076764090789,0.115967058640292
0.24,-0.294570054635239,0.119659921438924
0.25,-0.300983660171286,0.123356421662089
0.26,-0.30733374559368,0.127064355453325
0.27,-0.313633569389816,0.130790299418839
0.28,-0.319893409960306,0.134539463621964
0.29,-0.326120759130605,0.138315696192209
0.3,-0.332320723665643,0.14212161522782
0.31,-0.338496540961145,0.145958823839509
0.32,-0.344650108726859,0.149828158077467
0.33,-0.35078244882279,0.153729924407275
0.34,-0.356894062418435,0.157664098867999
0.35,-0.362985169541463,0.161630476118686
0.36,-0.369055850824679,0.165628768772685
0.37,-0.375106121208442,0.169658664996517
0.38,-0.381135965102092,0.1737198554663
0.39,-0.387145353975151,0.177812040520021
0.4,-0.393134257480852,0.181934926648033
0.41,-0.399102651933689,0.186088219416963
0.42,-0.405050525912935,0.190271617705815
0.43,-0.41097788180274,0.194484811794324
0.44,-0.416884733210121,0.198727485629511
0.45,-0.422771099660914,0.202999321943539
0.46,-0.428637000764065,0.207300008051362
0.47,-0.43448245199356,0.211629240158927
0.48,-0.440307463416288,0.215986724806424
0.49,-0.446112041438569,0.220372177311176
0.5,-0.45189619256546,0.224785318151019
0.51,-0.457659927610605,0.229225868796478
0.52,-0.463403264816159,0.233693548502884
0.53,-0.469126230905142,0.238188073047577
0.54,-0.474828859956215,0.242709155569234
0.55,-0.480511190745517,0.247256508938225
0.56,-0.486173263605515,0.251829848685462
0.57,-0.491815117868813,0.25642889547947
0.58,-0.49743679061941,0.261053376445123
0.59,-0.503038316918494,0.265703025121594
0.6,-0.508619731178062,0.270377580311659
0.61,-0.514181069076847,0.275076784338414
0.62,-0.519722369376403,0.279800381278083
0.63,-0.525243675253264,0.284548115657538
0.64,-0.530745035627475,0.289319732372196
0.65,-0.536226508990412,0.294114980043441
0.66,-0.541688175727255,0.29893362317436
0.67,-0.547130169928381,0.303775473343066
0.68,-0.552552747754282,0.308640455867019
0.69,-0.55795641392176,0.313528733282591
0.7,-0.563342126144559,0.318440906014828
0.71,-0.568711586750716,0.32337830116604
0.72,-0.574067610819612,0.328343342039173
0.73,-0.57941453231857,0.333339964997951
0.74,-0.584758581721332,0.338374023677144
0.75,-0.590108154353997,0.343453606008438
0.76,-0.595473896087393,0.348589194146748
0.77,-0.600868563204079,0.353793622288084
0.78,-0.606306664207923,0.359081830851929
0.79,-0.611803950028603,0.364470466976284
0.8,-0.617376862514736,0.369977422010062
0.81,-0.62304206632205,0.375621416103169
0.82,-0.628816174222212,0.381421736391784
0.83,-0.634715732893846,0.38739821017325
0.84,-0.640757480412719,0.39357145739582
0.85,-0.646958844491275,0.399963434630532
0.86,-0.653338637031608,0.406598264980214
0.87,-0.659917918214256,0.413503346786986
0.88,-0.66672105164106,0.420710751328978
0.89,-0.673777047408083,0.428258972559725
0.9,-0.681121386073938,0.436195209743437
0.91,-0.688798629740744,0.444578563193612
0.92,-0.696866259665769,0.45348481061499
0.93,-0.705400431270952,0.463013912611367
0.94,-0.714505300974947,0.473302709419652
0.95,-0.724330306177756,0.484548547415617
0.96,-0.735104867942298,0.497055457623216
0.97,-0.74720959235131,0.51132589069225
0.98,-0.761377078736094,0.528318957299412
0.99,-0.779615729154266,0.550670241871989
1,-0.809016994374947,0.587785252292473
