xi,sx,sy,cx,cy,ex,ey,ne
0,-0,0,0,0,-0,0,0
0.01,-0.024009111,-0.0303920026,-0.0062957136,-0.0080763615,-0.0177133973,-0.022315641,0.0284912667
0.02,-0.0417569933,-0.0523272733,-0.0126226144,-0.0161267721,-0.0291343789,-0.0362005011,0.046468143
0.03,-0.0558487301,-0.0693613733,-0.0189809215,-0.0241508581,-0.0368678087,-0.0452105152,0.0583371752
0.04,-0.0677985189,-0.0835463685,-0.0253708542,-0.0321482392,-0.0424276647,-0.0513981293,0.0666473887
0.05,-0.0784198162,-0.0959722794,-0.0317926324,-0.0401185287,-0.0466271838,-0.0558537507,0.072758063
0.06,-0.088124073,-0.1071811518,-0.0382464758,-0.0480613332,-0.0498775972,-0.0591198186,0.0773493869
0.07,-0.0971280604,-0.1174537476,-0.0447326044,-0.0559762524,-0.052395456,-0.0614774952,0.0807760251
0.08,-0.1055704875,-0.126969838,-0.0512512381,-0.0638628794,-0.0543192494,-0.0631069586,0.0832650532
0.09,-0.113553202,-0.135863462,-0.0578025968,-0.0717208001,-0.0557506053,-0.0641426619,0.0849847696
0.1,-0.1211520582,-0.1442361502,-0.0643869001,-0.0795495934,-0.0567651581,-0.0646865568,0.0860618022
0.11,-0.1284239278,-0.152165107,-0.0710043675,-0.0873488309,-0.0574195603,-0.0648162761,0.0865918908
0.12,-0.135412462,-0.1597099962,-0.077655218,-0.0951180771,-0.057757244,-0.064591919,0.086648804
0.13,-0.1421526145,-0.1669183436,-0.0843396702,-0.102856889,-0.0578129443,-0.0640614546,0.0862914045
0.14,-0.1486739267,-0.1738295582,-0.0910579421,-0.1105648161,-0.0576159846,-0.0632647422,0.085568857
0.15,-0.1550026028,-0.1804776021,-0.0978102509,-0.1182414002,-0.0571923518,-0.0622362019,0.0845240199
0.16,-0.1611626683,-0.1868926211,-0.1045968132,-0.1258861755,-0.0565658551,-0.0610064456,0.0831954468
0.17,-0.1671767093,-0.1931020697,-0.1114178444,-0.1334986683,-0.0557588649,-0.0596034014,0.0816187262
0.18,-0.1730663612,-0.1991315092,-0.118273559,-0.1410783971,-0.0547928023,-0.0580531121,0.0798274076
0.19,-0.1788525553,-0.2050050883,-0.1251641702,-0.1486248723,-0.0536883851,-0.056380216,0.0778535256
0.2,-0.1845555222,-0.2107457057,-0.13208989,-0.156137596,-0.0524656322,-0.0546081097,0.0757277242
0.21,-0.1901945544,-0.216374856,-0.1390509287,-0.1636160623,-0.0511436257,-0.0527587937,0.0734789817
0.22,-0.1957875576,-0.2219121977,-0.1460474951,-0.171059757,-0.0497400625,-0.0508524407,0.07113399
0.23,-0.2013505642,-0.2273750559,-0.1530797962,-0.1784681573,-0.048270768,-0.0489068986,0.0687164592
0.24,-0.2068973767,-0.2327780699,-0.160148037,-0.1858407319,-0.0467493397,-0.046937338,0.0662466185
0.25,-0.2124393751,-0.2381330266,-0.1672524202,-0.1931769409,-0.0451869549,-0.0449560857,0.0637409644
0.26,-0.2179854883,-0.2434488798,-0.1743931465,-0.2004762358,-0.0435923417,-0.042972644,0.0612122569
0.27,-0.2235423283,-0.2487319547,-0.181570414,-0.2077380592,-0.0419719144,-0.0409938955,0.0586697628
0.28,-0.2291144882,-0.2539863376,-0.1887844179,-0.2149618449,-0.0403300703,-0.0390244927,0.0561197435
0.29,-0.2347049607,-0.2592144004,-0.1960353508,-0.2221470176,-0.03866961,-0.0370673828,0.0535661237
0.3,-0.2403155644,-0.264417321,-0.203323402,-0.229292993,-0.0369921623,-0.035124328,0.0510111604
0.31,-0.2459473056,-0.2695955162,-0.2106487578,-0.2363991779,-0.0352985477,-0.0331963382,0.0484560042
0.32,-0.2516006723,-0.2747489785,-0.2180116007,-0.2434649696,-0.0335890715,-0.0312840088,0.0459011431
0.33,-0.2572758575,-0.279877518,-0.2254121097,-0.2504897564,-0.0318637478,-0.0293877617,0.0433467295
0.34,-0.2629729139,-0.2849809083,-0.2328504595,-0.257472917,-0.0301224544,-0.0275079913,0.0407927916
0.35,-0.2686918407,-0.2900589392,-0.240326821,-0.264413821,-0.0283650197,-0.0256451181,0.0382393309
0.36,-0.2744326209,-0.2951114081,-0.2478413603,-0.2713118285,-0.0265912606,-0.0237995795,0.0356863437
0.37,-0.2801952423,-0.3001380991,-0.2553942392,-0.2781662901,-0.0248010032,-0.021971809,0.0331338218
0.38,-0.2859797107,-0.3051387691,-0.2629856141,-0.2849765469,-0.0229940966,-0.0201622222,0.0305817541
0.39,-0.2917860576,-0.3101131402,-0.2706156364,-0.2917419304,-0.0211704211,-0.0183712097,0.0280301281
0.4,-0.2976143413,-0.3150608997,-0.2782844521,-0.2984617627,-0.0193298892,-0.0165991369,0.0254789317
0.41,-0.3034646423,-0.319981707,-0.2859922011,-0.3051353562,-0.0174724412,-0.0148463508,0.0229281559
0.42,-0.3093370528,-0.3248752065,-0.2937390175,-0.3117620137,-0.0155980353,-0.0131131928,0.020377795
0.43,-0.3152316652,-0.3297410416,-0.3015250288,-0.3183410286,-0.0137066364,-0.0114000131,0.0178278484
0.44,-0.3211485623,-0.3345788657,-0.309350356,-0.3248716843,-0.0117982064,-0.0097071814,0.0152783194
0.45,-0.3270878119,-0.3393883481,-0.3172151129,-0.3313532552,-0.009872699,-0.0080350928,0.0127292146
0.46,-0.3330494634,-0.3441691758,-0.3251194061,-0.3377850058,-0.0079300574,-0.00638417,0.010180542
0.47,-0.3390335487,-0.3489210509,-0.3330633345,-0.3441661912,-0.0059702142,-0.0047548598,0.0076323096
0.48,-0.3450400855,-0.3536436837,-0.341046989,-0.350496057,-0.0039930965,-0.0031476267,0.0050845229
0.49,-0.3510690834,-0.3583367819,-0.3490704522,-0.3567738396,-0.0019986312,-0.0015629423,0.0025371865
0.5,-0.3571205499,-0.3630000422,-0.3571337979,-0.362998766,1.3248e-05,-1.2762e-06,1.33093e-05
0.51,-0.3631944942,-0.3676331442,-0.3652370909,-0.3691700539,0.0020425967,0.0015369098,0.0025562263
0.52,-0.36929093,-0.3722357486,-0.3733803865,-0.3752869121,0.0040894565,0.0030511635,0.0051022792
0.53,-0.3754098759,-0.3768074989,-0.3815637305,-0.3813485403,0.0061538546,0.0045410414,0.0076479398
0.54,-0.3815513541,-0.3813480266,-0.3897871581,-0.3873541292,0.0082358039,0.0060061026,0.0101932201
0.55,-0.3877153879,-0.3858569599,-0.3980506942,-0.3933028611,0.0103353063,0.0074459012,0.0127381318
0.56,-0.3939019975,-0.390333934,-0.4063543527,-0.3991939095,0.0124523552,0.0088599756,0.0152826803
0.57,-0.4001111977,-0.3947785972,-0.4146981362,-0.4050264398,0.0145869385,0.0102478425,0.0178268632
0.58,-0.4063429956,-0.3991906144,-0.4230820355,-0.4107996089,0.0167390399,0.0116089944,0.0203706703
0.59,-0.4125973906,-0.4035696645,-0.4315060293,-0.4165125659,0.0189086387,0.0129429015,0.0229140855
0.6,-0.4188743751,-0.4079154344,-0.4399700836,-0.4221644524,0.0210957086,0.0142490179,0.02545709
0.61,-0.4251739367,-0.412227609,-0.4484741518,-0.4277544022,0.0233002151,0.0155267932,0.0279996666
0.62,-0.4314960616,-0.4165058562,-0.4570181735,-0.4332815421,0.025522112,0.0167756858,0.0305418047
0.63,-0.4378407368,-0.4207498156,-0.4656020748,-0.4387449919,0.027761338,0.0179951763,0.0330835043
0.64,-0.4442079519,-0.4249590922,-0.4742257675,-0.4441438651,0.0300178156,0.019184773,0.0356247774
0.65,-0.4505976977,-0.4291332584,-0.4828891488,-0.4494772687,0.0322914511,0.0203440103,0.0381656464
0.66,-0.4570099634,-0.4332718641,-0.4915921008,-0.4547443037,0.0345821374,0.0214724396,0.0407061407
0.67,-0.4634447318,-0.4373744536,-0.5003344904,-0.459944066,0.0368897585,0.0225696124,0.043246291
0.68,-0.4699019732,-0.441440591,-0.5091161683,-0.4650756461,0.0392141951,0.023635055,0.0457861215
0.69,-0.4763816564,-0.4454698983,-0.5179369691,-0.4701381299,0.0415553127,0.0246682316,0.0483256213
0.7,-0.4828838333,-0.4494621207,-0.526796711,-0.4751305992,0.0439128777,0.0256684785,0.0508646401
0.71,-0.4894088267,-0.4534172289,-0.5356951946,-0.4800521318,0.0462863679,0.0266349029,0.053402677
0.72,-0.4959575271,-0.4573355579,-0.5446322036,-0.4849018026,0.0486746765,0.0275662447,0.0559385554
0.73,-0.5025317964,-0.4612179828,-0.5536075035,-0.4896786836,0.0510757071,0.0284607008,0.0584699867
0.74,-0.5091349805,-0.4650661318,-0.5626208417,-0.4943818445,0.0534858612,0.0293157128,0.0609930189
0.75,-0.5157725193,-0.4688826321,-0.5716719471,-0.4990103537,0.0558994278,0.0301277216,0.063501383
0.76,-0.5224525607,-0.4726713456,-0.5807605297,-0.5035632783,0.0583079689,0.0308919328,0.0659858375
0.77,-0.529186417,-0.4764375208,-0.58988628,-0.5080396853,0.060699863,0.0316021646,0.0684336918
0.78,-0.5359888075,-0.4801878369,-0.5990488692,-0.5124386418,0.0630600617,0.0322508049,0.0708285663
0.79,-0.5428778864,-0.4839303383,-0.6082479484,-0.5167592159,0.065370062,0.0328288776,0.0731503944
0.8,-0.5498750555,-0.4876742595,-0.6174831487,-0.5210004773,0.0676080932,0.0333262178,0.0753756662
0.81,-0.5570045612,-0.4914297409,-0.6267540805,-0.525161498,0.0697495194,0.0337317571,0.0774779123
0.82,-0.5642929239,-0.4952074543,-0.6360603337,-0.5292413533,0.0717674098,0.034033899,0.079428379
0.83,-0.5717684406,-0.4990182315,-0.6454014772,-0.5332391222,0.0736330365,0.0342208907,0.0811966343
0.84,-0.5794610032,-0.502872794,-0.6547770585,-0.5371538884,0.0753160554,0.0342810944,0.0827508407
0.85,-0.5874022786,-0.5067815996,-0.6641866042,-0.540984741,0.0767843256,0.0342031414,0.0840576441
0.86,-0.595626252,-0.5107548082,-0.6736296189,-0.5447307754,0.0780033669,0.0339759672,0.085081676
0.87,-0.604170132,-0.5148023652,-0.6831055858,-0.5483910942,0.0789354539,0.033588729,0.0857846641
0.88,-0.6130756297,-0.5189342068,-0.6926139665,-0.5519648078,0.0795383367,0.033030601,0.0861241407
0.89,-0.6223908519,-0.5231606686,-0.7021542004,-0.5554510358,0.0797633485,0.0322903672,0.0860514937
0.9,-0.6321735157,-0.5274933349,-0.7117257052,-0.5588489072,0.0795521895,0.0313555724,0.0855086123
0.91,-0.6424959026,-0.5319464693,-0.7213278769,-0.5621575619,0.0788319743,0.0302110926,0.0844226882
0.92,-0.6534515912,-0.5365390409,-0.7309600894,-0.5653761513,0.0775084982,0.0288371104,0.0826991307
0.93,-0.6651639695,-0.5412973443,-0.7406216947,-0.5685038393,0.0754577252,0.027206495,0.0802126029
0.94,-0.6777965453,-0.5462582191,-0.7503120234,-0.5715398034,0.0725154781,0.0252815842,0.0767961787
0.95,-0.6915694365,-0.5514735852,-0.7600303843,-0.5744832352,0.0684609478,0.02300965,0.0722242713
0.96,-0.7068265346,-0.5570235956,-0.7697760648,-0.577333342,0.0629495301,0.0203097464,0.066144759
0.97,-0.7242291119,-0.5630508369,-0.7795483311,-0.5800893472,0.0553192191,0.0170385103,0.0578837355
0.98,-0.7451015648,-0.5698197928,-0.7893464285,-0.5827504915,0.0442448636,0.0129306987,0.0460956714
0.99,-0.7719304761,-0.5778017654,-0.7991695815,-0.5853160339,0.0272391054,0.0075142685,0.0282565585
1,-0.8090169944,-0.5877852523,-0.8090169944,-0.5877852523,0,-0,0
