xi,sx,sy,cx,cy,ex,ey,ne
0,0,0,0,0,0,0,0
0.01,-0.0098310884,0.0025306791,-0.0098474129,0.0024692184,1.63244e-05,6.14606e-05,6.35916e-05
0.02,-0.0196431634,0.0051374606,-0.0196705659,0.0050347608,2.74025e-05,0.0001026999,0.0001062928
0.03,-0.0294344088,0.007823922,-0.0294686633,0.0076959051,3.42545e-05,0.0001280169,0.0001325205
0.04,-0.0392031624,0.0105929577,-0.0392409296,0.0104519103,3.77673e-05,0.0001410474,0.0001460162
0.05,-0.0489479041,0.0134468567,-0.0489866101,0.0133020171,3.8706e-05,0.0001448396,0.0001499222
0.06,-0.0586672466,0.0163873724,-0.058704971,0.0162454489,3.77244e-05,0.0001419235,0.0001468516
0.07,-0.0683599247,0.0194157872,-0.0683952997,0.019281413,3.5375e-05,0.0001343742,0.0001389526
0.08,-0.0780247858,0.0225329712,-0.078056905,0.022409101,3.21192e-05,0.0001238702,0.0001279667
0.09,-0.0876607815,0.025739436,-0.0876891175,0.0256276904,2.8336e-05,0.0001117456,0.0001152823
0.1,-0.0972669581,0.0290353831,-0.0972912891,0.0289363451,2.43311e-05,9.9038e-05,0.000101983
0.11,-0.1068424489,0.0324207483,-0.106862794,0.0323342165,2.03451e-05,8.65318e-05,8.88914e-05
0.12,-0.1163864666,0.0358952411,-0.1164030279,0.0358204444,1.65613e-05,7.47966e-05,7.66081e-05
0.13,-0.1258982956,0.0394583805,-0.1259114085,0.0393941581,1.3113e-05,6.42224e-05,6.55474e-05
0.14,-0.1353772853,0.0431095272,-0.1353873755,0.0430544769,1.00902e-05,5.50503e-05,5.59674e-05
0.15,-0.1448228441,0.0468479116,-0.1448303902,0.0468005113,7.5461e-06,4.74003e-05,4.79972e-05
0.16,-0.154234433,0.0506726595,-0.1542399358,0.0506313639,5.5028e-06,4.12956e-05,4.16606e-05
0.17,-0.1636115603,0.054582814,-0.1636155172,0.0545461301,3.957e-06,3.66839e-05,3.68967e-05
0.18,-0.1729537763,0.058577355,-0.1729566607,0.058543899,2.8844e-06,3.3456e-05,3.35801e-05
0.19,-0.182260669,0.0626552164,-0.1822629139,0.0626237543,2.2448e-06,3.14621e-05,3.15421e-05
0.2,-0.1915318598,0.0668153003,-0.1915338457,0.066784775,1.9859e-06,3.05253e-05,3.05898e-05
0.21,-0.2007669993,0.0710564899,-0.200769046,0.0710260364,2.0467e-06,3.04535e-05,3.05222e-05
0.22,-0.209965764,0.0753776595,-0.2099681252,0.0753466105,2.3613e-06,3.10491e-05,3.11387e-05
0.23,-0.2191278533,0.0797776838,-0.2191307144,0.079745567,2.8611e-06,3.21168e-05,3.2244e-05
0.24,-0.2282529868,0.0842554445,-0.2282564647,0.084221974,3.4779e-06,3.34705e-05,3.36507e-05
0.25,-0.2373409017,0.0888098364,-0.2373450472,0.0887748986,4.1455e-06,3.49378e-05,3.51829e-05
0.26,-0.2463913507,0.0934397719,-0.2463961527,0.0934034078,4.802e-06,3.63641e-05,3.66798e-05
0.27,-0.2554041003,0.098144184,-0.2554094909,0.0981065687,5.3906e-06,3.76153e-05,3.79996e-05
0.28,-0.2643789294,0.1029220288,-0.2643847908,0.1028834497,5.8614e-06,3.85792e-05,3.90219e-05
0.29,-0.273315628,0.1077722869,-0.2733217997,0.1077331205,6.1717e-06,3.91664e-05,3.96497e-05
0.3,-0.2822139961,0.112693964,-0.2822202834,0.1126546531,6.2873e-06,3.93109e-05,3.98105e-05
0.31,-0.2910738432,0.1176860911,-0.2910800252,0.1176471224,6.182e-06,3.89687e-05,3.9456e-05
0.32,-0.2998949876,0.1227477237,-0.2999008261,0.1227096062,5.8385e-06,3.81175e-05,3.85621e-05
0.33,-0.3086772563,0.1278779412,-0.308682504,0.1278411863,5.2478e-06,3.67549e-05,3.71277e-05
0.34,-0.3174204844,0.1330758453,-0.3174248935,0.1330409486,4.4091e-06,3.48967e-05,3.51742e-05
0.35,-0.3261245158,0.1383405583,-0.3261278456,0.1383079836,3.3298e-06,3.25747e-05,3.27444e-05
0.36,-0.3347892026,0.1436712216,-0.3347912269,0.1436413872,2.0242e-06,2.98344e-05,2.9903e-05
0.37,-0.3434144062,0.1490669935,-0.3434149196,0.1490402603,5.134e-07,2.67331e-05,2.6738e-05
0.38,-0.3519999967,0.1545270471,-0.3519988209,0.1545037102,-1.1759e-06,2.33369e-05,2.33665e-05
0.39,-0.3605458543,0.1600505687,-0.3605428426,0.1600308501,-3.0117e-06,1.97186e-05,1.99473e-05
0.4,-0.3690518692,0.165636755,-0.3690469107,0.1656207999,-4.9584e-06,1.59551e-05,1.67078e-05
0.41,-0.3775179422,0.1712848118,-0.3775109651,0.1712726864,-6.9771e-06,1.21254e-05,1.39895e-05
0.42,-0.3859439859,0.1769939517,-0.3859349589,0.1769856434,-9.027e-06,8.3082e-06,1.22684e-05
0.43,-0.3943299242,0.1827633924,-0.3943188582,0.1827588125,-1.1066e-05,4.5799e-06,1.19763e-05
0.44,-0.4026756941,0.1885923556,-0.4026626417,0.1885913427,-1.30524e-05,1.0129e-06,1.30916e-05
0.45,-0.4109812453,0.1944800649,-0.4109663002,0.1944823912,-1.4945e-05,-2.3262e-06,1.5125e-05
0.46,-0.4192465412,0.2004257451,-0.4192298363,0.2004311231,-1.67049e-05,-5.378e-06,1.75493e-05
0.47,-0.4274715596,0.2064286209,-0.4274532639,0.206436712,-1.82956e-05,-8.0912e-06,2.00049e-05
0.48,-0.4356562923,0.2124879163,-0.4356366078,0.2124983402,-1.96844e-05,-1.04238e-05,2.2274e-05
0.49,-0.4438007463,0.2186028544,-0.4437799035,0.2186151984,-2.08428e-05,-1.23439e-05,2.42238e-05
0.5,-0.4519049436,0.2247726565,-0.4518831965,0.2247864863,-2.17471e-05,-1.38298e-05,2.57721e-05
0.51,-0.4599689215,0.2309965422,-0.4599465422,0.2310114127,-2.23793e-05,-1.48705e-05,2.68694e-05
0.52,-0.4679927325,0.23727373,-0.4679700053,0.2372891953,-2.27272e-05,-1.54653e-05,2.749e-05
0.53,-0.4759764444,0.2436034372,-0.4759536599,0.2436190611,-2.27846e-05,-1.5624e-05,2.76269e-05
0.54,-0.4839201401,0.2499848804,-0.4838975883,0.2500002465,-2.25518e-05,-1.53661e-05,2.72892e-05
0.55,-0.4918239171,0.2564172769,-0.4918018815,0.2564319971,-2.20356e-05,-1.47202e-05,2.65e-05
0.56,-0.4996878872,0.2628998449,-0.4996666384,0.2629135679,-2.12488e-05,-1.37231e-05,2.5295e-05
0.57,-0.5075121762,0.2694318048,-0.5074919656,0.2694442237,-2.02106e-05,-1.24189e-05,2.37212e-05
0.58,-0.5152969225,0.2760123809,-0.5152779769,0.2760232386,-1.89456e-05,-1.08576e-05,2.18363e-05
0.59,-0.5230422772,0.282640802,-0.5230247933,0.2826498961,-1.74839e-05,-9.094e-06,1.97076e-05
0.6,-0.5307484022,0.2893163033,-0.5307325423,0.2893234896,-1.58599e-05,-7.1863e-06,1.74121e-05
0.61,-0.5384154702,0.2960381276,-0.5384013579,0.2960433219,-1.41122e-05,-5.1943e-06,1.50378e-05
0.62,-0.5460436624,0.302805527,-0.5460313803,0.3028087054,-1.22821e-05,-3.1784e-06,1.26867e-05
0.63,-0.5536331682,0.3096177645,-0.5536227552,0.3096189622,-1.0413e-05,-1.1977e-06,1.04817e-05
0.64,-0.5611841835,0.316474115,-0.561175634,0.3164734238,-8.5495e-06,6.913e-07,8.5774e-06
0.65,-0.5686969091,0.3233738675,-0.5686901734,0.3233714313,-6.7357e-06,2.4362e-06,7.1627e-06
0.66,-0.5761715494,0.3303163256,-0.5761665349,0.3303123353,-5.0146e-06,3.9903e-06,6.4085e-06
0.67,-0.5836083112,0.3373008098,-0.5836048847,0.3372954959,-3.4265e-06,5.3138e-06,6.3228e-06
0.68,-0.5910074016,0.3443266575,-0.5910053936,0.3443202827,-2.0079e-06,6.3748e-06,6.6836e-06
0.69,-0.598369027,0.3513932249,-0.5983682365,0.3513860744,-7.904e-07,7.1506e-06,7.1941e-06
0.7,-0.6056933915,0.3584998874,-0.6056935923,0.3584922593,2.009e-07,7.6281e-06,7.6308e-06
0.71,-0.6129806954,0.36564604,-0.6129816436,0.3656382347,9.482e-07,7.8052e-06,7.8626e-06
0.72,-0.6202311341,0.3728310979,-0.6202325765,0.3728234074,1.4424e-06,7.6905e-06,7.8246e-06
0.73,-0.627444897,0.3800544967,-0.6274465804,0.3800471931,1.6834e-06,7.3036e-06,7.4951e-06
0.74,-0.6346221661,0.3873156917,-0.6346238479,0.3873090165,1.6817e-06,6.6752e-06,6.8838e-06
0.75,-0.6417631159,0.3946141579,-0.6417645742,0.3946083114,1.4583e-06,5.8465e-06,6.0256e-06
0.76,-0.6488679124,0.4019493887,-0.6488689574,0.4019445204,1.045e-06,4.8683e-06,4.9792e-06
0.77,-0.6559367131,0.4093208953,-0.6559371982,0.409317095,4.85e-07,3.8003e-06,3.8311e-06
0.78,-0.6629696675,0.4167282046,-0.6629694992,0.4167254953,-1.682e-07,2.7093e-06,2.7145e-06
0.79,-0.6699669169,0.4241708575,-0.6699660657,0.4241691899,-8.513e-07,1.6675e-06,1.8723e-06
0.8,-0.6769285965,0.4316484068,-0.6769271044,0.4316476563,-1.4921e-06,7.505e-07,1.6702e-06
0.81,-0.6838548361,0.4391604146,-0.6838528242,0.43916038,-2.012e-06,3.46e-08,2.0123e-06
0.82,-0.6907457629,0.4467064489,-0.6907434354,0.4467068552,-2.3275e-06,-4.063e-07,2.3627e-06
0.83,-0.6976015041,0.4542860807,-0.69759915,0.454286584,-2.3541e-06,-5.033e-07,2.4073e-06
0.84,-0.7044221906,0.46189888,-0.7044201812,0.4618990768,-2.0094e-06,-1.969e-07,2.019e-06
0.85,-0.7112079613,0.4695444116,-0.7112067434,0.4695438521,-1.2179e-06,5.595e-07,1.3402e-06
0.86,-0.7179589687,0.4772222311,-0.7179590523,0.4772204362,8.36e-08,1.7949e-06,1.7968e-06
0.87,-0.7246753848,0.4849318796,-0.7246773242,0.4849283633,1.9394e-06,3.5163e-06,4.0157e-06
0.88,-0.7313574087,0.4926728791,-0.7313617764,0.4926671752,4.3676e-06,5.7039e-06,7.1841e-06
0.89,-0.7380052754,0.5004447269,-0.7380126269,0.5004364214,7.3515e-06,8.3055e-06,1.10917e-05
0.9,-0.7446192648,0.50824689,-0.7446300943,0.5082356589,1.08295e-05,1.12311e-05,1.56018e-05
0.91,-0.7511997135,0.5160787997,-0.7512143976,0.5160644522,1.46841e-05,1.43475e-05,2.05298e-05
0.92,-0.7577470273,0.5239398452,-0.7577657563,0.5239223729,1.8729e-05,1.74723e-05,2.56136e-05
0.93,-0.764261695,0.531829368,-0.76428439,0.5318089999,2.2695e-05,2.03681e-05,3.04947e-05
0.94,-0.7707443044,0.5397466555,-0.7707705186,0.5397239191,2.62142e-05,2.27364e-05,3.47006e-05
0.95,-0.77719556,0.5476909354,-0.777224362,0.5476667236,2.8802e-05,2.42119e-05,3.76267e-05
0.96,-0.7836163026,0.5556613693,-0.7836461401,0.5556370131,2.98375e-05,2.43562e-05,3.85163e-05
0.97,-0.7900075307,0.5636570469,-0.7900360729,0.5636343942,2.85422e-05,2.26527e-05,3.64391e-05
0.98,-0.7963704242,0.5716769811,-0.79639438,0.5716584801,2.39558e-05,1.85009e-05,3.02682e-05
0.99,-0.8027063708,0.5797201019,-0.8027212808,0.5797088908,1.49099e-05,1.12111e-05,1.86546e-05
1,-0.8090169944,0.5877852523,-0.8090169944,0.5877852523,-0,-0,0
