xi,s1,s2
0,0,0
0.01,0.00961304866315409,-0.00348100407180598
0.02,0.019247970725922,-0.00689944538335712
0.03,0.0289044684837811,-0.01025490046537
0.04,0.038582236674334,-0.0135469498111234
0.05,0.0482809624885891,-0.0167751781013639
0.06,0.0580003255883109,-0.0199391744307792
0.07,0.0677399981295629,-0.0230385325358019
0.08,0.0774996447925722,-0.0260728510235236
0.09,0.0872789228180264,-0.029041733601463
0.1,0.0970774820499102,-0.0319447893079493
0.11,0.106894964984981,-0.034781632742854
0.12,0.116731006828972,-0.0375518842984083
0.13,0.126585235559601,-0.040255170389832
0.14,0.136457271996451,-0.0428911236854942
0.15,0.146346729877796,-0.0454593833363163
0.16,0.156253215944388,-0.0479595952041291
0.17,0.16617633003028,-0.0503914120886839
0.18,0.176115665160678,-0.0527544939530136
0.19,0.186070807656846,-0.0550485081468445
0.2,0.196041337248067,-0.0572731296277364
0.21,0.206026827190629,-0.0594280411796539
0.22,0.216026844393835,-0.0615129336286418
0.23,0.226040949552963,-0.0635275060552938
0.24,0.236068697289157,-0.0654714660037003
0.25,0.246109636296146,-0.0673445296865529
0.26,0.256163309493736,-0.0691464221860978
0.27,0.266229254187956,-0.0708768776506172
0.28,0.276307002237771,-0.0725356394861339
0.29,0.286396080228206,-0.0741224605430286
0.3,0.296496009649772,-0.0756371032972669
0.31,0.306606307084021,-0.0770793400259411
0.32,0.316726484395068,-0.0784489529768295
0.33,0.326856048926901,-0.0797457345316937
0.34,0.336994503706282,-0.080969487363033
0.35,0.347141347651031,-0.082120024584027
0.36,0.357296075783474,-0.08319716989141
0.37,0.367458179448821,-0.0842007577010217
0.38,0.377627146538229,-0.0851306332758023
0.39,0.387802461716294,-0.0859866528459988
0.4,0.397983606652703,-0.0867686837213707
0.41,0.408170060257771,-0.0874766043951944
0.42,0.41836129892157,-0.0881103046398726
0.43,0.428556796756361,-0.0886696855939812
0.44,0.438756025842019,-0.0891546598405905
0.45,0.448958456474134,-0.089565151476716
0.46,0.459163557414483,-0.0899010961737751
0.47,0.469370796143525,-0.0901624412289316
0.48,0.479579639114612,-0.0903491456072381
0.49,0.489789552009562,-0.0904611799744949
0.5,0.49999999999526,-0.0904985267207638
0.51,0.510210447980959,-0.0904611799744949
0.52,0.520420360875908,-0.0903491456072381
0.53,0.530629203846995,-0.0901624412289316
0.54,0.540836442576037,-0.0899010961737749
0.55,0.551041543516386,-0.089565151476716
0.56,0.561243974148502,-0.0891546598405905
0.57,0.571443203234159,-0.0886696855939812
0.58,0.58163870106895,-0.0881103046398725
0.59,0.591829939732749,-0.0874766043951944
0.6,0.602016393337817,-0.0867686837213707
0.61,0.612197538274226,-0.0859866528459986
0.62,0.622372853452292,-0.0851306332758023
0.63,0.6325418205417,-0.0842007577010217
0.64,0.642703924207047,-0.0831971698914098
0.65,0.652858652339489,-0.0821200245840268
0.66,0.663005496284238,-0.0809694873630328
0.67,0.673143951063619,-0.0797457345316937
0.68,0.683273515595452,-0.0784489529768295
0.69,0.6933936929065,-0.0770793400259411
0.7,0.703503990340749,-0.0756371032972669
0.71,0.713603919762315,-0.0741224605430284
0.72,0.72369299775275,-0.0725356394861339
0.73,0.733770745802564,-0.0708768776506172
0.74,0.743836690496785,-0.0691464221860978
0.75,0.753890363694374,-0.0673445296865527
0.76,0.763931302701363,-0.0654714660037
0.77,0.773959050437557,-0.0635275060552936
0.78,0.783973155596686,-0.0615129336286416
0.79,0.793973172799891,-0.0594280411796537
0.8,0.803958662742454,-0.0572731296277362
0.81,0.813929192333674,-0.0550485081468443
0.82,0.823884334829843,-0.0527544939530136
0.83,0.83382366996024,-0.0503914120886837
0.84,0.843746784046133,-0.0479595952041289
0.85,0.853653270112725,-0.0454593833363161
0.86,0.863542727994069,-0.042891123685494
0.87,0.87341476443092,-0.0402551703898318
0.88,0.883268993161548,-0.0375518842984079
0.89,0.893105035005539,-0.0347816327428538
0.9,0.90292251794061,-0.0319447893079491
0.91,0.912721077172494,-0.0290417336014627
0.92,0.922500355197948,-0.0260728510235234
0.93,0.932260001860958,-0.0230385325358019
0.94,0.94199967440221,-0.0199391744307788
0.95,0.951719037501931,-0.0167751781013639
0.96,0.961417763316186,-0.013546949811123
0.97,0.971095531506739,-0.01025490046537
0.98,0.980752029264598,-0.00689944538335691
0.99,0.990386951327366,-0.00348100407180577
1,0.99999999999052,2.09161433216126e-16
