xi,s1,s2
0,-1.29687168490153e-26,2.03522910406924e-28
0.01,0.00775742412306149,-0.0483777140672855
0.02,0.0125156365335603,-0.0771397996713161
0.03,0.0162500543798871,-0.0992098187018355
0.04,0.0194639116438363,-0.117859317643869
0.05,0.0223431561550512,-0.134297761451735
0.06,0.0249849624218023,-0.149160318609489
0.07,0.0274473907369077,-0.162827139848669
0.08,0.0297682499775439,-0.175545535533771
0.09,0.0319738766393135,-0.187487661515718
0.1,0.0340834816219582,-0.198779236242339
0.11,0.0361115607489829,-0.209515318495512
0.12,0.0380693702671849,-0.219769829876229
0.13,0.0399658702965948,-0.229601616757726
0.14,0.0418083445432766,-0.239058468517024
0.15,0.0436028250245094,-0.248179908789303
0.16,0.0453544016888613,-0.256999230017904
0.17,0.0470674651535732,-0.26554504458521
0.18,0.0487459103750172,-0.273842519198633
0.19,0.0503933149103451,-0.28191439286705
0.2,0.0520130947932285,-0.289781825861077
0.21,0.0536086334849174,-0.297465083857367
0.22,0.0551833752153831,-0.304984032438812
0.23,0.0567408736894976,-0.312358407291867
0.24,0.0582847906759778,-0.319607837659994
0.25,0.0598188455846948,-0.326751631396099
0.26,0.061346725020052,-0.333808369491538
0.27,0.0628719684074435,-0.340795394236085
0.28,0.0643978500804304,-0.347728296264694
0.29,0.065927278160014,-0.354620502814201
0.3,0.0674627261183051,-0.361483042508807
0.31,0.0690062055533255,-0.368324519699979
0.32,0.0705592803835224,-0.375151285645987
0.33,0.0721231153889256,-0.381967756528979
0.34,0.0736985473971755,-0.388776808876956
0.35,0.0752861659773669,-0.395580183580676
0.36,0.0768863917272109,-0.40237884536065
0.37,0.0784995432103111,-0.409173267735669
0.38,0.0801258873822507,-0.415963636639183
0.39,0.0817656720958036,-0.422749982536026
0.4,0.0834191424381537,-0.429532258810634
0.41,0.085086544949986,-0.436310384818617
0.42,0.0867681250294159,-0.443084268155676
0.43,0.0884641228768154,-0.44985381533236
0.44,0.0901747721466895,-0.45661893560469
0.45,0.0919003033217992,-0.463379540274559
0.46,0.0936409513196842,-0.470135539035604
0.47,0.0953969647019524,-0.476886835116957
0.48,0.0971686127906713,-0.483633321253055
0.49,0.0989561874963785,-0.490374878235639
0.5,0.1007599985985,-0.497111376825288
0.51,0.102580363838582,-0.503842682444162
0.52,0.104417597521347,-0.510568660837972
0.53,0.106272002407076,-0.517289182285104
0.54,0.108143868845036,-0.524004122299966
0.55,0.110033482487208,-0.530713358061219
0.56,0.111941138501644,-0.537416761507948
0.57,0.113867157227356,-0.544114191556996
0.58,0.115811894921548,-0.550805488580913
0.59,0.117775744528558,-0.557490473761601
0.6,0.119759125090998,-0.564168954491467
0.61,0.12176246333013,-0.570840735600915
0.62,0.123786175486816,-0.577505636052162
0.63,0.125830660183256,-0.584163513018027
0.64,0.127896312688589,-0.590814300508307
0.65,0.129983567559416,-0.5974580766885
0.66,0.132092971351984,-0.604095179754501
0.67,0.134225281541303,-0.610726393067846
0.68,0.136381583510375,-0.617353212707306
0.69,0.138563415674212,-0.623978192732342
0.7,0.140772893532113,-0.63060533794329
0.71,0.143012825620168,-0.637240488005156
0.72,0.145286816495524,-0.643891619305158
0.73,0.147599352577033,-0.650568990521743
0.74,0.14995586504374,-0.657285080305568
0.75,0.152362760925468,-0.664054307856292
0.76,0.154827411602852,-0.670892578102381
0.77,0.157358090356497,-0.677816738267525
0.78,0.159963860438218,-0.684844057569179
0.79,0.162654433741656,-0.69199183647926
0.8,0.165440043954993,-0.699277218056161
0.81,0.168331398583984,-0.706717224838353
0.82,0.171339781238516,-0.714328998280019
0.83,0.174477359304166,-0.722130191218209
0.84,0.177757708544088,-0.730139469868563
0.85,0.181196507827361,-0.738377118326003
0.86,0.184812313148042,-0.74686578896514
0.87,0.188627325189571,-0.75563148495684
0.88,0.192668152524541,-0.764704876005338
0.89,0.196966759757821,-0.774123031458821
0.9,0.20156204422569,-0.783931649582287
0.91,0.206502725027785,-0.794187958765
0.92,0.211852357045149,-0.80496477343121
0.93,0.21769725220757,-0.816356835672525
0.94,0.224158337424379,-0.828491902274085
0.95,0.231410335749852,-0.841551983417555
0.96,0.23971935350759,-0.85581624082514
0.97,0.249527584789248,-0.87174902465369
0.98,0.261687596478619,-0.890222935574796
0.99,0.278520028751563,-0.913572259766897
1,0.309016994374947,-0.951056516295154
