x,y,z,u,v,w
-0.306123526936535,0.592689850636552,0.0117002451130344,-0.82067374864636,-0.451605020789657,-0.350067855537044
-0.306123526936535,0.592689850636552,0.0117002451130344,0.514374942070806,-0.850681351265771,-0.108441954880469
-0.306123526936535,0.592689850636552,0.0117002451130344,-0.248823265094698,-0.269061598535012,0.930426159854396
