x,z
0,-0
0.0389,-0.0004
0.0682,-0.0007
0.0916,-0.0009
0.1113,-0.0011
0.1286,-0.0013
0.1443,-0.0015
0.1588,-0.0016
0.1723,-0.0017
0.185,-0.0018
0.197,-0.0019
0.2084,-0.002
0.2193,-0.0021
0.2298,-0.0022
0.2398,-0.0022
0.2496,-0.0023
0.259,-0.0024
0.2681,-0.0024
0.2769,-0.0025
0.2856,-0.0026
0.294,-0.0026
0.3021,-0.0027
0.3102,-0.0027
0.318,-0.0027
0.3256,-0.0028
0.3332,-0.0028
0.3405,-0.0029
0.3478,-0.0029
0.3549,-0.0029
0.362,-0.0029
0.3689,-0.003
0.3758,-0.003
0.3825,-0.003
0.3893,-0.003
0.3959,-0.0031
0.4025,-0.0031
0.4091,-0.0031
0.4157,-0.0031
0.4222,-0.0031
0.4287,-0.0032
0.4352,-0.0032
0.4417,-0.0032
0.4482,-0.0032
0.4547,-0.0032
0.4612,-0.0032
0.4676,-0.0032
0.4741,-0.0032
0.4806,-0.0032
0.4871,-0.0032
0.4935,-0.0032
0.5,-0.0032
0.5065,-0.0032
0.5129,-0.0032
0.5194,-0.0032
0.5259,-0.0032
0.5324,-0.0032
0.5388,-0.0032
0.5453,-0.0032
0.5518,-0.0032
0.5583,-0.0032
0.5648,-0.0032
0.5713,-0.0032
0.5778,-0.0031
0.5843,-0.0031
0.5909,-0.0031
0.5975,-0.0031
0.6041,-0.0031
0.6107,-0.003
0.6175,-0.003
0.6242,-0.003
0.6311,-0.003
0.638,-0.0029
0.6451,-0.0029
0.6522,-0.0029
0.6595,-0.0029
0.6668,-0.0028
0.6744,-0.0028
0.682,-0.0027
0.6898,-0.0027
0.6979,-0.0027
0.706,-0.0026
0.7144,-0.0026
0.7231,-0.0025
0.7319,-0.0024
0.741,-0.0024
0.7504,-0.0023
0.7602,-0.0022
0.7702,-0.0022
0.7807,-0.0021
0.7916,-0.002
0.803,-0.0019
0.815,-0.0018
0.8277,-0.0017
0.8412,-0.0016
0.8557,-0.0015
0.8714,-0.0013
0.8887,-0.0011
0.9084,-0.0009
0.9318,-0.0007
0.9611,-0.0004
1,0
