x,z
0,-0
0.0064,-0.0774
0.0121,-0.1358
0.0177,-0.1823
0.0233,-0.2213
0.0292,-0.2555
0.0354,-0.2863
0.042,-0.3144
0.0488,-0.3405
0.0559,-0.3649
0.0633,-0.3877
0.071,-0.4092
0.079,-0.4295
0.0872,-0.4487
0.0957,-0.467
0.1045,-0.4844
0.1134,-0.501
0.1226,-0.5167
0.1319,-0.5318
0.1415,-0.5461
0.1512,-0.5598
0.1611,-0.5728
0.1712,-0.5853
0.1814,-0.5971
0.1918,-0.6084
0.2022,-0.6192
0.2128,-0.6295
0.2236,-0.6392
0.2344,-0.6485
0.2454,-0.6573
0.2565,-0.6657
0.2677,-0.6736
0.279,-0.6811
0.2904,-0.6882
0.3019,-0.6948
0.3136,-0.7011
0.3254,-0.707
0.3373,-0.7124
0.3494,-0.7175
0.3615,-0.7222
0.3738,-0.7265
0.3862,-0.7304
0.3986,-0.7339
0.4112,-0.7371
0.4239,-0.7398
0.4366,-0.7421
0.4494,-0.744
0.4623,-0.7454
0.4752,-0.7465
0.4881,-0.7471
0.501,-0.7474
0.514,-0.7472
0.5269,-0.7466
0.5398,-0.7455
0.5527,-0.7441
0.5655,-0.7422
0.5782,-0.7399
0.5909,-0.7373
0.6035,-0.7342
0.616,-0.7307
0.6284,-0.7268
0.6406,-0.7225
0.6528,-0.7178
0.6648,-0.7128
0.6768,-0.7073
0.6886,-0.7015
0.7002,-0.6952
0.7118,-0.6886
0.7232,-0.6815
0.7346,-0.674
0.7458,-0.6661
0.7568,-0.6578
0.7678,-0.649
0.7787,-0.6397
0.7894,-0.6299
0.8,-0.6197
0.8105,-0.6089
0.8208,-0.5976
0.831,-0.5857
0.8411,-0.5733
0.851,-0.5602
0.8607,-0.5465
0.8702,-0.5322
0.8796,-0.5171
0.8887,-0.5014
0.8976,-0.4848
0.9063,-0.4674
0.9148,-0.4491
0.923,-0.4298
0.9309,-0.4095
0.9385,-0.388
0.9459,-0.3651
0.9529,-0.3408
0.9596,-0.3146
0.966,-0.2864
0.9721,-0.2557
0.9778,-0.2215
0.9833,-0.1824
0.9886,-0.1359
0.994,-0.0775
1,-0
