x,z
0,0
0.0254,-0.0297
0.0456,-0.0512
0.0625,-0.0675
0.0775,-0.0805
0.0912,-0.0912
0.1042,-0.1001
0.1167,-0.1075
0.1288,-0.1135
0.1407,-0.1181
0.1523,-0.1214
0.1635,-0.1236
0.1744,-0.1246
0.185,-0.1246
0.195,-0.1237
0.2046,-0.1219
0.2137,-0.1193
0.2223,-0.1161
0.2303,-0.1123
0.2379,-0.108
0.2449,-0.1033
0.2514,-0.0983
0.2575,-0.093
0.2631,-0.0875
0.2683,-0.0818
0.2732,-0.0761
0.2777,-0.0702
0.2819,-0.0642
0.2859,-0.0582
0.2896,-0.0522
0.2931,-0.0462
0.2965,-0.0401
0.2996,-0.0341
0.3027,-0.028
0.3056,-0.022
0.3084,-0.016
0.3112,-0.0099
0.3139,-0.0039
0.3165,0.0022
0.319,0.0082
0.3215,0.0143
0.324,0.0203
0.3264,0.0264
0.3288,0.0325
0.3312,0.0386
0.3335,0.0447
0.3358,0.0508
0.3381,0.0569
0.3404,0.063
0.3427,0.0691
0.345,0.0752
0.3472,0.0814
0.3494,0.0875
0.3516,0.0937
0.3537,0.0998
0.3558,0.106
0.3579,0.1122
0.36,0.1184
0.362,0.1246
0.364,0.1309
0.366,0.1371
0.3679,0.1434
0.3698,0.1497
0.3717,0.156
0.3735,0.1624
0.3753,0.1688
0.3771,0.1752
0.3789,0.1818
0.3806,0.1883
0.3823,0.195
0.3839,0.2017
0.3856,0.2085
0.3872,0.2155
0.3887,0.2225
0.3903,0.2297
0.3918,0.237
0.3933,0.2445
0.3947,0.2521
0.3961,0.2599
0.3975,0.2679
0.3989,0.276
0.4002,0.2844
0.4015,0.2931
0.4028,0.302
0.404,0.3111
0.4052,0.3206
0.4064,0.3304
0.4076,0.3405
0.4087,0.3511
0.4098,0.3621
0.411,0.3736
0.4121,0.3857
0.4132,0.3986
0.4143,0.4122
0.4154,0.4268
0.4167,0.4427
0.418,0.4603
0.4195,0.4803
0.4213,0.504
0.4236,0.5338
0.4268,0.5732
