xi,s1,s2
0,2.12187922653e-26,9.3845126923722e-28
0.01,0.0229643302181811,-0.00801166423605445
0.02,0.0437721452174469,-0.0150687198927867
0.03,0.0626183507018718,-0.0212602920675676
0.04,0.0796978523755299,-0.026675505857768
0.05,0.0952055559424954,-0.0314034863607587
0.06,0.109336367106842,-0.0355333586739105
0.07,0.122285191572645,-0.0391542478945944
0.08,0.134246935043978,-0.042355279120181
0.09,0.145416503224915,-0.0452255774480412
0.1,0.155988801819531,-0.047854267975546
0.11,0.166133109541576,-0.0503173479327221
0.12,0.17591619714351,-0.0526383030802207
0.13,0.18537920838747,-0.0548274913113489
0.14,0.19456328703559,-0.0568952705194139
0.15,0.203509576850009,-0.0588519985977228
0.16,0.212259221592862,-0.0607080334395828
0.17,0.220853365026286,-0.062473732938301
0.18,0.229333150912416,-0.0641594549871846
0.19,0.23773972301339,-0.0657755574795407
0.2,0.246114225091343,-0.0673323983086766
0.21,0.254490892225734,-0.0688385729471417
0.22,0.262876324765312,-0.0702956271844555
0.23,0.27127021437615,-0.07170334438938
0.24,0.279672252724317,-0.0730615079306769
0.25,0.288082131475886,-0.0743699011771083
0.26,0.296499542296928,-0.0756283074974358
0.27,0.304924176853514,-0.0768365102604215
0.28,0.313355726811716,-0.0779942928348271
0.29,0.321793883837606,-0.0791014385894146
0.3,0.330238339597254,-0.0801577308929459
0.31,0.338688789374631,-0.081162982334997
0.32,0.347144942925301,-0.0821171223884006
0.33,0.355606513622727,-0.0830201097468036
0.34,0.364073214840372,-0.083871903103853
0.35,0.372544759951698,-0.0846724611531956
0.36,0.381020862330169,-0.0854217425884783
0.37,0.389501235349247,-0.086119706103348
0.38,0.397985592382395,-0.0867663103914516
0.39,0.406473646803076,-0.0873615141464361
0.4,0.414965111984753,-0.0879052760619482
0.41,0.423459697003071,-0.0883975510634647
0.42,0.431957093742401,-0.0888382790037811
0.43,0.440456989789298,-0.0892273959675225
0.44,0.448959072730316,-0.0895648380393143
0.45,0.45746303015201,-0.0898505413037816
0.46,0.465968549640933,-0.0900844418455498
0.47,0.474475318783639,-0.0902664757492441
0.48,0.482983025166683,-0.0903965790994898
0.49,0.491491356376619,-0.0904746879809119
0.5,0.5,-0.0905007384781359
0.51,0.508508643623382,-0.0904746879809119
0.52,0.517016974833317,-0.0903965790994898
0.53,0.525524681216361,-0.0902664757492441
0.54,0.534031450359067,-0.0900844418455498
0.55,0.54253696984799,-0.0898505413037816
0.56,0.551040927269684,-0.0895648380393142
0.57,0.559543010210702,-0.0892273959675225
0.58,0.568042906257599,-0.0888382790037811
0.59,0.57654030299693,-0.0883975510634647
0.6,0.585034888015247,-0.0879052760619482
0.61,0.593526353196924,-0.0873615141464361
0.62,0.602014407617605,-0.0867663103914516
0.63,0.610498764650753,-0.086119706103348
0.64,0.618979137669831,-0.0854217425884782
0.65,0.627455240048302,-0.0846724611531956
0.66,0.635926785159628,-0.083871903103853
0.67,0.644393486377273,-0.0830201097468036
0.68,0.652855057074699,-0.0821171223884006
0.69,0.661311210625369,-0.081162982334997
0.7,0.669761660402746,-0.0801577308929459
0.71,0.678206116162394,-0.0791014385894146
0.72,0.686644273188283,-0.0779942928348271
0.73,0.695075823146486,-0.0768365102604214
0.74,0.703500457703072,-0.0756283074974358
0.75,0.711917868524114,-0.0743699011771083
0.76,0.720327747275683,-0.0730615079306769
0.77,0.72872978562385,-0.07170334438938
0.78,0.737123675234687,-0.0702956271844555
0.79,0.745509107774266,-0.0688385729471417
0.8,0.753885774908657,-0.0673323983086765
0.81,0.76226027698661,-0.0657755574795407
0.82,0.770666849087584,-0.0641594549871846
0.83,0.779146634973714,-0.062473732938301
0.84,0.787740778407138,-0.0607080334395828
0.85,0.796490423149991,-0.0588519985977228
0.86,0.805436712964409,-0.0568952705194139
0.87,0.81462079161253,-0.0548274913113489
0.88,0.82408380285649,-0.0526383030802207
0.89,0.833866890458424,-0.0503173479327221
0.9,0.844011198180469,-0.047854267975546
0.91,0.854583496775085,-0.0452255774480412
0.92,0.865753064956022,-0.0423552791201809
0.93,0.877714808427355,-0.0391542478945943
0.94,0.890663632893157,-0.0355333586739105
0.95,0.904794444057504,-0.0314034863607587
0.96,0.92030214762447,-0.026675505857768
0.97,0.937381649298128,-0.0212602920675676
0.98,0.956227854782553,-0.0150687198927867
0.99,0.977035669781819,-0.00801166423605445
1,1,-4.77487291403115e-26
