x,z
0,-0
0.0059,-0.0775
0.0114,-0.1359
0.0167,-0.1824
0.0222,-0.2215
0.0279,-0.2556
0.034,-0.2864
0.0404,-0.3146
0.0471,-0.3408
0.0541,-0.3651
0.0615,-0.388
0.0691,-0.4095
0.077,-0.4298
0.0852,-0.4491
0.0937,-0.4674
0.1023,-0.4848
0.1113,-0.5013
0.1204,-0.5171
0.1297,-0.5322
0.1393,-0.5465
0.149,-0.5602
0.1589,-0.5733
0.169,-0.5857
0.1792,-0.5976
0.1895,-0.6089
0.2,-0.6197
0.2106,-0.6299
0.2213,-0.6397
0.2322,-0.6489
0.2431,-0.6578
0.2542,-0.6661
0.2654,-0.674
0.2767,-0.6815
0.2882,-0.6886
0.2997,-0.6952
0.3114,-0.7015
0.3232,-0.7073
0.3351,-0.7128
0.3472,-0.7178
0.3594,-0.7225
0.3716,-0.7268
0.384,-0.7307
0.3965,-0.7341
0.4091,-0.7372
0.4218,-0.7399
0.4345,-0.7422
0.4473,-0.744
0.4602,-0.7455
0.4731,-0.7465
0.486,-0.7471
0.4989,-0.7473
0.5119,-0.7471
0.5248,-0.7465
0.5377,-0.7454
0.5506,-0.7439
0.5634,-0.742
0.5761,-0.7397
0.5888,-0.737
0.6013,-0.7339
0.6138,-0.7304
0.6262,-0.7265
0.6385,-0.7222
0.6506,-0.7175
0.6627,-0.7124
0.6746,-0.7069
0.6864,-0.7011
0.698,-0.6948
0.7096,-0.6881
0.721,-0.6811
0.7323,-0.6736
0.7435,-0.6656
0.7546,-0.6573
0.7656,-0.6485
0.7764,-0.6392
0.7871,-0.6294
0.7977,-0.6192
0.8082,-0.6084
0.8186,-0.5971
0.8288,-0.5853
0.8388,-0.5728
0.8487,-0.5598
0.8585,-0.5461
0.868,-0.5317
0.8774,-0.5167
0.8866,-0.5009
0.8955,-0.4844
0.9042,-0.467
0.9127,-0.4487
0.921,-0.4295
0.9289,-0.4092
0.9367,-0.3877
0.9441,-0.3649
0.9512,-0.3405
0.958,-0.3144
0.9645,-0.2863
0.9708,-0.2555
0.9767,-0.2213
0.9823,-0.1823
0.9879,-0.1358
0.9936,-0.0774
1,0
