x1,y1,z1,x2,y2,z2,x3,y3,z3,x4,y4,z4,x5,y5,z5,x6,y6,z6,x7,y7,z7,x8,y8,z8
-8.544,5.463,3.202,8.184,5.692,3.236,8.224,-5.492,3.25,-8.491,-5.322,3.221,-8.192,5.648,-0.589,7.208,6.463,-0.548,7.869,-5.557,-0.527,-8.27,-5.545,-0.582
-8.2118,5.274,3.0824,7.8658,5.494,3.115,7.9041,-5.3026,3.1283,-8.1609,-5.1393,3.1005,-7.8742,5.4556,-0.5396,6.9293,6.2387,-0.5003,7.5643,-5.3688,-0.4803,-7.9493,-5.3573,-0.5331
-7.9616,5.1317,2.9923,7.6262,5.3449,3.0238,7.6633,-5.16,3.0366,-7.9124,-5.0017,3.0097,-7.6349,5.3107,-0.5025,6.7195,6.0698,-0.4643,7.3349,-5.2271,-0.4451,-7.7077,-5.216,-0.4963
-7.7621,5.0182,2.9204,7.4351,5.226,2.9512,7.4712,-5.0462,2.9635,-7.7142,-4.8919,2.9373,-7.4441,5.1952,-0.4728,6.5521,5.9351,-0.4356,7.1519,-5.1141,-0.417,-7.5151,-5.1032,-0.4669
-7.5941,4.9226,2.8599,7.2741,5.1259,2.8899,7.3094,-4.9505,2.9019,-7.5472,-4.7995,2.8764,-7.2833,5.0979,-0.4479,6.4112,5.8216,-0.4115,6.9979,-5.0189,-0.3933,-7.3529,-5.0083,-0.4421
-7.4463,4.8386,2.8067,7.1326,5.0379,2.8361,7.1672,-4.8662,2.8478,-7.4005,-4.7182,2.8228,-7.1421,5.0124,-0.4259,6.2873,5.7219,-0.3903,6.8624,-4.9352,-0.3726,-7.2103,-4.9248,-0.4204
-7.3126,4.7625,2.7586,7.0046,4.9582,2.7874,7.0385,-4.79,2.7988,-7.2677,-4.6447,2.7743,-7.0142,4.9349,-0.406,6.1752,5.6317,-0.371,6.7398,-4.8595,-0.3537,-7.0812,-4.8493,-0.4007
-7.1894,4.6924,2.7142,6.8865,4.8848,2.7425,6.9198,-4.7198,2.7537,-7.1452,-4.5769,2.7296,-6.8963,4.8636,-0.3877,6.0718,5.5484,-0.3533,6.6268,-4.7896,-0.3364,-6.9622,-4.7797,-0.3826
-7.0745,4.627,2.6728,6.7765,4.8163,2.7007,6.8092,-4.6543,2.7116,-7.031,-4.5137,2.6879,-6.7864,4.797,-0.3707,5.9754,5.4709,-0.3368,6.5214,-4.7245,-0.3202,-6.8513,-4.7148,-0.3656
-6.9664,4.5656,2.6339,6.673,4.7519,2.6613,6.7051,-4.5927,2.672,-6.9237,-4.4543,2.6487,-6.683,4.7344,-0.3546,5.8848,5.3979,-0.3213,6.4223,-4.6633,-0.305,-6.747,-4.6537,-0.3497
-6.8642,4.5074,2.5971,6.5751,4.691,2.6241,6.6067,-4.5344,2.6345,-6.8221,-4.398,2.6116,-6.5852,4.6752,-0.3394,5.799,5.3289,-0.3066,6.3286,-4.6054,-0.2906,-6.6483,-4.596,-0.3347
-6.7669,4.4521,2.5621,6.4819,4.633,2.5887,6.5131,-4.4789,2.5989,-6.7255,-4.3445,2.5763,-6.4922,4.6189,-0.325,5.7174,5.2632,-0.2926,6.2394,-4.5503,-0.277,-6.5544,-4.541,-0.3204
-6.674,4.3992,2.5286,6.3929,4.5776,2.5548,6.4236,-4.4259,2.5648,-6.6331,-4.2934,2.5426,-6.4033,4.5651,-0.3111,5.6394,5.2005,-0.2793,6.1541,-4.4977,-0.2639,-6.4646,-4.4885,-0.3067
-6.5848,4.3484,2.4965,6.3074,4.5245,2.5223,6.3377,-4.3751,2.5322,-6.5445,-4.2443,2.5102,-6.3179,4.5134,-0.2979,5.5646,5.1402,-0.2664,6.0723,-4.4471,-0.2513,-6.3785,-4.4381,-0.2935
-6.4989,4.2996,2.4656,6.2252,4.4733,2.491,6.255,-4.3261,2.5007,-6.4592,-4.1971,2.4791,-6.2358,4.4637,-0.2851,5.4926,5.0823,-0.2541,5.9936,-4.3985,-0.2392,-6.2956,-4.3896,-0.2809
-6.4161,4.2525,2.4357,6.1458,4.4239,2.4608,6.1752,-4.2789,2.4703,-6.3769,-4.1515,2.449,-6.1566,4.4157,-0.2728,5.4231,5.0263,-0.2422,5.9176,-4.3516,-0.2276,-6.2156,-4.3428,-0.2687
-6.3359,4.2069,2.4069,6.069,4.3762,2.4316,6.098,-4.2332,2.441,-6.2972,-4.1074,2.4199,-6.0799,4.3693,-0.2609,5.3559,4.9722,-0.2307,5.8441,-4.3062,-0.2163,-6.1382,-4.2975,-0.2569
-6.2582,4.1626,2.3789,5.9946,4.3298,2.4033,6.0232,-4.1889,2.4125,-6.22,-4.0647,2.3917,-6.0055,4.3243,-0.2494,5.2907,4.9197,-0.2195,5.7728,-4.2621,-0.2054,-6.0632,-4.2536,-0.2454
-6.1827,4.1197,2.3517,5.9223,4.2849,2.3758,5.9506,-4.1459,2.3848,-6.145,-4.0232,2.3643,-5.9333,4.2806,-0.2381,5.2274,4.8688,-0.2086,5.7036,-4.2194,-0.1947,-5.9903,-4.2109,-0.2343
-6.1093,4.0779,2.3253,5.852,4.2411,2.3491,5.8799,-4.104,2.3579,-6.0721,-3.9828,2.3377,-5.8631,4.2381,-0.2272,5.1658,4.8192,-0.1981,5.6362,-4.1778,-0.1844,-5.9194,-4.1694,-0.2235
-6.0377,4.0372,2.2995,5.7834,4.1985,2.323,5.811,-4.0632,2.3317,-6.001,-3.9434,2.3118,-5.7947,4.1966,-0.2166,5.1058,4.7709,-0.1878,5.5706,-4.1373,-0.1743,-5.8504,-4.129,-0.213
-5.9679,3.9975,2.2744,5.7166,4.1569,2.2976,5.7438,-4.0234,2.3062,-5.9317,-3.905,2.2864,-5.7279,4.1562,-0.2062,5.0472,4.7238,-0.1778,5.5066,-4.0977,-0.1645,-5.783,-4.0896,-0.2027
-5.8997,3.9588,2.2498,5.6513,4.1163,2.2728,5.6781,-3.9846,2.2812,-5.8639,-3.8675,2.2617,-5.6627,4.1167,-0.1961,4.99,4.6777,-0.168,5.4441,-4.0591,-0.1549,-5.7171,-4.0511,-0.1927
-5.8331,3.9208,2.2258,5.5874,4.0765,2.2485,5.6139,-3.9465,2.2567,-5.7977,-3.8308,2.2375,-5.5989,4.0781,-0.1862,4.9341,4.6327,-0.1584,5.3829,-4.0213,-0.1455,-5.6527,-4.0134,-0.1829
-5.7677,3.8837,2.2023,5.5248,4.0376,2.2247,5.551,-3.9093,2.2328,-5.7328,-3.7949,2.2138,-5.5364,4.0403,-0.1765,4.8793,4.5886,-0.149,5.323,-3.9843,-0.1364,-5.5897,-3.9765,-0.1732
-5.7037,3.8472,2.1792,5.4635,3.9994,2.2014,5.4894,-3.8728,2.2094,-5.6691,-3.7597,2.1906,-5.4752,4.0032,-0.167,4.8256,4.5454,-0.1398,5.2643,-3.948,-0.1273,-5.5278,-3.9403,-0.1638
-5.6408,3.8114,2.1566,5.4032,3.9619,2.1784,5.4288,-3.8369,2.1863,-5.6067,-3.7251,2.1678,-5.415,3.9668,-0.1576,4.7728,4.5029,-0.1308,5.2066,-3.9124,-0.1185,-5.4671,-3.9048,-0.1545
-5.579,3.7763,2.1343,5.344,3.9251,2.1559,5.3693,-3.8017,2.1637,-5.5452,-3.6911,2.1453,-5.3559,3.931,-0.1484,4.721,4.4612,-0.1219,5.1499,-3.8774,-0.1098,-5.4074,-3.8698,-0.1454
-5.5181,3.7417,2.1124,5.2857,3.8888,2.1338,5.3107,-3.767,2.1414,-5.4848,-3.6576,2.1233,-5.2977,3.8957,-0.1394,4.6699,4.4201,-0.1131,5.0941,-3.8429,-0.1012,-5.3487,-3.8354,-0.1365
-5.4581,3.7075,2.0908,5.2283,3.8531,2.1119,5.253,-3.7328,2.1194,-5.4252,-3.6246,2.1015,-5.2403,3.861,-0.1305,4.6196,4.3796,-0.1045,5.0391,-3.8089,-0.0928,-5.2908,-3.8016,-0.1276
-5.3989,3.6738,2.0695,5.1716,3.8178,2.0903,5.196,-3.6991,2.0977,-5.3664,-3.5921,2.08,-5.1837,3.8267,-0.1217,4.57,4.3396,-0.096,4.9848,-3.7754,-0.0845,-5.2336,-3.7681,-0.1189
-5.3404,3.6406,2.0485,5.1155,3.7829,2.069,5.1396,-3.6657,2.0763,-5.3082,-3.5599,2.0588,-5.1277,3.7928,-0.113,4.5209,4.3001,-0.0876,4.9312,-3.7422,-0.0762,-5.1771,-3.7351,-0.1103
-5.2825,3.6076,2.0276,5.0601,3.7484,2.0479,5.0839,-3.6327,2.055,-5.2507,-3.528,2.0378,-5.0723,3.7593,-0.1044,4.4723,4.261,-0.0793,4.8781,-3.7094,-0.0681,-5.1212,-3.7023,-0.1018
-5.2251,3.575,2.0069,5.0051,3.7142,2.027,5.0286,-3.6,2.034,-5.1937,-3.4964,2.017,-5.0174,3.726,-0.0958,4.4242,4.2223,-0.071,4.8254,-3.6769,-0.06,-5.0658,-3.6699,-0.0933
-5.1681,3.5426,1.9864,4.9505,3.6803,2.0063,4.9737,-3.5675,2.0132,-5.1371,-3.4651,1.9963,-4.9629,3.6931,-0.0874,4.3764,4.1838,-0.0628,4.7732,-3.6447,-0.052,-5.0108,-3.6377,-0.0849
-5.1115,3.5104,1.966,4.8963,3.6466,1.9857,4.9193,-3.5352,1.9924,-5.0809,-3.434,1.9758,-4.9088,3.6603,-0.079,4.3289,4.1456,-0.0547,4.7213,-3.6126,-0.044,-4.9562,-3.6057,-0.0766
-5.0552,3.4783,1.9458,4.8424,3.613,1.9652,4.865,-3.5031,1.9718,-5.0249,-3.403,1.9553,-4.8549,3.6277,-0.0706,4.2817,4.1076,-0.0466,4.6696,-3.5807,-0.0361,-4.9018,-3.5739,-0.0683
-4.9992,3.4464,1.9256,4.7887,3.5796,1.9447,4.8111,-3.4712,1.9512,-4.9692,-3.3722,1.935,-4.8013,3.5952,-0.0623,4.2346,4.0697,-0.0385,4.6182,-3.5489,-0.0282,-4.8477,-3.5423,-0.0601
-4.9433,3.4146,1.9055,4.7352,3.5463,1.9244,4.7573,-3.4393,1.9308,-4.9137,-3.3414,1.9147,-4.7478,3.5629,-0.054,4.1878,4.032,-0.0305,4.567,-3.5173,-0.0203,-4.7937,-3.5107,-0.0518
-4.8875,3.3829,1.8854,4.6818,3.5131,1.9041,4.7036,-3.4075,1.9104,-4.8583,-3.3108,1.8945,-4.6945,3.5306,-0.0457,4.141,3.9944,-0.0225,4.5159,-3.4857,-0.0125,-4.7399,-3.4792,-0.0436
-4.8319,3.3513,1.8654,4.6285,3.4799,1.8838,4.65,-3.3758,1.89,-4.8031,-3.2802,1.8743,-4.6413,3.4984,-0.0374,4.0944,3.9568,-0.0145,4.4649,-3.4542,-0.0047,-4.6862,-3.4478,-0.0354
-4.7764,3.3197,1.8454,4.5753,3.4468,1.8636,4.5965,-3.3441,1.8696,-4.7479,-3.2496,1.8542,-4.5882,3.4662,-0.0292,4.0478,3.9193,-0.0065,4.4139,-3.4227,0.0032,-4.6326,-3.4164,-0.0272
-4.7209,3.2881,1.8254,4.5221,3.4137,1.8434,4.5431,-3.3125,1.8493,-4.6927,-3.2191,1.834,-4.5351,3.434,-0.0209,4.0012,3.8818,0.0015,4.363,-3.3913,0.011,-4.579,-3.385,-0.0191
-4.6654,3.2566,1.8054,4.469,3.3807,1.8232,4.4897,-3.2809,1.829,-4.6376,-3.1886,1.8139,-4.482,3.4019,-0.0127,3.9547,3.8444,0.0094,4.3121,-3.3599,0.0188,-4.5255,-3.3537,-0.0109
-4.6099,3.225,1.7855,4.4159,3.3477,1.803,4.4363,-3.2493,1.8087,-4.5825,-3.1581,1.7938,-4.429,3.3698,-0.0044,3.9082,3.8069,0.0174,4.2613,-3.3285,0.0266,-4.4719,-3.3224,-0.0027
-4.5545,3.1935,1.7655,4.3628,3.3146,1.7828,4.383,-3.2177,1.7884,-4.5275,-3.1276,1.7737,-4.376,3.3377,0.0038,3.8617,3.7695,0.0254,4.2105,-3.2971,0.0344,-4.4184,-3.291,0.0054
-4.4991,3.162,1.7455,4.3097,3.2816,1.7626,4.3296,-3.1861,1.7681,-4.4724,-3.0971,1.7536,-4.323,3.3056,0.0121,3.8152,3.7321,0.0334,4.1597,-3.2657,0.0422,-4.3649,-3.2597,0.0136
-4.4437,3.1304,1.7256,4.2566,3.2486,1.7424,4.2762,-3.1545,1.7478,-4.4173,-3.0666,1.7335,-4.2699,3.2735,0.0203,3.7687,3.6947,0.0413,4.1088,-3.2343,0.05,-4.3114,-3.2284,0.0217
-4.3883,3.0989,1.7056,4.2036,3.2156,1.7222,4.2229,-3.1229,1.7275,-4.3623,-3.0361,1.7134,-4.2169,3.2414,0.0285,3.7222,3.6573,0.0493,4.058,-3.2029,0.0578,-4.2579,-3.1971,0.0299
-4.3329,3.0674,1.6857,4.1505,3.1825,1.7021,4.1695,-3.0913,1.7072,-4.3072,-3.0057,1.6933,-4.1639,3.2094,0.0368,3.6758,3.6199,0.0572,4.0072,-3.1715,0.0656,-4.2044,-3.1658,0.0381
-4.2774,3.0359,1.6657,4.0974,3.1495,1.6819,4.1162,-3.0597,1.6869,-4.2522,-2.9752,1.6732,-4.1109,3.1773,0.045,3.6293,3.5825,0.0652,3.9564,-3.1401,0.0734,-4.1509,-3.1345,0.0462
-4.222,3.0043,1.6458,4.0443,3.1165,1.6617,4.0629,-3.0281,1.6666,-4.1971,-2.9447,1.6531,-4.0579,3.1452,0.0532,3.5828,3.5451,0.0732,3.9056,-3.1087,0.0812,-4.0974,-3.1032,0.0544
-4.1666,2.9728,1.6258,3.9913,3.0835,1.6415,4.0095,-2.9966,1.6463,-4.1421,-2.9142,1.633,-4.0049,3.1131,0.0615,3.5363,3.5076,0.0811,3.8548,-3.0773,0.089,-4.0439,-3.0719,0.0625
-4.1112,2.9413,1.6059,3.9382,3.0505,1.6213,3.9561,-2.965,1.626,-4.087,-2.8837,1.6129,-3.9519,3.081,0.0697,3.4899,3.4702,0.0891,3.804,-3.0459,0.0968,-3.9904,-3.0406,0.0707
-4.0558,2.9098,1.5859,3.8851,3.0174,1.6011,3.9028,-2.9334,1.6057,-4.032,-2.8533,1.5928,-3.8989,3.0489,0.0779,3.4434,3.4328,0.0971,3.7531,-3.0146,0.1046,-3.9369,-3.0093,0.0789
-4.0004,2.8782,1.566,3.832,2.9844,1.581,3.8494,-2.9018,1.5854,-3.9769,-2.8228,1.5727,-3.8459,3.0168,0.0862,3.3969,3.3954,0.105,3.7023,-2.9832,0.1124,-3.8834,-2.978,0.087
-3.9449,2.8467,1.546,3.7789,2.9514,1.5608,3.796,-2.8702,1.565,-3.9218,-2.7923,1.5526,-3.7929,2.9847,0.0944,3.3504,3.358,0.113,3.6515,-2.9517,0.1202,-3.8299,-2.9466,0.0952
-3.8894,2.8151,1.5261,3.7258,2.9183,1.5406,3.7426,-2.8385,1.5447,-3.8667,-2.7618,1.5325,-3.7398,2.9526,0.1027,3.3039,3.3205,0.121,3.6006,-2.9203,0.128,-3.7763,-2.9153,0.1034
-3.8339,2.7836,1.5061,3.6726,2.8852,1.5203,3.6892,-2.8069,1.5244,-3.8116,-2.7312,1.5123,-3.6867,2.9205,0.1109,3.2573,3.283,0.129,3.5497,-2.8889,0.1358,-3.7228,-2.8839,0.1115
-3.7784,2.752,1.4861,3.6194,2.8521,1.5001,3.6357,-2.7752,1.504,-3.7564,-2.7007,1.4922,-3.6336,2.8883,0.1192,3.2107,3.2455,0.137,3.4987,-2.8574,0.1436,-3.6691,-2.8526,0.1197
-3.7228,2.7203,1.466,3.5661,2.819,1.4798,3.5822,-2.7435,1.4837,-3.7011,-2.6701,1.472,-3.5804,2.8561,0.1274,3.164,3.208,0.145,3.4477,-2.8259,0.1514,-3.6154,-2.8211,0.1279
-3.667,2.6886,1.446,3.5127,2.7858,1.4595,3.5285,-2.7117,1.4632,-3.6457,-2.6394,1.4518,-3.5271,2.8238,0.1357,3.1173,3.1703,0.153,3.3966,-2.7943,0.1593,-3.5616,-2.7896,0.1361
-3.6111,2.6568,1.4259,3.4592,2.7525,1.4392,3.4747,-2.6799,1.4428,-3.5902,-2.6087,1.4315,-3.4736,2.7914,0.144,3.0704,3.1326,0.161,3.3454,-2.7627,0.1672,-3.5077,-2.7581,0.1444
-3.5551,2.6249,1.4057,3.4055,2.719,1.4188,3.4207,-2.6479,1.4222,-3.5345,-2.5778,1.4112,-3.42,2.759,0.1524,3.0234,3.0948,0.1691,3.294,-2.7309,0.175,-3.4535,-2.7264,0.1526
-3.4988,2.5929,1.3854,3.3516,2.6855,1.3983,3.3665,-2.6158,1.4016,-3.4786,-2.5469,1.3908,-3.3661,2.7264,0.1607,2.9762,3.0568,0.1772,3.2423,-2.699,0.183,-3.3992,-2.6946,0.1609
-3.4422,2.5607,1.365,3.2974,2.6518,1.3777,3.312,-2.5836,1.3809,-3.4223,-2.5157,1.3702,-3.312,2.6936,0.1691,2.9287,3.0185,0.1853,3.1904,-2.667,0.1909,-3.3445,-2.6626,0.1692
-3.3852,2.5283,1.3445,3.2428,2.6178,1.3569,3.2572,-2.5511,1.36,-3.3658,-2.4844,1.3496,-3.2575,2.6606,0.1776,2.8809,2.9801,0.1935,3.1382,-2.6347,0.199,-3.2895,-2.6304,0.1776
-3.3278,2.4956,1.3239,3.1878,2.5836,1.336,3.2019,-2.5184,1.339,-3.3087,-2.4528,1.3288,-3.2026,2.6274,0.1861,2.8328,2.9413,0.2017,3.0855,-2.6022,0.207,-3.2341,-2.598,0.1861
-3.2699,2.4627,1.303,3.1323,2.5491,1.3149,3.1461,-2.4853,1.3178,-3.2512,-2.421,1.3077,-3.1472,2.5938,0.1948,2.7842,2.9022,0.2101,3.0324,-2.5694,0.2152,-3.1782,-2.5653,0.1946
-3.2114,2.4294,1.2819,3.0763,2.5142,1.2936,3.0898,-2.452,1.2963,-3.1931,-2.3888,1.2865,-3.0912,2.5599,0.2035,2.7351,2.8627,0.2185,2.9788,-2.5362,0.2234,-3.1217,-2.5322,0.2032
-3.1522,2.3957,1.2606,3.0196,2.4789,1.272,3.0328,-2.4182,1.2746,-3.1342,-2.3562,1.265,-3.0346,2.5256,0.2123,2.6854,2.8228,0.227,2.9245,-2.5027,0.2318,-3.0646,-2.4988,0.2119
-3.0922,2.3616,1.239,2.9621,2.4432,1.2502,2.975,-2.384,1.2527,-3.0746,-2.3232,1.2433,-2.9772,2.4909,0.2212,2.6351,2.7823,0.2356,2.8695,-2.4687,0.2402,-3.0067,-2.4649,0.2208
-3.0313,2.327,1.2171,2.9039,2.4069,1.228,2.9165,-2.3493,1.2304,-3.0142,-2.2898,1.2212,-2.919,2.4557,0.2302,2.5841,2.7412,0.2444,2.8137,-2.4342,0.2488,-2.9479,-2.4305,0.2297
-2.9695,2.2918,1.1949,2.8446,2.3701,1.2055,2.8569,-2.3141,1.2077,-2.9528,-2.2557,1.1988,-2.8599,2.4199,0.2394,2.5322,2.6994,0.2532,2.757,-2.3992,0.2575,-2.8882,-2.3956,0.2389
-2.9066,2.256,1.1722,2.7844,2.3326,1.1826,2.7964,-2.2782,1.1847,-2.8903,-2.2212,1.176,-2.7997,2.3835,0.2488,2.4795,2.657,0.2623,2.6993,-2.3636,0.2663,-2.8275,-2.36,0.2481
-2.8426,2.2196,1.1492,2.723,2.2945,1.1593,2.7347,-2.2417,1.1612,-2.8266,-2.1859,1.1528,-2.7385,2.3464,0.2583,2.4258,2.6137,0.2715,2.6406,-2.3273,0.2753,-2.7657,-2.3239,0.2575
-2.7772,2.1824,1.1257,2.6605,2.2555,1.1355,2.6718,-2.2045,1.1373,-2.7617,-2.15,1.1291,-2.676,2.3085,0.268,2.371,2.5696,0.2809,2.5807,-2.2903,0.2845,-2.7026,-2.2869,0.2672
-2.7105,2.1445,1.1016,2.5966,2.2158,1.1112,2.6076,-2.1665,1.1129,-2.6955,-2.1133,1.1049,-2.6122,2.2699,0.2779,2.315,2.5246,0.2905,2.5195,-2.2525,0.2939,-2.6382,-2.2493,0.277
-2.6424,2.1057,1.0771,2.5313,2.1751,1.0864,2.5419,-2.1276,1.0879,-2.6277,-2.0758,1.0801,-2.547,2.2304,0.288,2.2578,2.4786,0.3003,2.457,-2.2139,0.3035,-2.5724,-2.2107,0.287
-2.5726,2.066,1.052,2.4644,2.1336,1.061,2.4748,-2.0878,1.0623,-2.5584,-2.0374,1.0548,-2.4802,2.19,0.2984,2.1993,2.4314,0.3103,2.393,-2.1744,0.3133,-2.505,-2.1713,0.2973
-2.501,2.0253,1.0262,2.3959,2.0909,1.0349,2.4059,-2.047,1.0361,-2.4873,-1.9981,1.0289,-2.4118,2.1486,0.309,2.1393,2.3831,0.3206,2.3274,-2.1338,0.3234,-2.4359,-2.1309,0.3079
-2.4276,1.9835,0.9998,2.3256,2.0472,1.0082,2.3352,-2.0052,1.0092,-2.4144,-1.9577,1.0022,-2.3416,2.1061,0.32,2.0777,2.3336,0.3312,2.26,-2.0922,0.3337,-2.3651,-2.0894,0.3187
-2.3521,1.9406,0.9726,2.2533,2.0022,0.9807,2.2625,-1.9621,0.9816,-2.3394,-1.9162,0.9749,-2.2694,2.0624,0.3312,2.0144,2.2826,0.342,2.1908,-2.0495,0.3444,-2.2922,-2.0468,0.3298
-2.2744,1.8964,0.9446,2.1788,1.9559,0.9524,2.1877,-1.9178,0.9531,-2.2622,-1.8734,0.9467,-2.195,2.0173,0.3427,1.9492,2.2301,0.3532,2.1196,-2.0055,0.3553,-2.2172,-2.0029,0.3412
-2.1942,1.8508,0.9158,2.1021,1.9081,0.9232,2.1105,-1.8721,0.9238,-2.1825,-1.8293,0.9176,-2.1183,1.9709,0.3547,1.882,2.176,0.3647,2.046,-1.9601,0.3666,-2.1398,-1.9576,0.353
-2.1114,1.8036,0.886,2.0227,1.8587,0.893,2.0307,-1.8249,0.8934,-2.1002,-1.7837,0.8876,-2.0391,1.9229,0.367,1.8125,2.1201,0.3766,1.97,-1.9131,0.3783,-2.0598,-1.9108,0.3652
-2.0255,1.7548,0.855,1.9404,1.8076,0.8617,1.948,-1.7759,0.8619,-2.0149,-1.7365,0.8564,-1.9569,1.8732,0.3797,1.7404,2.0621,0.389,1.8913,-1.8645,0.3903,-1.9769,-1.8622,0.3779
-1.9363,1.704,0.8229,1.855,1.7544,0.8292,1.8622,-1.7251,0.8293,-1.9263,-1.6874,0.8241,-1.8716,1.8216,0.393,1.6656,2.0019,0.4018,1.8095,-1.8139,0.4029,-1.8908,-1.8118,0.391
-1.8433,1.6512,0.7895,1.766,1.699,0.7954,1.7727,-1.6721,0.7952,-1.8339,-1.6363,0.7903,-1.7827,1.7677,0.4068,1.5876,1.9391,0.4152,1.7243,-1.7613,0.416,-1.801,-1.7593,0.4047
-1.7461,1.5958,0.7545,1.6728,1.641,0.76,1.679,-1.6166,0.7596,-1.7373,-1.5828,0.7551,-1.6897,1.7114,0.4213,1.5061,1.8735,0.4291,1.6351,-1.7062,0.4297,-1.7071,-1.7044,0.4191
-1.6438,1.5377,0.7177,1.5749,1.5801,0.7227,1.5806,-1.5584,0.7221,-1.6357,-1.5266,0.718,-1.5919,1.6522,0.4365,1.4203,1.8044,0.4438,1.5413,-1.6483,0.4441,-1.6084,-1.6466,0.4341
-1.5358,1.4762,0.6788,1.4714,1.5157,0.6834,1.4766,-1.4968,0.6826,-1.5284,-1.4671,0.6788,-1.4885,1.5896,0.4525,1.3297,1.7315,0.4594,1.4422,-1.5871,0.4593,-1.5041,-1.5856,0.45
-1.4209,1.4108,0.6374,1.3613,1.4472,0.6415,1.3659,-1.4313,0.6405,-1.4142,-1.4039,0.6371,-1.3786,1.5231,0.4696,1.2333,1.6539,0.4759,1.3369,-1.522,0.4755,-1.3932,-1.5207,0.467
-1.2976,1.3407,0.593,1.2433,1.3738,0.5967,1.2472,-1.361,0.5953,-1.2917,-1.3361,0.5924,-1.2607,1.4517,0.488,1.1299,1.5707,0.4936,1.2238,-1.4522,0.4928,-1.2742,-1.451,0.4851
-1.1639,1.2647,0.5449,1.1152,1.2941,0.548,1.1185,-1.2848,0.5464,-1.1589,-1.2626,0.5439,-1.1328,1.3743,0.5078,1.0178,1.4804,0.5129,1.1012,-1.3764,0.5116,-1.1451,-1.3755,0.5048
-1.0162,1.1806,0.4917,0.9737,1.2061,0.4942,0.9763,-1.2006,0.4923,-1.0122,-1.1813,0.4904,-0.9916,1.2888,0.5298,0.8939,1.3807,0.5341,0.9658,-1.2928,0.5324,-1.0025,-1.292,0.5266
-0.8482,1.085,0.4313,0.8128,1.106,0.433,0.8145,-1.1048,0.4307,-0.8452,-1.0889,0.4294,-0.8308,1.1915,0.5548,0.7529,1.2673,0.5583,0.8117,-1.1976,0.5561,-0.8403,-1.1971,0.5513
-0.6486,0.9715,0.3594,0.6217,0.9871,0.3603,0.6224,-0.991,0.3576,-0.647,-0.9791,0.3571,-0.64,1.0759,0.5844,0.5856,1.1326,0.5869,0.6287,-1.0845,0.5842,-0.6476,-1.0844,0.5807
-0.3984,0.8292,0.2694,0.382,0.838,0.2693,0.3815,-0.8484,0.266,-0.3984,-0.8415,0.2664,-0.4007,0.931,0.6216,0.3758,0.9637,0.6229,0.3993,-0.9428,0.6194,-0.4061,-0.943,0.6176
-0.0662,0.6402,0.1498,0.0638,0.64,0.1483,0.0617,-0.659,0.1443,-0.0683,-0.6588,0.1459,-0.0829,0.7387,0.6711,0.0971,0.7394,0.6707,0.0946,-0.7546,0.6662,-0.0854,-0.7553,0.6665
