xi,sx,sy,cx,cy,ex,ey,ne
0,-7.93874909963069e-26,1.07379105846955e-25,0,0,-7.93874909963069e-26,1.07379105846955e-25,1.33538931024553e-25
0.01,0.00450472047737639,-0.0282329021338833,0.00159015666284234,-0.0100619312199339,0.00291456381453405,-0.0181709709139494,0.0184032297759004
0.02,0.00851238083510745,-0.0529570123960608,0.00319312858729929,-0.0201202884390492,0.00531925224780816,-0.0328367239570115,0.0332647694220896
0.03,0.012098125961542,-0.0747091701873622,0.00480912519585867,-0.0301750209475336,0.0072890007656833,-0.0445341492398286,0.045126710279805
0.04,0.0153299517853052,-0.0939745944675349,0.00643836101620861,-0.0402260763468902,0.0088915907690966,-0.0537485181206447,0.0544790196917158
0.05,0.0182687052752988,-0.111186883755243,0.00808105584607108,-0.0502734004795395,0.0101876494292278,-0.060913483275704,0.0617595389043046
0.06,0.020968084440701,-0.12672801612807,0.00973743492463415,-0.0603169373548971,0.0112306495160668,-0.0664110787731729,0.0673539818597929
0.07,0.0234746383309662,-0.140928349222514,0.0114077291108947,-0.070356629071718,0.0120669092200716,-0.0705717201507963,0.0715959355212833
0.08,0.0258277670358256,-0.154066620233993,0.0130921750692437,-0.0803924157364904,0.0127355919665819,-0.0736742044975029,0.0747668623862145
0.09,0.0280597216852867,-0.166369945916842,0.0147910154626422,-0.0904242353776413,0.0132687062226445,-0.0759457105392003,0.0770961057001379
0.1,0.0301956044496332,-0.178013822584311,0.0165044991537558,-0.100452023855305,0.0136911052958773,-0.0775617987290056,0.0787608975717112
0.11,0.0322533685394256,-0.189122126108571,0.0182328814144378,-0.110475714766389,0.0140204871249878,-0.0786464113421825,0.0798863697774891
0.12,0.034243998035522,-0.199768406720286,0.0199764241439696,-0.120495239344639,0.0142675738915524,-0.0792731673756462,0.08054687287858
0.13,0.0361742756294036,-0.209995817099466,0.0217353960964945,-0.130510526355424,0.0144388795329091,-0.0794852907440427,0.0807860921621467
0.14,0.0380503094604407,-0.219842506063173,0.0235100731180997,-0.14052150198487,0.014540236342341,-0.0793210040783026,0.0806426696041322
0.15,0.0398779719345113,-0.229344778116728,0.0253007383940352,-0.150528089723045,0.014577233540476,-0.0788166883936827,0.0801533911137917
0.16,0.0416628997679051,-0.238537093769828,0.0271076827065783,-0.160530210240766,0.0145552170613267,-0.0780068835290623,0.0793531865876792
0.17,0.0434104939873236,-0.247452069536547,0.0289312047040879,-0.170527781259668,0.0144792892832357,-0.0769242882768794,0.0782751297990113
0.18,0.0451259199298798,-0.256120477935332,0.0307716111818202,-0.180520717415076,0.0143543087480596,-0.0755997605202565,0.0769504384026157
0.19,0.0468141072430985,-0.264571247489008,0.0326292173751158,-0.190508930111232,0.0141848898679827,-0.0740623173777759,0.0754084740326523
0.2,0.0484797498849162,-0.272831462724773,0.034504347265597,-0.200492327368365,0.0139754026193192,-0.072339135356408,0.0736767424801395
0.21,0.0501273061236809,-0.280926364174202,0.0363973339010593,-0.210470813661084,0.0137299722226216,-0.0704555505131183,0.0717808939435872
0.22,0.0517609985381524,-0.288879348373244,0.0383085197297777,-0.220444289747505,0.0134524788083747,-0.0684350586257389,0.0697447233502155
0.23,0.0533848127836983,-0.296711968062027,0.0402382569499912,-0.230412652488512,0.0131465558337072,-0.0662993155735152,0.0675901707040701
0.24,0.0550024700842757,-0.304443936639503,0.0421869078753778,-0.240375794656461,0.0128155622088979,-0.0640681419830427,0.065337320513543
0.25,0.0566173825487944,-0.312093135399514,0.0441548453173795,-0.250333604732634,0.0124625372314148,-0.0617595306668806,0.0630044003418631
0.26,0.0582326456886444,-0.319675614742504,0.0461424529852888,-0.260285966692663,0.0120901927033556,-0.0593896480498415,0.0606077804831056
0.27,0.0598510384094737,-0.32720559417685,0.0481501259050652,-0.270232759779083,0.0117009125044085,-0.0569728343977673,0.0581619739413239
0.28,0.0614750230111884,-0.334695462318861,0.0501782708579103,-0.28017385826013,0.0112967521532782,-0.0545216040587311,0.0556796364782461
0.29,0.0631067451879528,-0.342155776892781,0.0522273068396919,-0.290109131173807,0.0108794383482609,-0.0520466457189747,0.053171566737967
0.3,0.0647480340281889,-0.349595264730786,0.0542976655423766,-0.300038442056165,0.0104503684858122,-0.0495568226746211,0.0506467064584964
0.31,0.0664004020145772,-0.357020821772985,0.056389791858704,-0.309961648652687,0.0100106101558732,-0.0470591731202983,0.048112140780255
0.32,0.0680650450240561,-0.364437513067421,0.058504144411409,-0.319878602611522,0.00956090061264706,-0.0445589104558987,0.0455730986607419
0.33,0.069742842327822,-0.371848572770068,0.0606411961083874,-0.32978914915727,0.00910164621943456,-0.0420594236127979,0.0430329534025324
0.34,0.0714343593284705,-0.379255419203573,0.0628014347252825,-0.339693126743865,0.00863292460318804,-0.0395622924597074,0.040493238594508
0.35,0.0731399407938619,-0.3866581677955,0.0649853635170677,-0.34959036668501,0.00815457727679422,-0.03706780111049,0.0379541698595827
0.36,0.0748599043387759,-0.394056695542844,0.0671935018602998,-0.359480692760464,0.00766640247847611,-0.0345760027823793,0.0354157266672461
0.37,0.0765945833638111,-0.401450877245975,0.069426385927825,-0.36936392079637,0.00716819743598614,-0.0320869564496055,0.0328778927043714
0.38,0.0783443272264568,-0.408840586449812,0.0716845693978343,-0.379239858217604,0.00665975782862252,-0.0296007282322081,0.0303406573134621
0.39,0.0801095012410924,-0.416225695443817,0.0739686241992872,-0.38910830357001,0.00614087704180524,-0.0271173918738071,0.0278040161286133
0.4,0.0818904866789879,-0.423606075262001,0.0762791412958518,-0.398969046010151,0.00561134538313617,-0.0246370292518501,0.0252679719677968
0.41,0.0836876807683034,-0.430981595682922,0.0786167315106511,-0.408821864760018,0.00507094925765231,-0.0221597309229047,0.0227325361750338
0.42,0.0855014966940896,-0.438352125229684,0.0809820263942509,-0.418666528523901,0.00451947029983878,-0.0196855967057828,0.0201977307996183
0.43,0.0873323635982875,-0.445717531169937,0.0833756791384824,-0.428502794864394,0.00395668445980517,-0.017214736305543,0.0176635924427577
0.44,0.0891807265797284,-0.453077679515879,0.0857983655388646,-0.438330409534188,0.00338236104086383,-0.0147472699816905,0.0151301797122051
0.45,0.0910470464780307,-0.460432435029536,0.0882507850085646,-0.448149105760051,0.0027962614694661,-0.0122833292694848,0.0125975892990763
0.46,0.0929317876711923,-0.467781661521046,0.0907336616470279,-0.457958603475011,0.00219812602416435,-0.00982305804603523,0.010065993611854
0.47,0.0948353855698379,-0.475125222643248,0.0932477453666123,-0.467758608494421,0.00158764020322562,-0.00736661414882706,0.00753575513353488
0.48,0.0967582371843932,-0.48246298212226,0.0957938130807693,-0.477548811631153,0.000964424103623879,-0.00491417049110748,0.00500791228630477
0.49,0.098700701036568,-0.489794803759645,0.0983726699575494,-0.487328887744725,0.00032803107901852,-0.0024659160149203,0.0024876386758214
0.5,0.100663097159357,-0.49712055143241,0.100985150742438,-0.497098494718665,-0.0003220535830816,-2.20567137453331e-05,0.000322808006401546
0.51,0.102645707097039,-0.504440089093007,0.103632121154793,-0.506857272359852,-0.000986414057754348,0.00241718326684559,0.0026107063486447
0.52,0.104648773905178,-0.511753280769332,0.106314479362401,-0.516604841212976,-0.00166570545722335,0.0048515604436441,0.00512954319687004
0.53,0.106672502150622,-0.519059990564725,0.109033157538973,-0.526340801282553,-0.00236065538835105,0.00728081071782716,0.00765394660102732
0.54,0.108717057911505,-0.526360082657973,0.111789123509663,-0.536064730654213,-0.00307206559815776,0.00970464799623993,0.010179281888734
0.55,0.110782568777243,-0.533653421303304,0.114583382490009,-0.545776184006109,-0.0038008137127663,0.012122762702805,0.0127046275202255
0.56,0.112869124096142,-0.540939870788422,0.117416978924017,-0.555474691000372,-0.00454785482787456,0.0145348202119505,0.0152297072240128
0.57,0.114976801361623,-0.548219290961838,0.12029099842739,-0.565159754543525,-0.00531419706576688,0.0169404635816868,0.017754435975729
0.58,0.117105757139808,-0.555491521819958,0.123206569842284,-0.57483084890358,-0.00610081270247612,0.0193393270836217,0.0202787940390448
0.59,0.119256261203029,-0.562756377721191,0.126164867410246,-0.584487417670307,-0.00690860620721645,0.0217310399491165,0.0228027835361494
0.6,0.121428697134337,-0.570013647283484,0.12916711307036,-0.594128871543698,-0.00773841593602306,0.0241152242602142,0.0253264115563046
0.61,0.123623562327491,-0.577263093384322,0.132214578889905,-0.603754585934081,-0.00859101656241455,0.0264914925497597,0.0278496812026575
0.62,0.125841467986967,-0.584504453160725,0.135308589635167,-0.613363898355576,-0.00946712164819943,0.0288594451948512,0.0303725858177473
0.63,0.128083139127954,-0.591737438009252,0.13845052549028,-0.622956105592581,-0.0103673863623268,0.0312186675833296,0.0328951045850928
0.64,0.130349414576353,-0.598961733585998,0.141641824932273,-0.632530460616811,-0.0112924103559203,0.033568727030813,0.0354171987333235
0.65,0.13264124696878,-0.606176999806596,0.144883987770599,-0.642086169229902,-0.0122427408018189,0.035909169423306,0.0379388079809081
0.66,0.134959702752565,-0.613382870846215,0.148178578359629,-0.651622386403904,-0.0132188756070643,0.0382395155576887,0.0404598470387834
0.67,0.137305962418172,-0.620578956025291,0.151527228992537,-0.661138212288861,-0.0142212665743651,0.04055925626357,0.0429802011585928
0.68,0.13968137883742,-0.627765062127158,0.154931643484942,-0.670632687853288,-0.0152502646475221,0.0428676257261302,0.0454994934830603
0.69,0.142087740134072,-0.634942195156005,0.158393600956366,-0.680104790119511,-0.0163058608222947,0.0451625949635056,0.048016050243577
0.7,0.144527396354466,-0.642113043058436,0.161914959817133,-0.68955342695157,-0.0173875634626673,0.0474403838931337,0.0505264028711344
0.71,0.147003263186283,-0.64928198989511,0.165497661967527,-0.698977431348612,-0.0184943987812445,0.0496954414535017,0.0530252740449129
0.72,0.149518821958545,-0.656455115840742,0.169143737215014,-0.708375555191393,-0.0196249152564687,0.0519204393506513,0.0555055791897376
0.73,0.152078119641621,-0.663640197184103,0.17285530791378,-0.717746462383583,-0.0207771882721585,0.0541062651994805,0.0579584289498364
0.74,0.154685768847219,-0.670846706328021,0.176634593828836,-0.727088721322979,-0.0219488249816169,0.0562420149949586,0.060373132838762
0.75,0.157346947828393,-0.678085811789379,0.180483917224264,-0.736400796630422,-0.0231369693958706,0.0583149848410434,0.0627372043514578
0.76,0.160067400479538,-0.685370378199117,0.184405708171649,-0.745681040056106,-0.0243383076921115,0.0603106618569895,0.0650363679408992
0.77,0.162853436336392,-0.69271496630223,0.1884025100703,-0.754927680474009,-0.0255490737339075,0.0622127141717783,0.067254568419402
0.78,0.165711930748566,-0.700135832894249,0.192476985365045,-0.764138812865313,-0.0267650546164786,0.0640029799710641,0.0693739835514691
0.79,0.168650481890203,-0.707650873011663,0.196631921440187,-0.773312386180889,-0.0279814395499837,0.0656615131692269,0.0713750325461358
0.8,0.17167834839217,-0.715279274706225,0.200870236658999,-0.782446189961106,-0.0291918882668287,0.0671669152548803,0.0732363355544178
0.81,0.174807026564627,-0.723041306518054,0.205194986506722,-0.79153783957852,-0.0303879599420954,0.0684965330604668,0.0749346592088468
0.82,0.178050276286913,-0.730958307943258,0.209609369780767,-0.800584759955316,-0.031559093493854,0.0696264520120572,0.0764448768848581
0.83,0.181424121007546,-0.739052689433948,0.214116734754119,-0.80958416759289,-0.0326926137465727,0.0705314781589419,0.077739927996287
0.84,0.184946847744222,-0.747347932398225,0.218720585216147,-0.818533050735938,-0.0337737374719251,0.071185118337713,0.0787907762087462
0.85,0.188639007083813,-0.755868589200188,0.223424586268121,-0.827428147478007,-0.0347855791843082,0.0715595582778189,0.07956636789564
0.86,0.192523413182371,-0.764640283159931,0.228232569717834,-0.836265921600366,-0.0357091565354629,0.071625638440435,0.0800335925875761
0.87,0.196625143765129,-0.773689708553546,0.233148538877511,-0.845042535921822,-0.0365233951123829,0.0713528273682764,0.0801572477320815
0.88,0.200971540126492,-0.783044630613117,0.238176672520305,-0.853753822924845,-0.0372051323938131,0.0707091923117282,0.0799000109750814
0.89,0.205592207367678,-0.792733885730282,0.243321327691521,-0.862395252414503,-0.0377291203238435,0.069661366684221,0.0792224244057486
0.9,0.210521389484975,-0.80278941600661,0.248587040999427,-0.870961895963163,-0.0380656515144523,0.0681724799565523,0.0780799644508516
0.91,0.215817058235772,-0.813262621176191,0.253978527925212,-0.879448387898347,-0.0381614696894404,0.0661857667221557,0.0763993029121189
0.92,0.221575893422658,-0.824237191030882,0.259500679590163,-0.887848882607128,-0.0379247861675054,0.0636116915762461,0.0740590083044762
0.93,0.227934256216247,-0.835829939189023,0.265158556298512,-0.896157007962511,-0.0372243000822651,0.0603270687734876,0.0708872607978022
0.94,0.235068189155172,-0.848190803095442,0.270957377034646,-0.904365814731584,-0.0358891878794736,0.0561750116361416,0.0666608261197594
0.95,0.243193416146088,-0.86150284402145,0.276902503932324,-0.91246772190937,-0.0337090877862364,0.0509648778879201,0.0611041846153829
0.96,0.252565342463671,-0.875982247064842,0.282999420550701,-0.920454458046122,-0.0304340780870298,0.0444722109812801,0.0538888732353063
0.97,0.263479054750619,-0.8918783211499,0.289253702588762,-0.928316998811218,-0.0257746478381429,0.0364386776613175,0.0446330561454812
0.98,0.276269321017651,-0.90947349902739,0.295670979450243,-0.936045501278319,-0.0194016584325921,0.0265720022509283,0.032901301700059
0.99,0.291310590643506,-0.929083337274563,0.302256884843102,-0.943629235741047,-0.0109462941995959,0.0145458984664845,0.0182045191889647
1,0.309016994374947,-0.951056516295154,0.309016994375001,-0.9510565162951,-5.36237720893951e-14,-5.35127497869325e-14,7.57570018074517e-14
