%!TEX root=../../../../thesis.tex
%!TEX file=figures/caro-dynamics/planar/statics/residuals.tikz

\begin{tikzpicture}[%
  ]

\begin{axis}[%
    % General adjustments
    static residual iteration,%
    %
    % X-Axis
    xmode=log,%
    %
    % Y-Axis
    ymode=log,%
  ]

\pgfmathsetmacro{\caronumcab}{4}
\pgfmathsetmacro{\caropolydeg}{7}
\pgfmathsetmacro{\caronumsegment}{11}


% Residual threshold
\addplot+[%
    no markers,%
  ]%
  table[%
      x=k,%
      y=thresh,%
      col sep=comma,%
      unbounded coords=discard,%
    ]%
    {data/caro/spatial_3r3t/statics/material-trautwein/conn-crossed/degree-\caropolydeg/segment-\caronumsegment/residual.dat};
\addlegendentry{Threshold}


% Residual succession
\addplot+[%
  ]%
  table[%
      x=k,%
      y=t1,%
      col sep=comma,%
      unbounded coords=discard,%
    ]%
    {data/caro/spatial_3r3t/statics/material-trautwein/conn-crossed/degree-\caropolydeg/segment-\caronumsegment/residual.dat};
\addlegendentry{Residual norm $\norm{\residual}$}


\end{axis}

\end{tikzpicture}
