# Fdb version 4
["bibtex report_vi_exai"] 1707583264.77253 "report_vi_exai.aux" "report_vi_exai.bbl" "report_vi_exai" 1707583273.13182 2
  "./biblio.bib" 1707566494 2208 6445083fac993769252e2a6f4e20c325 ""
  "C:/Users/phil/AppData/Local/Programs/MiKTeX/bibtex/bst/bibtex/ieeetr.bst" 1291864344 18361 1a00e58565e7f19bf2b3e1bfb82254ae ""
  "report_vi_exai.aux" 1707583272 12358 5ef5234da67bf728ada71e3a3381efc2 "pdflatex"
  (generated)
  "report_vi_exai.bbl"
  "report_vi_exai.blg"
  (rewritten before read)
["pdflatex"] 1707583269.3746 "c:/Users/phil/university/verona/visual-intelligence-ecg-project/report/report_vi_exai.tex" "report_vi_exai.pdf" "report_vi_exai" 1707583273.13216 0
  "C:/Users/phil/AppData/Local/MiKTeX/fonts/map/pdftex/pdftex.map" 1707568012 156961 2275e41198124699e46fd3a91fc87cf3 ""
  "C:/Users/phil/AppData/Local/MiKTeX/fonts/pk/ljfour/jknappen/ec/dpi600/tcrm1200.pk" 1683141428 14064 c6f8a601dce39b3ae2462a9a02b3c926 ""
  "C:/Users/phil/AppData/Local/MiKTeX/miktex/data/le/pdftex/pdflatex.fmt" 1682950186 23178487 5764d13ecf0901e43e7b83d07ff1cc0f ""
  "C:/Users/phil/AppData/Local/Programs/MiKTeX/fonts/tfm/jknappen/ec/tcrm1200.tfm" 993062508 1444 95ffe0f19b974d50849790c8225c7ef7 ""
  "C:/Users/phil/AppData/Local/Programs/MiKTeX/fonts/tfm/public/amsfonts/cmextra/cmex7.tfm" 1233951848 1004 54797486969f23fa377b128694d548df ""
  "C:/Users/phil/AppData/Local/Programs/MiKTeX/fonts/tfm/public/amsfonts/cmextra/cmex8.tfm" 1233951848 988 bdf658c3bfc2d96d3c8b02cfc1c94c20 ""
  "C:/Users/phil/AppData/Local/Programs/MiKTeX/fonts/tfm/public/amsfonts/symbols/msam10.tfm" 1233951854 916 f87d7c45f9c908e672703b83b72241a3 ""
  "C:/Users/phil/AppData/Local/Programs/MiKTeX/fonts/tfm/public/amsfonts/symbols/msam5.tfm" 1233951854 924 9904cf1d39e9767e7a3622f2a125a565 ""
  "C:/Users/phil/AppData/Local/Programs/MiKTeX/fonts/tfm/public/amsfonts/symbols/msam7.tfm" 1233951854 928 2dc8d444221b7a635bb58038579b861a ""
  "C:/Users/phil/AppData/Local/Programs/MiKTeX/fonts/tfm/public/amsfonts/symbols/msbm10.tfm" 1233951854 908 2921f8a10601f252058503cc6570e581 ""
  "C:/Users/phil/AppData/Local/Programs/MiKTeX/fonts/tfm/public/amsfonts/symbols/msbm5.tfm" 1233951854 940 75ac932a52f80982a9f8ea75d03a34cf ""
  "C:/Users/phil/AppData/Local/Programs/MiKTeX/fonts/tfm/public/amsfonts/symbols/msbm7.tfm" 1233951854 940 228d6584342e91276bf566bcf9716b83 ""
  "C:/Users/phil/AppData/Local/Programs/MiKTeX/fonts/tfm/public/cm/cmbx12.tfm" 1136765053 1324 c910af8c371558dc20f2d7822f66fe64 ""
  "C:/Users/phil/AppData/Local/Programs/MiKTeX/fonts/tfm/public/cm/cmex10.tfm" 1136765053 992 662f679a0b3d2d53c1b94050fdaa3f50 ""
  "C:/Users/phil/AppData/Local/Programs/MiKTeX/fonts/tfm/public/cm/cmmi12.tfm" 1136765053 1524 4414a8315f39513458b80dfc63bff03a ""
  "C:/Users/phil/AppData/Local/Programs/MiKTeX/fonts/tfm/public/cm/cmmi6.tfm" 1136765053 1512 f21f83efb36853c0b70002322c1ab3ad ""
  "C:/Users/phil/AppData/Local/Programs/MiKTeX/fonts/tfm/public/cm/cmmi8.tfm" 1136765053 1520 eccf95517727cb11801f4f1aee3a21b4 ""
  "C:/Users/phil/AppData/Local/Programs/MiKTeX/fonts/tfm/public/cm/cmr12.tfm" 1136765053 1288 655e228510b4c2a1abe905c368440826 ""
  "C:/Users/phil/AppData/Local/Programs/MiKTeX/fonts/tfm/public/cm/cmr17.tfm" 1136765053 1292 296a67155bdbfc32aa9c636f21e91433 ""
  "C:/Users/phil/AppData/Local/Programs/MiKTeX/fonts/tfm/public/cm/cmr6.tfm" 1136765053 1300 b62933e007d01cfd073f79b963c01526 ""
  "C:/Users/phil/AppData/Local/Programs/MiKTeX/fonts/tfm/public/cm/cmr8.tfm" 1136765053 1292 21c1c5bfeaebccffdb478fd231a0997d ""
  "C:/Users/phil/AppData/Local/Programs/MiKTeX/fonts/tfm/public/cm/cmss12.tfm" 1136765053 1324 37b971caf729d7edd9cbb9f9b0ea76eb ""
  "C:/Users/phil/AppData/Local/Programs/MiKTeX/fonts/tfm/public/cm/cmssbx10.tfm" 1136765053 1272 e2d13f0df30bf3ad990bb9d028e37f34 ""
  "C:/Users/phil/AppData/Local/Programs/MiKTeX/fonts/tfm/public/cm/cmsy10.tfm" 1136765053 1124 6c73e740cf17375f03eec0ee63599741 ""
  "C:/Users/phil/AppData/Local/Programs/MiKTeX/fonts/tfm/public/cm/cmsy6.tfm" 1136765053 1116 933a60c408fc0a863a92debe84b2d294 ""
  "C:/Users/phil/AppData/Local/Programs/MiKTeX/fonts/tfm/public/cm/cmsy8.tfm" 1136765053 1120 8b7d695260f3cff42e636090a8002094 ""
  "C:/Users/phil/AppData/Local/Programs/MiKTeX/fonts/tfm/public/cm/cmti12.tfm" 1136765053 1484 ed72f8f5cf654cda15ecc8e32bfcbee5 ""
  "C:/Users/phil/AppData/Local/Programs/MiKTeX/fonts/tfm/public/cm/cmtt10.tfm" 1136765053 768 1321e9409b4137d6fb428ac9dc956269 ""
  "C:/Users/phil/AppData/Local/Programs/MiKTeX/fonts/tfm/public/cm/cmtt12.tfm" 1136765053 772 9a936b7f5e2ff0557fce0f62822f0bbf ""
  "C:/Users/phil/AppData/Local/Programs/MiKTeX/fonts/tfm/public/latex-fonts/lasy6.tfm" 1136765053 520 4889cce2180234b97cad636b6039c722 ""
  "C:/Users/phil/AppData/Local/Programs/MiKTeX/fonts/type1/public/amsfonts/cm/cmbx12.pfb" 1247596666 32080 340ef9bf63678554ee606688e7b5339d ""
  "C:/Users/phil/AppData/Local/Programs/MiKTeX/fonts/type1/public/amsfonts/cm/cmmi12.pfb" 1247596667 36741 0ee9e374ec3e30da87cdfb0ea3575226 ""
  "C:/Users/phil/AppData/Local/Programs/MiKTeX/fonts/type1/public/amsfonts/cm/cmr10.pfb" 1247596667 35752 024fb6c41858982481f6968b5fc26508 ""
  "C:/Users/phil/AppData/Local/Programs/MiKTeX/fonts/type1/public/amsfonts/cm/cmr12.pfb" 1247596667 32722 d7379af29a190c3f453aba36302ff5a9 ""
  "C:/Users/phil/AppData/Local/Programs/MiKTeX/fonts/type1/public/amsfonts/cm/cmr17.pfb" 1247596666 32362 bc3f3eec7ab7d65fe700963d4017d32c ""
  "C:/Users/phil/AppData/Local/Programs/MiKTeX/fonts/type1/public/amsfonts/cm/cmr7.pfb" 1247596667 32762 7fee39e011c23b3589931effd97b9702 ""
  "C:/Users/phil/AppData/Local/Programs/MiKTeX/fonts/type1/public/amsfonts/cm/cmr8.pfb" 1247596667 32726 39f0f9e62e84beb801509898a605dbd5 ""
  "C:/Users/phil/AppData/Local/Programs/MiKTeX/fonts/type1/public/amsfonts/cm/cmssbx10.pfb" 1247596666 28902 2f5c04fd2884d1878057baa5aad22765 ""
  "C:/Users/phil/AppData/Local/Programs/MiKTeX/fonts/type1/public/amsfonts/cm/cmti12.pfb" 1247596667 36118 fad905eba93cff5bce1e185fe980a177 ""
  "C:/Users/phil/AppData/Local/Programs/MiKTeX/fonts/type1/public/amsfonts/cm/cmtt10.pfb" 1247596667 31099 342ef5a582aacbd3346f3cf4579679fa ""
  "C:/Users/phil/AppData/Local/Programs/MiKTeX/fonts/type1/public/amsfonts/cm/cmtt12.pfb" 1247596666 24252 1e4e051947e12dfb50fee0b7f4e26e3a ""
  "C:/Users/phil/AppData/Local/Programs/MiKTeX/tex/context/base/mkii/supp-pdf.mkii" 1580390158 71627 94eb9990bed73c364d7f53f960cc8c5b ""
  "C:/Users/phil/AppData/Local/Programs/MiKTeX/tex/generic/atbegshi/atbegshi.sty" 1575571100 24708 5584a51a7101caf7e6bbf1fc27d8f7b1 ""
  "C:/Users/phil/AppData/Local/Programs/MiKTeX/tex/generic/babel/babel.sty" 1680013435 151578 01e8b46843d81abdfcc7dfbcd0188e2f ""
  "C:/Users/phil/AppData/Local/Programs/MiKTeX/tex/generic/babel/locale/en/babel-en.ini" 1680013437 3966 caeee5a9e5771d4446aa1ca9015ba1b2 ""
  "C:/Users/phil/AppData/Local/Programs/MiKTeX/tex/generic/babel/locale/en/babel-english.tex" 1680013438 336 ed676b5e7dfd862bc78d634f6a973f37 ""
  "C:/Users/phil/AppData/Local/Programs/MiKTeX/tex/generic/babel/txtbabel.def" 1680013435 6927 64b53e78feab932ab94f892bb5a5facf ""
  "C:/Users/phil/AppData/Local/Programs/MiKTeX/tex/generic/bigintcalc/bigintcalc.sty" 1576433602 40635 c40361e206be584d448876bba8a64a3b ""
  "C:/Users/phil/AppData/Local/Programs/MiKTeX/tex/generic/bitset/bitset.sty" 1575926576 33961 6b5c75130e435b2bfdb9f480a09a39f9 ""
  "C:/Users/phil/AppData/Local/Programs/MiKTeX/tex/generic/etexcmds/etexcmds.sty" 1576433638 7734 b98cbb34c81f667027c1e3ebdbfce34b ""
  "C:/Users/phil/AppData/Local/Programs/MiKTeX/tex/generic/gettitlestring/gettitlestring.sty" 1576433666 8371 9d55b8bd010bc717624922fb3477d92e ""
  "C:/Users/phil/AppData/Local/Programs/MiKTeX/tex/generic/iftex/iftex.sty" 1643997108 7237 bdd120a32c8fdb4b433cf9ca2e7cd98a ""
  "C:/Users/phil/AppData/Local/Programs/MiKTeX/tex/generic/infwarerr/infwarerr.sty" 1575399508 8356 7bbb2c2373aa810be568c29e333da8ed ""
  "C:/Users/phil/AppData/Local/Programs/MiKTeX/tex/generic/intcalc/intcalc.sty" 1576433764 31769 002a487f55041f8e805cfbf6385ffd97 ""
  "C:/Users/phil/AppData/Local/Programs/MiKTeX/tex/generic/kvdefinekeys/kvdefinekeys.sty" 1576763304 5412 d5a2436094cd7be85769db90f29250a6 ""
  "C:/Users/phil/AppData/Local/Programs/MiKTeX/tex/generic/ltxcmds/ltxcmds.sty" 1601735609 18568 4409f8f50cd365c68e684407e5350b1b ""
  "C:/Users/phil/AppData/Local/Programs/MiKTeX/tex/generic/pdfescape/pdfescape.sty" 1575926700 19007 15924f7228aca6c6d184b115f4baa231 ""
  "C:/Users/phil/AppData/Local/Programs/MiKTeX/tex/generic/pdftexcmds/pdftexcmds.sty" 1623005277 20089 80423eac55aa175305d35b49e04fe23b ""
  "C:/Users/phil/AppData/Local/Programs/MiKTeX/tex/generic/pgf/basiclayer/pgfcore.code.tex" 1673775190 1016 1c2b89187d12a2768764b83b4945667c ""
  "C:/Users/phil/AppData/Local/Programs/MiKTeX/tex/generic/pgf/basiclayer/pgfcorearrows.code.tex" 1673775190 43820 1fef971b75380574ab35a0d37fd92608 ""
  "C:/Users/phil/AppData/Local/Programs/MiKTeX/tex/generic/pgf/basiclayer/pgfcoreexternal.code.tex" 1673775190 19324 f4e4c6403dd0f1605fd20ed22fa79dea ""
  "C:/Users/phil/AppData/Local/Programs/MiKTeX/tex/generic/pgf/basiclayer/pgfcoregraphicstate.code.tex" 1673775190 6038 ccb406740cc3f03bbfb58ad504fe8c27 ""
  "C:/Users/phil/AppData/Local/Programs/MiKTeX/tex/generic/pgf/basiclayer/pgfcoreimage.code.tex" 1673775190 6911 f6d4cf5a3fef5cc879d668b810e82868 ""
  "C:/Users/phil/AppData/Local/Programs/MiKTeX/tex/generic/pgf/basiclayer/pgfcorelayers.code.tex" 1673775190 4883 42daaf41e27c3735286e23e48d2d7af9 ""
  "C:/Users/phil/AppData/Local/Programs/MiKTeX/tex/generic/pgf/basiclayer/pgfcoreobjects.code.tex" 1673775190 2544 8c06d2a7f0f469616ac9e13db6d2f842 ""
  "C:/Users/phil/AppData/Local/Programs/MiKTeX/tex/generic/pgf/basiclayer/pgfcorepathconstruct.code.tex" 1673775190 44195 5e390c414de027626ca5e2df888fa68d ""
  "C:/Users/phil/AppData/Local/Programs/MiKTeX/tex/generic/pgf/basiclayer/pgfcorepathprocessing.code.tex" 1673775190 17311 2ef6b2e29e2fc6a2fc8d6d652176e257 ""
  "C:/Users/phil/AppData/Local/Programs/MiKTeX/tex/generic/pgf/basiclayer/pgfcorepathusage.code.tex" 1673775190 21302 788a79944eb22192a4929e46963a3067 ""
  "C:/Users/phil/AppData/Local/Programs/MiKTeX/tex/generic/pgf/basiclayer/pgfcorepatterns.code.tex" 1673775190 9691 3d42d89522f4650c2f3dc616ca2b925e ""
  "C:/Users/phil/AppData/Local/Programs/MiKTeX/tex/generic/pgf/basiclayer/pgfcorepoints.code.tex" 1673775190 33335 dd1fa4814d4e51f18be97d88bf0da60c ""
  "C:/Users/phil/AppData/Local/Programs/MiKTeX/tex/generic/pgf/basiclayer/pgfcorequick.code.tex" 1673775190 2965 4c2b1f4e0826925746439038172e5d6f ""
  "C:/Users/phil/AppData/Local/Programs/MiKTeX/tex/generic/pgf/basiclayer/pgfcorerdf.code.tex" 1673775190 5196 2cc249e0ee7e03da5f5f6589257b1e5b ""
  "C:/Users/phil/AppData/Local/Programs/MiKTeX/tex/generic/pgf/basiclayer/pgfcorescopes.code.tex" 1673775190 20821 7579108c1e9363e61a0b1584778804aa ""
  "C:/Users/phil/AppData/Local/Programs/MiKTeX/tex/generic/pgf/basiclayer/pgfcoreshade.code.tex" 1673775190 35249 abd4adf948f960299a4b3d27c5dddf46 ""
  "C:/Users/phil/AppData/Local/Programs/MiKTeX/tex/generic/pgf/basiclayer/pgfcoretransformations.code.tex" 1673775190 22012 81b34a0aa8fa1a6158cc6220b00e4f10 ""
  "C:/Users/phil/AppData/Local/Programs/MiKTeX/tex/generic/pgf/basiclayer/pgfcoretransparency.code.tex" 1673775190 8893 e851de2175338fdf7c17f3e091d94618 ""
  "C:/Users/phil/AppData/Local/Programs/MiKTeX/tex/generic/pgf/frontendlayer/tikz/libraries/tikzlibrarypositioning.code.tex" 1673775190 3937 3f208572dd82c71103831da976d74f1a ""
  "C:/Users/phil/AppData/Local/Programs/MiKTeX/tex/generic/pgf/frontendlayer/tikz/libraries/tikzlibrarytopaths.code.tex" 1673775190 11518 738408f795261b70ce8dd47459171309 ""
  "C:/Users/phil/AppData/Local/Programs/MiKTeX/tex/generic/pgf/frontendlayer/tikz/tikz.code.tex" 1673775190 186782 af500404a9edec4d362912fe762ded92 ""
  "C:/Users/phil/AppData/Local/Programs/MiKTeX/tex/generic/pgf/libraries/pgflibraryplothandlers.code.tex" 1673775190 32995 ac577023e12c0e4bd8aa420b2e852d1a ""
  "C:/Users/phil/AppData/Local/Programs/MiKTeX/tex/generic/pgf/math/pgfint.code.tex" 1673775190 3063 8c415c68a0f3394e45cfeca0b65f6ee6 ""
  "C:/Users/phil/AppData/Local/Programs/MiKTeX/tex/generic/pgf/math/pgfmath.code.tex" 1673775190 949 cea70942e7b7eddabfb3186befada2e6 ""
  "C:/Users/phil/AppData/Local/Programs/MiKTeX/tex/generic/pgf/math/pgfmathcalc.code.tex" 1673775190 13270 2e54f2ce7622437bf37e013d399743e3 ""
  "C:/Users/phil/AppData/Local/Programs/MiKTeX/tex/generic/pgf/math/pgfmathfloat.code.tex" 1673775190 104717 9b2393fbf004a0ce7fa688dbce423848 ""
  "C:/Users/phil/AppData/Local/Programs/MiKTeX/tex/generic/pgf/math/pgfmathfunctions.base.code.tex" 1673775190 10165 cec5fa73d49da442e56efc2d605ef154 ""
  "C:/Users/phil/AppData/Local/Programs/MiKTeX/tex/generic/pgf/math/pgfmathfunctions.basic.code.tex" 1673775190 28178 41c17713108e0795aac6fef3d275fbca ""
  "C:/Users/phil/AppData/Local/Programs/MiKTeX/tex/generic/pgf/math/pgfmathfunctions.code.tex" 1673775190 9649 85779d3d8d573bfd2cd4137ba8202e60 ""
  "C:/Users/phil/AppData/Local/Programs/MiKTeX/tex/generic/pgf/math/pgfmathfunctions.comparison.code.tex" 1673775190 3865 ac538ab80c5cf82b345016e474786549 ""
  "C:/Users/phil/AppData/Local/Programs/MiKTeX/tex/generic/pgf/math/pgfmathfunctions.integerarithmetics.code.tex" 1673775190 3177 27d85c44fbfe09ff3b2cf2879e3ea434 ""
  "C:/Users/phil/AppData/Local/Programs/MiKTeX/tex/generic/pgf/math/pgfmathfunctions.misc.code.tex" 1673775190 11024 0179538121bc2dba172013a3ef89519f ""
  "C:/Users/phil/AppData/Local/Programs/MiKTeX/tex/generic/pgf/math/pgfmathfunctions.random.code.tex" 1673775190 7890 0a86dbf4edfd88d022e0d889ec78cc03 ""
  "C:/Users/phil/AppData/Local/Programs/MiKTeX/tex/generic/pgf/math/pgfmathfunctions.round.code.tex" 1673775190 3379 781797a101f647bab82741a99944a229 ""
  "C:/Users/phil/AppData/Local/Programs/MiKTeX/tex/generic/pgf/math/pgfmathfunctions.trigonometric.code.tex" 1673775190 92405 f515f31275db273f97b9d8f52e1b0736 ""
  "C:/Users/phil/AppData/Local/Programs/MiKTeX/tex/generic/pgf/math/pgfmathparser.code.tex" 1673775190 37466 97b0a1ba732e306a1a2034f5a73e239f ""
  "C:/Users/phil/AppData/Local/Programs/MiKTeX/tex/generic/pgf/math/pgfmathutil.code.tex" 1673775190 8471 c2883569d03f69e8e1cabfef4999cfd7 ""
  "C:/Users/phil/AppData/Local/Programs/MiKTeX/tex/generic/pgf/modules/pgfmodulematrix.code.tex" 1673775190 21211 1e73ec76bd73964d84197cc3d2685b01 ""
  "C:/Users/phil/AppData/Local/Programs/MiKTeX/tex/generic/pgf/modules/pgfmoduleplot.code.tex" 1673775190 16121 346f9013d34804439f7436ff6786cef7 ""
  "C:/Users/phil/AppData/Local/Programs/MiKTeX/tex/generic/pgf/modules/pgfmoduleshapes.code.tex" 1673775190 44792 271e2e1934f34c759f4dedb1e14a5015 ""
  "C:/Users/phil/AppData/Local/Programs/MiKTeX/tex/generic/pgf/pgf.revision.tex" 1673775190 114 e6d443369d0673933b38834bf99e422d ""
  "C:/Users/phil/AppData/Local/Programs/MiKTeX/tex/generic/pgf/systemlayer/pgf.cfg" 1673775190 926 2963ea0dcf6cc6c0a770b69ec46a477b ""
  "C:/Users/phil/AppData/Local/Programs/MiKTeX/tex/generic/pgf/systemlayer/pgfsys-common-pdf.def" 1673775190 5542 32f75a31ea6c3a7e1148cd6d5e93dbb7 ""
  "C:/Users/phil/AppData/Local/Programs/MiKTeX/tex/generic/pgf/systemlayer/pgfsys-pdftex.def" 1673775190 12612 7774ba67bfd72e593c4436c2de6201e3 ""
  "C:/Users/phil/AppData/Local/Programs/MiKTeX/tex/generic/pgf/systemlayer/pgfsys.code.tex" 1673775190 61351 bc5f86e0355834391e736e97a61abced ""
  "C:/Users/phil/AppData/Local/Programs/MiKTeX/tex/generic/pgf/systemlayer/pgfsysprotocol.code.tex" 1673775190 1896 b8e0ca0ac371d74c0ca05583f6313c91 ""
  "C:/Users/phil/AppData/Local/Programs/MiKTeX/tex/generic/pgf/systemlayer/pgfsyssoftpath.code.tex" 1673775190 7778 53c8b5623d80238f6a20aa1df1868e63 ""
  "C:/Users/phil/AppData/Local/Programs/MiKTeX/tex/generic/pgf/utilities/pgffor.code.tex" 1673775190 24033 d8893a1ec4d1bfa101b172754743d340 ""
  "C:/Users/phil/AppData/Local/Programs/MiKTeX/tex/generic/pgf/utilities/pgfkeys.code.tex" 1673775190 39784 414c54e866ebab4b801e2ad81d9b21d8 ""
  "C:/Users/phil/AppData/Local/Programs/MiKTeX/tex/generic/pgf/utilities/pgfkeyslibraryfiltered.code.tex" 1673775190 37433 940bc6d409f1ffd298adfdcaf125dd86 ""
  "C:/Users/phil/AppData/Local/Programs/MiKTeX/tex/generic/pgf/utilities/pgfrcs.code.tex" 1673775190 4385 510565c2f07998c8a0e14f0ec07ff23c ""
  "C:/Users/phil/AppData/Local/Programs/MiKTeX/tex/generic/pgf/utilities/pgfutil-common.tex" 1673775190 29239 22e8c7516012992a49873eff0d868fed ""
  "C:/Users/phil/AppData/Local/Programs/MiKTeX/tex/generic/pgf/utilities/pgfutil-latex.def" 1673775190 6950 8524a062d82b7afdc4a88a57cb377784 ""
  "C:/Users/phil/AppData/Local/Programs/MiKTeX/tex/generic/tracklang/tracklang.tex" 1670930869 141476 ac3d8d70bed5ec2b0ff757eb1ce593b1 ""
  "C:/Users/phil/AppData/Local/Programs/MiKTeX/tex/generic/uniquecounter/uniquecounter.sty" 1576434012 7008 f92eaa0a3872ed622bbf538217cd2ab7 ""
  "C:/Users/phil/AppData/Local/Programs/MiKTeX/tex/generic/xkeyval/xkeyval.tex" 1656236919 19231 27205ee17aaa2902aea3e0c07a3cfc65 ""
  "C:/Users/phil/AppData/Local/Programs/MiKTeX/tex/generic/xkeyval/xkvutils.tex" 1656236919 7677 9cb1a74d945bc9331f2181c0a59ff34a ""
  "C:/Users/phil/AppData/Local/Programs/MiKTeX/tex/generic/xstring/xstring.tex" 1673962217 48215 374fa42173896b227f2f50bc75dfda91 ""
  "C:/Users/phil/AppData/Local/Programs/MiKTeX/tex/latex/00miktex/epstopdf-sys.cfg" 1616067285 584 2a1075dd71571459f59146da9f7502ad ""
  "C:/Users/phil/AppData/Local/Programs/MiKTeX/tex/latex/amsfonts/amsfonts.sty" 1358197772 5949 3f3fd50a8cc94c3d4cbf4fc66cd3df1c ""
  "C:/Users/phil/AppData/Local/Programs/MiKTeX/tex/latex/amsfonts/amssymb.sty" 1358197772 13829 94730e64147574077f8ecfea9bb69af4 ""
  "C:/Users/phil/AppData/Local/Programs/MiKTeX/tex/latex/amsfonts/umsa.fd" 1358197772 961 6518c6525a34feb5e8250ffa91731cff ""
  "C:/Users/phil/AppData/Local/Programs/MiKTeX/tex/latex/amsfonts/umsb.fd" 1358197772 961 d02606146ba5601b5645f987c92e6193 ""
  "C:/Users/phil/AppData/Local/Programs/MiKTeX/tex/latex/amsmath/amsbsy.sty" 1655058189 2222 78b930a5a6e3dc2ac69b78c2057b94d7 ""
  "C:/Users/phil/AppData/Local/Programs/MiKTeX/tex/latex/amsmath/amsgen.sty" 1655058191 4173 c989ee3ced31418e3593916ab26c793a ""
  "C:/Users/phil/AppData/Local/Programs/MiKTeX/tex/latex/amsmath/amsmath.sty" 1655058191 88393 1adf6fa3f245270d06e3d4f8910f7fc5 ""
  "C:/Users/phil/AppData/Local/Programs/MiKTeX/tex/latex/amsmath/amsopn.sty" 1655058192 4474 f04cd1cc7bd76eb033e6fb12eb6a0d77 ""
  "C:/Users/phil/AppData/Local/Programs/MiKTeX/tex/latex/amsmath/amstext.sty" 1655058193 2444 70065bddd85997dc1fd0bb7ae634e5fa ""
  "C:/Users/phil/AppData/Local/Programs/MiKTeX/tex/latex/arabi/bblopts.cfg" 1139961600 902 c30e5c373bc58bde21f8f63a3091626f ""
  "C:/Users/phil/AppData/Local/Programs/MiKTeX/tex/latex/atveryend/atveryend.sty" 1576101110 19336 ce7ae9438967282886b3b036cfad1e4d ""
  "C:/Users/phil/AppData/Local/Programs/MiKTeX/tex/latex/auxhook/auxhook.sty" 1576538732 3935 57aa3c3e203a5c2effb4d2bd2efbc323 ""
  "C:/Users/phil/AppData/Local/Programs/MiKTeX/tex/latex/babel-english/english.ldf" 1623001666 7008 9ff5fdcc865b01beca2b0fe4a46231d4 ""
  "C:/Users/phil/AppData/Local/Programs/MiKTeX/tex/latex/base/atbegshi-ltx.sty" 1669844196 3052 30236f0cc243a8651b82240dfd2e8b9d ""
  "C:/Users/phil/AppData/Local/Programs/MiKTeX/tex/latex/base/atveryend-ltx.sty" 1669844196 2462 8ce5f9a9c63002f2c1af03c262cf29af ""
  "C:/Users/phil/AppData/Local/Programs/MiKTeX/tex/latex/base/ifthen.sty" 1669844196 5319 48d7f3cfa322abd2788e3c09d624b922 ""
  "C:/Users/phil/AppData/Local/Programs/MiKTeX/tex/latex/base/inputenc.sty" 1669844196 5048 84b05796b49b69e2d4257d537721c960 ""
  "C:/Users/phil/AppData/Local/Programs/MiKTeX/tex/latex/base/textcomp.sty" 1669844196 2894 f2f8ee7d4fb94263f9f255fa22cab2d3 ""
  "C:/Users/phil/AppData/Local/Programs/MiKTeX/tex/latex/bookmark/bkm-pdftex.def" 1604855866 8609 8ac7db65d9617618cf703bd16c1bd0b8 ""
  "C:/Users/phil/AppData/Local/Programs/MiKTeX/tex/latex/bookmark/bookmark.sty" 1604855866 18237 5cbdfe9ef383a557f780a0a1f45cdb1c ""
  "C:/Users/phil/AppData/Local/Programs/MiKTeX/tex/latex/booktabs/booktabs.sty" 1579093635 6253 f1cb470c9199e7110a27851508ed7a5c ""
  "C:/Users/phil/AppData/Local/Programs/MiKTeX/tex/latex/caption/caption-koma.sto" 1678645786 6099 0a43c359eb167698d477663a73b893ea ""
  "C:/Users/phil/AppData/Local/Programs/MiKTeX/tex/latex/caption/caption.sty" 1678645786 55778 14d5c99aa26410e440820bb9ea5b8b3a ""
  "C:/Users/phil/AppData/Local/Programs/MiKTeX/tex/latex/caption/caption3.sty" 1678645786 71836 1a735454ad10692452eb2f2fc37f3865 ""
  "C:/Users/phil/AppData/Local/Programs/MiKTeX/tex/latex/caption/ltcaption.sty" 1678645786 7418 021d7c4eb11bde94592761855a3d046e ""
  "C:/Users/phil/AppData/Local/Programs/MiKTeX/tex/latex/changes/changes.sty" 1626526453 29978 a9cfa26176db050060b35afe018a6d31 ""
  "C:/Users/phil/AppData/Local/Programs/MiKTeX/tex/latex/chemgreek/chemgreek.sty" 1579207476 47530 64600845afa9c25b782d42fa33f66772 ""
  "C:/Users/phil/AppData/Local/Programs/MiKTeX/tex/latex/datatool/datatool-base.sty" 1569610470 93620 4e9f9aa754a2337e89df3eeca1527291 ""
  "C:/Users/phil/AppData/Local/Programs/MiKTeX/tex/latex/datatool/datatool-fp.sty" 1569610470 3944 92aa06b5428fcc1b751c82409f23f92f ""
  "C:/Users/phil/AppData/Local/Programs/MiKTeX/tex/latex/epstopdf-pkg/epstopdf-base.sty" 1623003186 13886 d1306dcf79a944f6988e688c1785f9ce ""
  "C:/Users/phil/AppData/Local/Programs/MiKTeX/tex/latex/etoolbox/etoolbox.sty" 1601897756 46845 3b58f70c6e861a13d927bff09d35ecbc ""
  "C:/Users/phil/AppData/Local/Programs/MiKTeX/tex/latex/fancyhdr/fancyhdr.sty" 1668504483 18450 88279bf67c81e69f8e3f1c1bad1a26c5 ""
  "C:/Users/phil/AppData/Local/Programs/MiKTeX/tex/latex/float/float.sty" 1469023953 6916 16d2656a1984957e674b149555f1ea1d ""
  "C:/Users/phil/AppData/Local/Programs/MiKTeX/tex/latex/footmisc/footmisc.sty" 1646818468 21361 67512b0642debcd4503e59fcbbb767f1 ""
  "C:/Users/phil/AppData/Local/Programs/MiKTeX/tex/latex/fp/defpattern.sty" 1547501276 1081 6a8d78d0e6b2d89334f92fd122c1da99 ""
  "C:/Users/phil/AppData/Local/Programs/MiKTeX/tex/latex/fp/fp-addons.sty" 1547501276 1275 fe903646b72b3e877914d78f2db9ddda ""
  "C:/Users/phil/AppData/Local/Programs/MiKTeX/tex/latex/fp/fp-basic.sty" 1547501276 29695 b6366b50463dfb367cf560419d0cea8d ""
  "C:/Users/phil/AppData/Local/Programs/MiKTeX/tex/latex/fp/fp-eqn.sty" 1547501276 11336 afed7aa5dbc4bf246950282b95e522c2 ""
  "C:/Users/phil/AppData/Local/Programs/MiKTeX/tex/latex/fp/fp-eval.sty" 1547501276 6220 eeeffd00d1235e73c380c6dc9f30ac43 ""
  "C:/Users/phil/AppData/Local/Programs/MiKTeX/tex/latex/fp/fp-exp.sty" 1547501276 16965 df20a610ce368cd126fd73d1a4e4fef1 ""
  "C:/Users/phil/AppData/Local/Programs/MiKTeX/tex/latex/fp/fp-pas.sty" 1547501276 3006 6fd5da0dc83ba1d19525f1fb08dca7df ""
  "C:/Users/phil/AppData/Local/Programs/MiKTeX/tex/latex/fp/fp-random.sty" 1547501276 3702 6e54ac63212901d59e6ea2a32b0a7689 ""
  "C:/Users/phil/AppData/Local/Programs/MiKTeX/tex/latex/fp/fp-snap.sty" 1547501276 6519 c1e5d3c6aed32ba782f756d79578d87b ""
  "C:/Users/phil/AppData/Local/Programs/MiKTeX/tex/latex/fp/fp-trigo.sty" 1547501276 28969 342a2de338e342de95d2551557e50f06 ""
  "C:/Users/phil/AppData/Local/Programs/MiKTeX/tex/latex/fp/fp-upn.sty" 1547501276 7154 78a835a719e27a484e63f1f98ba4df11 ""
  "C:/Users/phil/AppData/Local/Programs/MiKTeX/tex/latex/fp/fp.sty" 1547501276 983 d84df22b060ce125f89a32c403dcab31 ""
  "C:/Users/phil/AppData/Local/Programs/MiKTeX/tex/latex/glossaries-english/glossaries-english.ldf" 1432895212 3755 cfd7063dcf1f89f4d3681b9a8bd5be4d ""
  "C:/Users/phil/AppData/Local/Programs/MiKTeX/tex/latex/glossaries/base/glossaries.sty" 1667471073 235425 843f68cbb7afbcf8f70a3079ab3caf4f ""
  "C:/Users/phil/AppData/Local/Programs/MiKTeX/tex/latex/glossaries/styles/glossary-hypernav.sty" 1667471073 6027 87a039db234f03a903243f7ccddb5f3b ""
  "C:/Users/phil/AppData/Local/Programs/MiKTeX/tex/latex/glossaries/styles/glossary-list.sty" 1667471073 7492 e3f25e64c46dab950dd296970dcf5570 ""
  "C:/Users/phil/AppData/Local/Programs/MiKTeX/tex/latex/glossaries/styles/glossary-long.sty" 1667471073 9383 0d2174d2c71b71d3963a865a486368d5 ""
  "C:/Users/phil/AppData/Local/Programs/MiKTeX/tex/latex/glossaries/styles/glossary-super.sty" 1667471073 10402 d2bfb61366b7b8e90ea9abcad67d701b ""
  "C:/Users/phil/AppData/Local/Programs/MiKTeX/tex/latex/glossaries/styles/glossary-tree.sty" 1667471073 12895 0773f3d18cc48bcfa9eca07ef67ae886 ""
  "C:/Users/phil/AppData/Local/Programs/MiKTeX/tex/latex/graphics-cfg/color.cfg" 1465894292 1213 620bba36b25224fa9b7e1ccb4ecb76fd ""
  "C:/Users/phil/AppData/Local/Programs/MiKTeX/tex/latex/graphics-cfg/graphics.cfg" 1465894292 1224 978390e9c2234eab29404bc21b268d1e ""
  "C:/Users/phil/AppData/Local/Programs/MiKTeX/tex/latex/graphics-def/pdftex.def" 1663918690 19448 1e988b341dda20961a6b931bcde55519 ""
  "C:/Users/phil/AppData/Local/Programs/MiKTeX/tex/latex/graphics/color.sty" 1665067579 7233 e46ce9241d2b2ca2a78155475fdd557a ""
  "C:/Users/phil/AppData/Local/Programs/MiKTeX/tex/latex/graphics/graphics.sty" 1665067579 18387 8f900a490197ebaf93c02ae9476d4b09 ""
  "C:/Users/phil/AppData/Local/Programs/MiKTeX/tex/latex/graphics/graphicx.sty" 1665067579 8010 a8d949cbdbc5c983593827c9eec252e1 ""
  "C:/Users/phil/AppData/Local/Programs/MiKTeX/tex/latex/graphics/keyval.sty" 1665067579 2671 7e67d78d9b88c845599a85b2d41f2e39 ""
  "C:/Users/phil/AppData/Local/Programs/MiKTeX/tex/latex/graphics/mathcolor.ltx" 1665067579 3171 1cf0d440b5464e2f034398ce4ef36f75 ""
  "C:/Users/phil/AppData/Local/Programs/MiKTeX/tex/latex/graphics/trig.sty" 1665067579 4023 293ea1c16429fc0c4cf605f4da1791a9 ""
  "C:/Users/phil/AppData/Local/Programs/MiKTeX/tex/latex/hycolor/hycolor.sty" 1580380792 18571 4c28a13fc3d975e6e81c9bea1d697276 ""
  "C:/Users/phil/AppData/Local/Programs/MiKTeX/tex/latex/hyperref/hpdftex.def" 1675853528 48272 99ede602a8ace626d8ed02f058a4bf8e ""
  "C:/Users/phil/AppData/Local/Programs/MiKTeX/tex/latex/hyperref/hyperref.sty" 1675853528 223129 4edf043af471f3251c66e432cfa22987 ""
  "C:/Users/phil/AppData/Local/Programs/MiKTeX/tex/latex/hyperref/nameref.sty" 1675853528 12947 1ce831528e963a8568de1f4d67cfb982 ""
  "C:/Users/phil/AppData/Local/Programs/MiKTeX/tex/latex/hyperref/pd1enc.def" 1675853528 14249 d947c5c09f3af04ae2f37fc11c7ac2f6 ""
  "C:/Users/phil/AppData/Local/Programs/MiKTeX/tex/latex/hyperref/puenc.def" 1675853528 117125 aa115cac3914abcf3769f370e6325117 ""
  "C:/Users/phil/AppData/Local/Programs/MiKTeX/tex/latex/koma-script/scrartcl.cls" 1682323517 241769 4b17d331263a08017a2207a0b713c6bc ""
  "C:/Users/phil/AppData/Local/Programs/MiKTeX/tex/latex/koma-script/scrbase.sty" 1682323517 100782 bf23ffaf7e864d11e60315b0d0336a2f ""
  "C:/Users/phil/AppData/Local/Programs/MiKTeX/tex/latex/koma-script/scrkbase.sty" 1682323517 21943 3af0be29636ca4a0ba515108b440c412 ""
  "C:/Users/phil/AppData/Local/Programs/MiKTeX/tex/latex/koma-script/scrlfile-hook.sty" 1682323517 11185 58c4e13a3be6905f4707b23a23b0724f ""
  "C:/Users/phil/AppData/Local/Programs/MiKTeX/tex/latex/koma-script/scrlfile.sty" 1682323516 3328 a0b73ce0052b2173ac589357ecdacce9 ""
  "C:/Users/phil/AppData/Local/Programs/MiKTeX/tex/latex/koma-script/scrlogo.sty" 1682323517 2162 f256a36eda00586cd87cafcf2486ca8a ""
  "C:/Users/phil/AppData/Local/Programs/MiKTeX/tex/latex/koma-script/scrsize12pt.clo" 1682323517 6875 3e142451d9fe6f853e664fc0c0d2904f ""
  "C:/Users/phil/AppData/Local/Programs/MiKTeX/tex/latex/koma-script/tocbasic.sty" 1682323517 109429 b73eec75e76eec5bb7723d7415db08bd ""
  "C:/Users/phil/AppData/Local/Programs/MiKTeX/tex/latex/koma-script/typearea.sty" 1682323517 58356 db5d798e1c44baa73063020a3086db33 ""
  "C:/Users/phil/AppData/Local/Programs/MiKTeX/tex/latex/kvoptions/kvoptions.sty" 1656236481 22555 6d8e155cfef6d82c3d5c742fea7c992e ""
  "C:/Users/phil/AppData/Local/Programs/MiKTeX/tex/latex/kvsetkeys/kvsetkeys.sty" 1665066333 13815 760b0c02f691ea230f5359c4e1de23a7 ""
  "C:/Users/phil/AppData/Local/Programs/MiKTeX/tex/latex/l3backend/l3backend-pdftex.def" 1680182075 29768 5600b3a98028e2e01b60e7f98fbf4b9c ""
  "C:/Users/phil/AppData/Local/Programs/MiKTeX/tex/latex/l3kernel/expl3.sty" 1680182821 6107 315d4fb3eadc8324d4c14694285a7ca1 ""
  "C:/Users/phil/AppData/Local/Programs/MiKTeX/tex/latex/l3packages/l3keys2e/l3keys2e.sty" 1675359988 4674 257c150d9d5c2fbc229303c8beaf6228 ""
  "C:/Users/phil/AppData/Local/Programs/MiKTeX/tex/latex/l3packages/xparse/xparse.sty" 1675359988 6812 3c152a1c8d562d7b7291c4839b61a5c3 ""
  "C:/Users/phil/AppData/Local/Programs/MiKTeX/tex/latex/letltxmacro/letltxmacro.sty" 1575399536 5766 13a9e8766c47f30327caf893ece86ac8 ""
  "C:/Users/phil/AppData/Local/Programs/MiKTeX/tex/latex/listings/listings.cfg" 1679057124 1829 d8258b7d94f5f955e70c623e525f9f45 ""
  "C:/Users/phil/AppData/Local/Programs/MiKTeX/tex/latex/listings/listings.sty" 1679057124 80947 75a96bb4c9f40ae31d54a01d924df2ff ""
  "C:/Users/phil/AppData/Local/Programs/MiKTeX/tex/latex/listings/lstmisc.sty" 1679057124 77021 d05e9115c67855816136d82929db8892 ""
  "C:/Users/phil/AppData/Local/Programs/MiKTeX/tex/latex/mfirstuc/mfirstuc.sty" 1666081343 18649 0158a8d684645a30f5c01e471f44e851 ""
  "C:/Users/phil/AppData/Local/Programs/MiKTeX/tex/latex/mhchem/mhchem.sty" 1640904071 133877 e74a3594a37b21d6547a1e9494929337 ""
  "C:/Users/phil/AppData/Local/Programs/MiKTeX/tex/latex/multirow/multirow.sty" 1615976118 6149 2398eec4faa1ee24ff761581e580ecf1 ""
  "C:/Users/phil/AppData/Local/Programs/MiKTeX/tex/latex/paralist/paralist.sty" 1485161856 15336 82c76ebe8f06becf69ab309565b2a0cb ""
  "C:/Users/phil/AppData/Local/Programs/MiKTeX/tex/latex/pgf/basiclayer/pgf.sty" 1673775190 1090 bae35ef70b3168089ef166db3e66f5b2 ""
  "C:/Users/phil/AppData/Local/Programs/MiKTeX/tex/latex/pgf/basiclayer/pgfcore.sty" 1673775190 373 00b204b1d7d095b892ad31a7494b0373 ""
  "C:/Users/phil/AppData/Local/Programs/MiKTeX/tex/latex/pgf/compatibility/pgfcomp-version-0-65.sty" 1673775190 21013 f4ff83d25bb56552493b030f27c075ae ""
  "C:/Users/phil/AppData/Local/Programs/MiKTeX/tex/latex/pgf/compatibility/pgfcomp-version-1-18.sty" 1673775190 989 c49c8ae06d96f8b15869da7428047b1e ""
  "C:/Users/phil/AppData/Local/Programs/MiKTeX/tex/latex/pgf/frontendlayer/tikz.sty" 1673775190 339 c2e180022e3afdb99c7d0ea5ce469b7d ""
  "C:/Users/phil/AppData/Local/Programs/MiKTeX/tex/latex/pgf/math/pgfmath.sty" 1673775190 306 c56a323ca5bf9242f54474ced10fca71 ""
  "C:/Users/phil/AppData/Local/Programs/MiKTeX/tex/latex/pgf/systemlayer/pgfsys.sty" 1673775190 443 8c872229db56122037e86bcda49e14f3 ""
  "C:/Users/phil/AppData/Local/Programs/MiKTeX/tex/latex/pgf/utilities/pgffor.sty" 1673775190 348 ee405e64380c11319f0e249fed57e6c5 ""
  "C:/Users/phil/AppData/Local/Programs/MiKTeX/tex/latex/pgf/utilities/pgfkeys.sty" 1673775190 274 5ae372b7df79135d240456a1c6f2cf9a ""
  "C:/Users/phil/AppData/Local/Programs/MiKTeX/tex/latex/pgf/utilities/pgfrcs.sty" 1673775190 325 f9f16d12354225b7dd52a3321f085955 ""
  "C:/Users/phil/AppData/Local/Programs/MiKTeX/tex/latex/refcount/refcount.sty" 1576433952 9878 9e94e8fa600d95f9c7731bb21dfb67a4 ""
  "C:/Users/phil/AppData/Local/Programs/MiKTeX/tex/latex/rerunfilecheck/rerunfilecheck.sty" 1657800696 9714 ba3194bd52c8499b3f1e3eb91d409670 ""
  "C:/Users/phil/AppData/Local/Programs/MiKTeX/tex/latex/siunitx/siunitx.sty" 1681395561 313759 f0f0e76eadb5da465b394f4d3c651d55 ""
  "C:/Users/phil/AppData/Local/Programs/MiKTeX/tex/latex/subfig/subfig.sty" 1121277410 22049 9ef165ca6df8815c92e693146a376c92 ""
  "C:/Users/phil/AppData/Local/Programs/MiKTeX/tex/latex/substr/substr.sty" 1256066043 5724 d3505925e87b345f11a5f17d58550dea ""
  "C:/Users/phil/AppData/Local/Programs/MiKTeX/tex/latex/supertabular/supertabular.sty" 1580746462 15931 31e477e611bb77761a134e5593e8119d ""
  "C:/Users/phil/AppData/Local/Programs/MiKTeX/tex/latex/todonotes/todonotes.sty" 1675595005 21300 a6e0d5f13b9360f0419aa0d6b30a9c96 ""
  "C:/Users/phil/AppData/Local/Programs/MiKTeX/tex/latex/tools/array.sty" 1667242266 12691 5b542990fe866f3d772f71346cf85b95 ""
  "C:/Users/phil/AppData/Local/Programs/MiKTeX/tex/latex/tools/calc.sty" 1667242266 10214 de3e21cfc0eccc98ca7f8dac0ef263d2 ""
  "C:/Users/phil/AppData/Local/Programs/MiKTeX/tex/latex/tools/longtable.sty" 1667242266 12892 af5f5e872a6e322f3e5ba2c881288a56 ""
  "C:/Users/phil/AppData/Local/Programs/MiKTeX/tex/latex/tools/varioref.sty" 1667242266 44072 47d12e0ca39e8c13f028d8e1527f87d7 ""
  "C:/Users/phil/AppData/Local/Programs/MiKTeX/tex/latex/tracklang/tracklang.sty" 1670930869 9021 97184989e222403ee383aaf91e0f1ae0 ""
  "C:/Users/phil/AppData/Local/Programs/MiKTeX/tex/latex/translations/dicts/translations-basic-dictionary-english.trsl" 1644048522 5588 0c1628daf15f4411ff1f463114c634a3 ""
  "C:/Users/phil/AppData/Local/Programs/MiKTeX/tex/latex/translations/translations.sty" 1644048522 44247 2188b95d0ee74e31eca4d316263c58a7 ""
  "C:/Users/phil/AppData/Local/Programs/MiKTeX/tex/latex/translator/translator.sty" 1622471510 8765 56d370785f0143111ff9898b5adfe08e ""
  "C:/Users/phil/AppData/Local/Programs/MiKTeX/tex/latex/truncate/truncate.sty" 998353158 6657 bba86b8809c129cc7edd6da64c0c1e43 ""
  "C:/Users/phil/AppData/Local/Programs/MiKTeX/tex/latex/ulem/ulem.sty" 1578651445 15682 94f55b803e160cf7fb6e4d77d07cfe1d ""
  "C:/Users/phil/AppData/Local/Programs/MiKTeX/tex/latex/url/url.sty" 1388490452 12796 8edb7d69a20b857904dd0ea757c14ec9 ""
  "C:/Users/phil/AppData/Local/Programs/MiKTeX/tex/latex/wrapfig/wrapfig.sty" 1044403200 26220 3701aebf80ccdef248c0c20dd062fea9 ""
  "C:/Users/phil/AppData/Local/Programs/MiKTeX/tex/latex/xcolor/xcolor.sty" 1656236890 56148 51a9a8571c07b9921892ae11063ae853 ""
  "C:/Users/phil/AppData/Local/Programs/MiKTeX/tex/latex/xfor/xfor.sty" 1233849756 2689 44855b72da58344b1c1d9b3087bce6ca ""
  "C:/Users/phil/AppData/Local/Programs/MiKTeX/tex/latex/xkeyval/xkeyval.sty" 1656236919 4937 4ce600ce9bd4ec84d0250eb6892fcf4f ""
  "C:/Users/phil/AppData/Local/Programs/MiKTeX/tex/latex/xstring/xstring.sty" 1673962217 123 a302f2c651a95033260db60e51527ae8 ""
  "c:/Users/phil/university/verona/visual-intelligence-ecg-project/report/report_vi_exai.tex" 1707570913 5905 e34bfcc7e2c8a3955cb2d2eeebbddd77 ""
  "images/arrhytmia_nonarrhytmia.png" 1707569259 55650 ca581d459030391afb3bf9a733c75a4a ""
  "images/biosppy_ecg_summary.png" 1707558958 94464 b2c4e1da569381cb9e115994af051ad7 ""
  "images/pca_binary_plot.png" 1707570384 116416 a1e59ec0861831207fbdab1a64776c44 ""
  "images/plots_all_ecg_channels.png" 1707559112 163440 35f4e2c7beaf56a64aa8c98db10e4272 ""
  "images/rfe_binary_three_features.png" 1707570365 117510 7522af552cbee0d2b3bbb2b48cf756e8 ""
  "images/scattering_first_order.png" 1707562199 50100 26e25f0c5a98f81a1aad0ea2678856ff ""
  "images/scattering_original_signal.png" 1707562169 78289 7d9895f7c2322dbd6765d11836b01f03 ""
  "images/scattering_second_order.png" 1707562218 80896 4e3df131e95329fc8f8ee9adf4186002 ""
  "images/scattering_zeroth_order.png" 1707562185 60692 69a0b481d44be9d7361fad2b278382e2 ""
  "logo.png" 1702421224 784732 0e620b35eb5aa4aa48a843691fb9a60e ""
  "report_vi_exai.acr" 1707566517 1269 557e3bbc7dd325e8d3304a1f76d553dc ""
  "report_vi_exai.aux" 1707583272 12358 5ef5234da67bf728ada71e3a3381efc2 "pdflatex"
  "report_vi_exai.bbl" 1707583265 1516 2baedd2fdbef950fc0b4bf2c252cc895 "bibtex report_vi_exai"
  "report_vi_exai.lof" 1707583272 1123 3a89f0a2ad2ca926490e8cce03c63fe2 "pdflatex"
  "report_vi_exai.lot" 1707583272 714 380811c1326e8fa3f3b14986154d3fda "pdflatex"
  "report_vi_exai.tex" 1707570913 5905 e34bfcc7e2c8a3955cb2d2eeebbddd77 ""
  "report_vi_exai.toc" 1707583272 1373 fad59cc4465d181dbc2e1be9f6f6df3d "pdflatex"
  "sections/dataset.tex" 1707567009 3943 0109a9aa133284f0c593949edc091b80 ""
  "sections/dnn.tex" 1707571116 181 8b0c4446c1d34b2a9e42fd486b0fde56 ""
  "sections/evaluation.tex" 1706285809 690 43c05559ced3cbe977d54e54bf0561a4 ""
  "sections/introduction.tex" 1707561066 1413 3aa0073eccf22103f62e345a9795e3a2 ""
  "sections/processing_pipeline.tex" 1707560961 1605 319c34e5e5c35cc4bb98fe20000ba4ba ""
  "sections/scattering.tex" 1707562991 2787 719c08dfba02df952e6034a3340d359a ""
  "sections/svm.tex" 1707583261 7407 548ced84cd3889aea794956d475f6022 ""
  (generated)
  "report_vi_exai.acn"
  "report_vi_exai.aux"
  "report_vi_exai.glo"
  "report_vi_exai.ist"
  "report_vi_exai.loc"
  "report_vi_exai.lof"
  "report_vi_exai.log"
  "report_vi_exai.lot"
  "report_vi_exai.pdf"
  "report_vi_exai.soc"
  "report_vi_exai.toc"
  (rewritten before read)
