F:\homework\IT411\IT411WebServices\SampleWebService\src\conn\HibernateConnection.java
F:\homework\IT411\IT411WebServices\SampleWebService\src\controller\ResponseObj.java
F:\homework\IT411\IT411WebServices\SampleWebService\src\controller\UserController.java
F:\homework\IT411\IT411WebServices\SampleWebService\src\bean\User.java
F:\homework\IT411\IT411WebServices\SampleWebService\src\controller\UserManager.java
F:\homework\IT411\IT411WebServices\SampleWebService\src\controller\PasswordUtil.java
F:\homework\IT411\IT411WebServices\SampleWebService\src\controller\appController.java
