{
    "AWSEBDockerrunVersion": "1",
    "Image": {
       "Name": "524233844543.dkr.ecr.eu-central-1.amazonaws.com/cloudbootcamp-philipp-jaeger-containerregistry:latest"
    },
    "Ports": [
       {"ContainerPort": "8080"}
    ]
 }