{
  "infodisplay": {
    "position": {
      "description": "position is used for the weather forecast api calls as well as the astrals panel (sunrise/golden hour)",
      "latitude": 47.424377,
      "longitude": 8.541136
    },
    "localisation": {
      "description": "localisation for time information and astrals observer",
      "timezone": "Europe/Zurich",
      "country": "Switzerland",
      "city": "Zurich"
    },
    "weatherIcons": {
      "iconPathLarge": "ioBroker.swiss-weather-api/img/weather-icons/png_128x128/",
      "iconPathSmall": "ioBroker.swiss-weather-api/img/weather-icons/png_64x64/",
      "iconMappingXML": "ioBroker.swiss-weather-api/img/weather-icons/SRG-SSR-WeatherAPITranslations.xml"
    },
    "eventCalendar": {
      "description": "Display events for the upcoming <eventDaysLimit> number of days from a shared calendar",
      "eventDaysLimit": 45
    },
    "badi": {
      "description": "The pool information api endpoint and the public pools we like to query",
      "badiAPIURL": "https://www.stadt-zuerich.ch/stzh/bathdatadownload",
      "ourBadis": ["Freibad Seebach", "Seebad Katzensee", "Seebad Utoquai", "Freibad Auhof"]

    },
    "departures": {
      "description": "Get the departure times for a public transport stop, starting <minutesAdvance> in the future",
      "minutesAdvance": "5",
      "numberOfResults": "6",
      "stop": "8591103",      
      "transportURL": "https://api.opentransportdata.swiss/trias2020",
      "postRequestTemplate": "opentransport_POST_request_xml.j2"
    }
    
  }
}



