ID;name;descr;price;isLoose;currency_code;product_category_id
1;Apple;"An apple a day, keeps the doctor away.";2;true;USD;4
2;Bread;"Everyone needs a bread.";5;false;USD;2
3;Eggs;"Don't throw it. It will break";1;false;USD;3