%YAML 1.1
%TAG !u! tag:unity3d.com,2011:
--- !u!1001 &7608991408445885525
PrefabInstance:
  m_ObjectHideFlags: 0
  serializedVersion: 2
  m_Modification:
    m_TransformParent: {fileID: 0}
    m_Modifications:
    - target: {fileID: 2148883854839435178, guid: 0b28f666c9a097f4c871ad1996784805,
        type: 3}
      propertyPath: m_Name
      value: HalfCube
      objectReference: {fileID: 0}
    - target: {fileID: 5572517829330752755, guid: 0b28f666c9a097f4c871ad1996784805,
        type: 3}
      propertyPath: m_RootOrder
      value: 0
      objectReference: {fileID: 0}
    - target: {fileID: 5572517829330752755, guid: 0b28f666c9a097f4c871ad1996784805,
        type: 3}
      propertyPath: m_LocalPosition.x
      value: 0
      objectReference: {fileID: 0}
    - target: {fileID: 5572517829330752755, guid: 0b28f666c9a097f4c871ad1996784805,
        type: 3}
      propertyPath: m_LocalPosition.y
      value: 0
      objectReference: {fileID: 0}
    - target: {fileID: 5572517829330752755, guid: 0b28f666c9a097f4c871ad1996784805,
        type: 3}
      propertyPath: m_LocalPosition.z
      value: 0
      objectReference: {fileID: 0}
    - target: {fileID: 5572517829330752755, guid: 0b28f666c9a097f4c871ad1996784805,
        type: 3}
      propertyPath: m_LocalRotation.w
      value: 1
      objectReference: {fileID: 0}
    - target: {fileID: 5572517829330752755, guid: 0b28f666c9a097f4c871ad1996784805,
        type: 3}
      propertyPath: m_LocalRotation.x
      value: 0
      objectReference: {fileID: 0}
    - target: {fileID: 5572517829330752755, guid: 0b28f666c9a097f4c871ad1996784805,
        type: 3}
      propertyPath: m_LocalRotation.y
      value: 0
      objectReference: {fileID: 0}
    - target: {fileID: 5572517829330752755, guid: 0b28f666c9a097f4c871ad1996784805,
        type: 3}
      propertyPath: m_LocalRotation.z
      value: 0
      objectReference: {fileID: 0}
    - target: {fileID: 5572517829330752755, guid: 0b28f666c9a097f4c871ad1996784805,
        type: 3}
      propertyPath: m_LocalEulerAnglesHint.x
      value: 0
      objectReference: {fileID: 0}
    - target: {fileID: 5572517829330752755, guid: 0b28f666c9a097f4c871ad1996784805,
        type: 3}
      propertyPath: m_LocalEulerAnglesHint.y
      value: 0
      objectReference: {fileID: 0}
    - target: {fileID: 5572517829330752755, guid: 0b28f666c9a097f4c871ad1996784805,
        type: 3}
      propertyPath: m_LocalEulerAnglesHint.z
      value: 0
      objectReference: {fileID: 0}
    - target: {fileID: 6165873756016731476, guid: 0b28f666c9a097f4c871ad1996784805,
        type: 3}
      propertyPath: m_Materials.Array.data[0]
      value: 
      objectReference: {fileID: 2100000, guid: 6f4c36870c8833c4b8f549e790d2d9ec, type: 2}
    m_RemovedComponents: []
  m_SourcePrefab: {fileID: 100100000, guid: 0b28f666c9a097f4c871ad1996784805, type: 3}
