<?xml version="1.0" encoding="UTF-8"?>

<!--
SPDX-FileCopyrightText: GNOME Design Team

SPDX-License-Identifier: CC0-1.0
-->

<svg width="16" height="16" version="1.1" viewBox="0 0 16 16" xmlns="http://www.w3.org/2000/svg">
 <path d="m3.7227 0.83203c0.57812 0.007813 1.168 0.23047 1.6914 0.75391l9 9c0.375 0.375 0.58594 0.88281 0.58594 1.4141v3h-3c-0.53125 0-1.0391-0.21094-1.4141-0.58594l-9-9c-1.7891-1.7891-0.082032-4.3906 1.8906-4.5703 0.082032-0.011719 0.16406-0.011719 0.24609-0.011719zm1.7773 3.6055-1.0625 1.0625 7.0625 7.0625 1.0625-1.0625z"/>
</svg>
