{
    "name": "python3-dateparser",
    "buildsystem": "simple",
    "build-commands": [
        "pip3 install --verbose --exists-action=i --no-index --find-links=\"file://${PWD}\" --prefix=${FLATPAK_DEST} \"dateparser\" --no-build-isolation"
    ],
    "sources": [
        {
            "type": "file",
            "url": "https://files.pythonhosted.org/packages/61/1e/3c4bf37f8d6ceba07ae357e70eedd21bd15a032b460bab6b12a58c0fce9d/tzdata-2022.6-py2.py3-none-any.whl",
            "sha256": "04a680bdc5b15750c39c12a448885a51134a27ec9af83667663f0b3a1bf3f342"
        },
        {
            "type": "file",
            "url": "https://files.pythonhosted.org/packages/31/b7/3bc2c1868f27677139b772e4fde95265b93151912fd90eb874827943bfcf/tzlocal-4.2-py3-none-any.whl",
            "sha256": "89885494684c929d9191c57aa27502afc87a579be5cdd3225c77c463ea043745"
        },
        {
            "type": "file",
            "url": "https://files.pythonhosted.org/packages/85/ac/92f998fc52a70afd7f6b788142632afb27cd60c8c782d1452b7466603332/pytz-2022.6-py2.py3-none-any.whl",
            "sha256": "222439474e9c98fced559f1709d89e6c9cbf8d79c794ff3eb9f8800064291427"
        },
        {
            "type": "file",
            "url": "https://files.pythonhosted.org/packages/4f/17/21e7195da87bcdbdd4ec32fdfdc87ccd5cf97b0a18e0f08ecacbaefca284/regex-2022.3.2.tar.gz",
            "sha256": "79e5af1ff258bc0fe0bdd6f69bc4ae33935a898e3cbefbbccf22e88a27fa053b"
        },
        {
            "type": "file",
            "url": "https://files.pythonhosted.org/packages/8e/ef/f90aada30357af0c8c502e300322816a799d9d8ef109b5f10542b4aaa8ec/dateparser-1.1.3-py2.py3-none-any.whl",
            "sha256": "711f7eef6d431225bec56c00e386af3f6a47083276253375bdae1ae6c8d23d4a"
        },
        {
            "type": "file",
            "url": "https://files.pythonhosted.org/packages/36/7a/87837f39d0296e723bb9b62bbb257d0355c7f6128853c78955f57342a56d/python_dateutil-2.8.2-py2.py3-none-any.whl",
            "sha256": "961d03dc3453ebbc59dbdea9e4e11c5651520a876d0f4db161e8674aae935da9"
        },
        {
            "type": "file",
            "url": "https://files.pythonhosted.org/packages/eb/73/3eaab547ca809754e67e06871cff0fc962bafd4b604e15f31896a0f94431/pytz_deprecation_shim-0.1.0.post0-py2.py3-none-any.whl",
            "sha256": "8314c9692a636c8eb3bda879b9f119e350e93223ae83e70e80c31675a0fdc1a6"
        }
    ]
}