%YAML 1.1
%TAG !u! tag:unity3d.com,2011:
--- !u!1 &723519637606697307
GameObject:
  m_ObjectHideFlags: 0
  m_CorrespondingSourceObject: {fileID: 0}
  m_PrefabInstance: {fileID: 0}
  m_PrefabAsset: {fileID: 0}
  serializedVersion: 6
  m_Component:
  - component: {fileID: 723519637606697308}
  m_Layer: 0
  m_Name: Targets
  m_TagString: Untagged
  m_Icon: {fileID: 0}
  m_NavMeshLayer: 0
  m_StaticEditorFlags: 0
  m_IsActive: 1
--- !u!4 &723519637606697308
Transform:
  m_ObjectHideFlags: 0
  m_CorrespondingSourceObject: {fileID: 0}
  m_PrefabInstance: {fileID: 0}
  m_PrefabAsset: {fileID: 0}
  m_GameObject: {fileID: 723519637606697307}
  m_LocalRotation: {x: 0, y: 0, z: 0, w: 1}
  m_LocalPosition: {x: -7.53, y: 2.5, z: 0}
  m_LocalScale: {x: 1, y: 1, z: 1}
  m_Children:
  - {fileID: 1961859938536329334}
  - {fileID: 1961859937541801231}
  m_Father: {fileID: 0}
  m_RootOrder: 0
  m_LocalEulerAnglesHint: {x: 0, y: 0, z: 0}
--- !u!1001 &723519636089313233
PrefabInstance:
  m_ObjectHideFlags: 0
  serializedVersion: 2
  m_Modification:
    m_TransformParent: {fileID: 723519637606697308}
    m_Modifications:
    - target: {fileID: 1235526252110482510, guid: 62c8b040bd9d91c4986211c8f0717c48,
        type: 3}
      propertyPath: m_Name
      value: B
      objectReference: {fileID: 0}
    - target: {fileID: 1235526252110482510, guid: 62c8b040bd9d91c4986211c8f0717c48,
        type: 3}
      propertyPath: m_Layer
      value: 0
      objectReference: {fileID: 0}
    - target: {fileID: 1235526252110482510, guid: 62c8b040bd9d91c4986211c8f0717c48,
        type: 3}
      propertyPath: m_TagString
      value: GhostTargetB
      objectReference: {fileID: 0}
    - target: {fileID: 1239501991892243166, guid: 62c8b040bd9d91c4986211c8f0717c48,
        type: 3}
      propertyPath: m_LocalPosition.x
      value: 8.96
      objectReference: {fileID: 0}
    - target: {fileID: 1239501991892243166, guid: 62c8b040bd9d91c4986211c8f0717c48,
        type: 3}
      propertyPath: m_LocalPosition.y
      value: 0.1
      objectReference: {fileID: 0}
    - target: {fileID: 1239501991892243166, guid: 62c8b040bd9d91c4986211c8f0717c48,
        type: 3}
      propertyPath: m_LocalPosition.z
      value: 0
      objectReference: {fileID: 0}
    - target: {fileID: 1239501991892243166, guid: 62c8b040bd9d91c4986211c8f0717c48,
        type: 3}
      propertyPath: m_LocalRotation.x
      value: -0
      objectReference: {fileID: 0}
    - target: {fileID: 1239501991892243166, guid: 62c8b040bd9d91c4986211c8f0717c48,
        type: 3}
      propertyPath: m_LocalRotation.y
      value: -0
      objectReference: {fileID: 0}
    - target: {fileID: 1239501991892243166, guid: 62c8b040bd9d91c4986211c8f0717c48,
        type: 3}
      propertyPath: m_LocalRotation.z
      value: -0
      objectReference: {fileID: 0}
    - target: {fileID: 1239501991892243166, guid: 62c8b040bd9d91c4986211c8f0717c48,
        type: 3}
      propertyPath: m_LocalRotation.w
      value: 1
      objectReference: {fileID: 0}
    - target: {fileID: 1239501991892243166, guid: 62c8b040bd9d91c4986211c8f0717c48,
        type: 3}
      propertyPath: m_RootOrder
      value: 1
      objectReference: {fileID: 0}
    - target: {fileID: 1239501991892243166, guid: 62c8b040bd9d91c4986211c8f0717c48,
        type: 3}
      propertyPath: m_LocalEulerAnglesHint.x
      value: 0
      objectReference: {fileID: 0}
    - target: {fileID: 1239501991892243166, guid: 62c8b040bd9d91c4986211c8f0717c48,
        type: 3}
      propertyPath: m_LocalEulerAnglesHint.y
      value: 0
      objectReference: {fileID: 0}
    - target: {fileID: 1239501991892243166, guid: 62c8b040bd9d91c4986211c8f0717c48,
        type: 3}
      propertyPath: m_LocalEulerAnglesHint.z
      value: 0
      objectReference: {fileID: 0}
    - target: {fileID: 1428069240084460566, guid: 62c8b040bd9d91c4986211c8f0717c48,
        type: 3}
      propertyPath: m_SortingOrder
      value: 1
      objectReference: {fileID: 0}
    m_RemovedComponents: []
  m_SourcePrefab: {fileID: 100100000, guid: 62c8b040bd9d91c4986211c8f0717c48, type: 3}
--- !u!4 &1961859937541801231 stripped
Transform:
  m_CorrespondingSourceObject: {fileID: 1239501991892243166, guid: 62c8b040bd9d91c4986211c8f0717c48,
    type: 3}
  m_PrefabInstance: {fileID: 723519636089313233}
  m_PrefabAsset: {fileID: 0}
--- !u!1001 &723519636517634728
PrefabInstance:
  m_ObjectHideFlags: 0
  serializedVersion: 2
  m_Modification:
    m_TransformParent: {fileID: 723519637606697308}
    m_Modifications:
    - target: {fileID: 1235526252110482510, guid: 62c8b040bd9d91c4986211c8f0717c48,
        type: 3}
      propertyPath: m_Name
      value: A
      objectReference: {fileID: 0}
    - target: {fileID: 1235526252110482510, guid: 62c8b040bd9d91c4986211c8f0717c48,
        type: 3}
      propertyPath: m_Layer
      value: 0
      objectReference: {fileID: 0}
    - target: {fileID: 1235526252110482510, guid: 62c8b040bd9d91c4986211c8f0717c48,
        type: 3}
      propertyPath: m_TagString
      value: GhostTargetA
      objectReference: {fileID: 0}
    - target: {fileID: 1239501991892243166, guid: 62c8b040bd9d91c4986211c8f0717c48,
        type: 3}
      propertyPath: m_LocalPosition.x
      value: 0
      objectReference: {fileID: 0}
    - target: {fileID: 1239501991892243166, guid: 62c8b040bd9d91c4986211c8f0717c48,
        type: 3}
      propertyPath: m_LocalPosition.y
      value: 0
      objectReference: {fileID: 0}
    - target: {fileID: 1239501991892243166, guid: 62c8b040bd9d91c4986211c8f0717c48,
        type: 3}
      propertyPath: m_LocalPosition.z
      value: 0
      objectReference: {fileID: 0}
    - target: {fileID: 1239501991892243166, guid: 62c8b040bd9d91c4986211c8f0717c48,
        type: 3}
      propertyPath: m_LocalRotation.x
      value: -0
      objectReference: {fileID: 0}
    - target: {fileID: 1239501991892243166, guid: 62c8b040bd9d91c4986211c8f0717c48,
        type: 3}
      propertyPath: m_LocalRotation.y
      value: -0
      objectReference: {fileID: 0}
    - target: {fileID: 1239501991892243166, guid: 62c8b040bd9d91c4986211c8f0717c48,
        type: 3}
      propertyPath: m_LocalRotation.z
      value: -0
      objectReference: {fileID: 0}
    - target: {fileID: 1239501991892243166, guid: 62c8b040bd9d91c4986211c8f0717c48,
        type: 3}
      propertyPath: m_LocalRotation.w
      value: 1
      objectReference: {fileID: 0}
    - target: {fileID: 1239501991892243166, guid: 62c8b040bd9d91c4986211c8f0717c48,
        type: 3}
      propertyPath: m_RootOrder
      value: 0
      objectReference: {fileID: 0}
    - target: {fileID: 1239501991892243166, guid: 62c8b040bd9d91c4986211c8f0717c48,
        type: 3}
      propertyPath: m_LocalEulerAnglesHint.x
      value: 0
      objectReference: {fileID: 0}
    - target: {fileID: 1239501991892243166, guid: 62c8b040bd9d91c4986211c8f0717c48,
        type: 3}
      propertyPath: m_LocalEulerAnglesHint.y
      value: 0
      objectReference: {fileID: 0}
    - target: {fileID: 1239501991892243166, guid: 62c8b040bd9d91c4986211c8f0717c48,
        type: 3}
      propertyPath: m_LocalEulerAnglesHint.z
      value: 0
      objectReference: {fileID: 0}
    - target: {fileID: 1428069240084460566, guid: 62c8b040bd9d91c4986211c8f0717c48,
        type: 3}
      propertyPath: m_SortingOrder
      value: 1
      objectReference: {fileID: 0}
    m_RemovedComponents: []
  m_SourcePrefab: {fileID: 100100000, guid: 62c8b040bd9d91c4986211c8f0717c48, type: 3}
--- !u!4 &1961859938536329334 stripped
Transform:
  m_CorrespondingSourceObject: {fileID: 1239501991892243166, guid: 62c8b040bd9d91c4986211c8f0717c48,
    type: 3}
  m_PrefabInstance: {fileID: 723519636517634728}
  m_PrefabAsset: {fileID: 0}
