%YAML 1.1
%TAG !u! tag:unity3d.com,2011:
--- !u!29 &1
OcclusionCullingSettings:
  m_ObjectHideFlags: 0
  serializedVersion: 2
  m_OcclusionBakeSettings:
    smallestOccluder: 5
    smallestHole: 0.25
    backfaceThreshold: 100
  m_SceneGUID: 00000000000000000000000000000000
  m_OcclusionCullingData: {fileID: 0}
--- !u!104 &2
RenderSettings:
  m_ObjectHideFlags: 0
  serializedVersion: 9
  m_Fog: 0
  m_FogColor: {r: 0.5, g: 0.5, b: 0.5, a: 1}
  m_FogMode: 3
  m_FogDensity: 0.01
  m_LinearFogStart: 0
  m_LinearFogEnd: 300
  m_AmbientSkyColor: {r: 1, g: 1, b: 1, a: 1}
  m_AmbientEquatorColor: {r: 0.114, g: 0.125, b: 0.133, a: 1}
  m_AmbientGroundColor: {r: 0.047, g: 0.043, b: 0.035, a: 1}
  m_AmbientIntensity: 1
  m_AmbientMode: 3
  m_SubtractiveShadowColor: {r: 0.42, g: 0.478, b: 0.627, a: 1}
  m_SkyboxMaterial: {fileID: 0}
  m_HaloStrength: 0.5
  m_FlareStrength: 1
  m_FlareFadeSpeed: 3
  m_HaloTexture: {fileID: 0}
  m_SpotCookie: {fileID: 10001, guid: 0000000000000000e000000000000000, type: 0}
  m_DefaultReflectionMode: 0
  m_DefaultReflectionResolution: 128
  m_ReflectionBounces: 1
  m_ReflectionIntensity: 1
  m_CustomReflection: {fileID: 0}
  m_Sun: {fileID: 0}
  m_IndirectSpecularColor: {r: 0, g: 0, b: 0, a: 1}
  m_UseRadianceAmbientProbe: 0
--- !u!157 &3
LightmapSettings:
  m_ObjectHideFlags: 0
  serializedVersion: 12
  m_GIWorkflowMode: 1
  m_GISettings:
    serializedVersion: 2
    m_BounceScale: 1
    m_IndirectOutputScale: 1
    m_AlbedoBoost: 1
    m_EnvironmentLightingMode: 0
    m_EnableBakedLightmaps: 1
    m_EnableRealtimeLightmaps: 1
  m_LightmapEditorSettings:
    serializedVersion: 12
    m_Resolution: 2
    m_BakeResolution: 40
    m_AtlasSize: 1024
    m_AO: 0
    m_AOMaxDistance: 1
    m_CompAOExponent: 1
    m_CompAOExponentDirect: 0
    m_ExtractAmbientOcclusion: 0
    m_Padding: 2
    m_LightmapParameters: {fileID: 0}
    m_LightmapsBakeMode: 1
    m_TextureCompression: 1
    m_FinalGather: 0
    m_FinalGatherFiltering: 1
    m_FinalGatherRayCount: 256
    m_ReflectionCompression: 2
    m_MixedBakeMode: 2
    m_BakeBackend: 1
    m_PVRSampling: 1
    m_PVRDirectSampleCount: 32
    m_PVRSampleCount: 500
    m_PVRBounces: 2
    m_PVREnvironmentSampleCount: 500
    m_PVREnvironmentReferencePointCount: 2048
    m_PVRFilteringMode: 2
    m_PVRDenoiserTypeDirect: 0
    m_PVRDenoiserTypeIndirect: 0
    m_PVRDenoiserTypeAO: 0
    m_PVRFilterTypeDirect: 0
    m_PVRFilterTypeIndirect: 0
    m_PVRFilterTypeAO: 0
    m_PVREnvironmentMIS: 0
    m_PVRCulling: 1
    m_PVRFilteringGaussRadiusDirect: 1
    m_PVRFilteringGaussRadiusIndirect: 5
    m_PVRFilteringGaussRadiusAO: 2
    m_PVRFilteringAtrousPositionSigmaDirect: 0.5
    m_PVRFilteringAtrousPositionSigmaIndirect: 2
    m_PVRFilteringAtrousPositionSigmaAO: 1
    m_ExportTrainingData: 0
    m_TrainingDataDestination: TrainingData
    m_LightProbeSampleCountMultiplier: 4
  m_LightingDataAsset: {fileID: 0}
  m_LightingSettings: {fileID: 1160171723}
--- !u!196 &4
NavMeshSettings:
  serializedVersion: 2
  m_ObjectHideFlags: 0
  m_BuildSettings:
    serializedVersion: 2
    agentTypeID: 0
    agentRadius: 0.5
    agentHeight: 2
    agentSlope: 45
    agentClimb: 0.4
    ledgeDropHeight: 0
    maxJumpAcrossDistance: 0
    minRegionArea: 2
    manualCellSize: 0
    cellSize: 0.16666667
    manualTileSize: 0
    tileSize: 256
    accuratePlacement: 0
    maxJobWorkers: 0
    preserveTilesOutsideBounds: 0
    debug:
      m_Flags: 0
  m_NavMeshData: {fileID: 0}
--- !u!850595691 &1160171723
LightingSettings:
  m_ObjectHideFlags: 0
  m_CorrespondingSourceObject: {fileID: 0}
  m_PrefabInstance: {fileID: 0}
  m_PrefabAsset: {fileID: 0}
  m_Name: Settings.lighting
  serializedVersion: 2
  m_GIWorkflowMode: 1
  m_EnableBakedLightmaps: 1
  m_EnableRealtimeLightmaps: 1
  m_RealtimeEnvironmentLighting: 1
  m_BounceScale: 1
  m_AlbedoBoost: 1
  m_IndirectOutputScale: 1
  m_UsingShadowmask: 1
  m_BakeBackend: 1
  m_LightmapMaxSize: 1024
  m_BakeResolution: 40
  m_Padding: 2
  m_TextureCompression: 1
  m_AO: 0
  m_AOMaxDistance: 1
  m_CompAOExponent: 1
  m_CompAOExponentDirect: 0
  m_ExtractAO: 0
  m_MixedBakeMode: 2
  m_LightmapsBakeMode: 1
  m_FilterMode: 1
  m_LightmapParameters: {fileID: 0}
  m_ExportTrainingData: 0
  m_TrainingDataDestination: TrainingData
  m_RealtimeResolution: 2
  m_ForceWhiteAlbedo: 0
  m_ForceUpdates: 0
  m_FinalGather: 0
  m_FinalGatherRayCount: 256
  m_FinalGatherFiltering: 1
  m_PVRCulling: 1
  m_PVRSampling: 1
  m_PVRDirectSampleCount: 32
  m_PVRSampleCount: 500
  m_PVREnvironmentSampleCount: 500
  m_PVREnvironmentReferencePointCount: 2048
  m_LightProbeSampleCountMultiplier: 4
  m_PVRBounces: 2
  m_PVRRussianRouletteStartBounce: 2
  m_PVREnvironmentMIS: 0
  m_PVRFilteringMode: 2
  m_PVRDenoiserTypeDirect: 0
  m_PVRDenoiserTypeIndirect: 0
  m_PVRDenoiserTypeAO: 0
  m_PVRFilterTypeDirect: 0
  m_PVRFilterTypeIndirect: 0
  m_PVRFilterTypeAO: 0
  m_PVRFilteringGaussRadiusDirect: 1
  m_PVRFilteringGaussRadiusIndirect: 5
  m_PVRFilteringGaussRadiusAO: 2
  m_PVRFilteringAtrousPositionSigmaDirect: 0.5
  m_PVRFilteringAtrousPositionSigmaIndirect: 2
  m_PVRFilteringAtrousPositionSigmaAO: 1
--- !u!1 &1203675875
GameObject:
  m_ObjectHideFlags: 0
  m_CorrespondingSourceObject: {fileID: 0}
  m_PrefabInstance: {fileID: 0}
  m_PrefabAsset: {fileID: 0}
  serializedVersion: 6
  m_Component:
  - component: {fileID: 1203675877}
  - component: {fileID: 1203675878}
  - component: {fileID: 1203675879}
  m_Layer: 0
  m_Name: GameController
  m_TagString: GameController
  m_Icon: {fileID: 0}
  m_NavMeshLayer: 0
  m_StaticEditorFlags: 0
  m_IsActive: 1
--- !u!4 &1203675877
Transform:
  m_ObjectHideFlags: 0
  m_CorrespondingSourceObject: {fileID: 0}
  m_PrefabInstance: {fileID: 0}
  m_PrefabAsset: {fileID: 0}
  m_GameObject: {fileID: 1203675875}
  m_LocalRotation: {x: 0, y: 0, z: 0, w: 1}
  m_LocalPosition: {x: 0, y: 0, z: 0}
  m_LocalScale: {x: 1, y: 1, z: 1}
  m_Children: []
  m_Father: {fileID: 0}
  m_RootOrder: 0
  m_LocalEulerAnglesHint: {x: 0, y: 0, z: 0}
--- !u!114 &1203675878
MonoBehaviour:
  m_ObjectHideFlags: 0
  m_CorrespondingSourceObject: {fileID: 0}
  m_PrefabInstance: {fileID: 0}
  m_PrefabAsset: {fileID: 0}
  m_GameObject: {fileID: 1203675875}
  m_Enabled: 1
  m_EditorHideFlags: 0
  m_Script: {fileID: 11500000, guid: 7c2f896ce235449e8dbbc310180f64b2, type: 3}
  m_Name: 
  m_EditorClassIdentifier: 
  allScenes:
  - {fileID: 11400000, guid: 667f78154ae206f4abe4b878d113cd0e, type: 2}
  - {fileID: 11400000, guid: 9c52baa211313514e80baac382ff3e76, type: 2}
  - {fileID: 11400000, guid: 309ad093a08e08b4481b5f1900c923ab, type: 2}
  - {fileID: 11400000, guid: 2c76e6f96b88cb64b9e294820fff70c4, type: 2}
  - {fileID: 11400000, guid: 903730de9bdbf1945ac92a8bb74d4b1f, type: 2}
  introLevelScreen: {fileID: 11400000, guid: c720843144fe15b49b99e8327fb5d333, type: 2}
  endLevelScreen: {fileID: 11400000, guid: 720e551c9283ff7458f37c2d962d566e, type: 2}
  multiplayerEndLevelScreen: {fileID: 11400000, guid: f7abd6cb115a4ee4a9e53abe020bc5d2,
    type: 2}
  uiScene: {fileID: 11400000, guid: 42a1bb3225f3e4d44a2ebb8425aed3a4, type: 2}
  defaultTime: 80
  spendingGoal: 10000
--- !u!114 &1203675879
MonoBehaviour:
  m_ObjectHideFlags: 0
  m_CorrespondingSourceObject: {fileID: 0}
  m_PrefabInstance: {fileID: 0}
  m_PrefabAsset: {fileID: 0}
  m_GameObject: {fileID: 1203675875}
  m_Enabled: 1
  m_EditorHideFlags: 0
  m_Script: {fileID: 11500000, guid: 482de451c09046c19986d95c934fbaf6, type: 3}
  m_Name: 
  m_EditorClassIdentifier: 
  bufferPosition: {x: -100, y: -100, z: 0}
  itemPrefabs:
  - {fileID: 6835457005212035557, guid: 240ec9e4e3874ef4283c5144f9697a7d, type: 3}
  - {fileID: 3879257282002267820, guid: 197d4cf41fa4ff149a385ebd54233fb8, type: 3}
  - {fileID: 2811002082812147465, guid: 119b757cd12e67844a4364479f864811, type: 3}
  - {fileID: 754158283591554946, guid: acb427509d94da4429e3dac838f3ef13, type: 3}
  - {fileID: 6576440490933834580, guid: adecd0c69e8101c458af6d847bc1b4fc, type: 3}
  - {fileID: 6531862568117942883, guid: d6caf77d2f233ba49bb20487979ced17, type: 3}
  - {fileID: 4218162687773463769, guid: 4f8d6275f27641a429a64fac95495716, type: 3}
  - {fileID: 2644324793857532392, guid: 66a508a16478b594ebd46cd39e85153c, type: 3}
  - {fileID: 1563623339652181394, guid: 6a9abb3ddb7a33741afb4f0e93bd15ba, type: 3}
  - {fileID: 6078791171608823637, guid: f330bd11a2f43d7418b480e58bc8be45, type: 3}
  - {fileID: 4901961112992612183, guid: b9e16acdc0f240d4cbd11285b5645978, type: 3}
  - {fileID: 7817388718113731216, guid: 4c930adc78375914eb2c96a7d9973de4, type: 3}
  - {fileID: 2327569042962393719, guid: 0a83fa8ecc26090468577ea564f2e335, type: 3}
  - {fileID: 615093079028083680, guid: e921627486eb9f845be51f0839c15f91, type: 3}
  - {fileID: 7277450910001344244, guid: b29ca1d261852ee45b966e42dac303f3, type: 3}
  - {fileID: 8439931237681419512, guid: bd7d41ad96d34474b80b46dc6c73e9ec, type: 3}
  - {fileID: 9183297950046924912, guid: a60226bd862e7f64e8381a0c4328cf47, type: 3}
  - {fileID: 1192077764378278703, guid: 6981f3b116a472d4e83013ecb855e4fd, type: 3}
  - {fileID: 3628080743285752434, guid: 6d2f2c5d87838b441b7448eb59278d70, type: 3}
  - {fileID: 5996985183965541376, guid: 186df7dad379b08478b2f9548f735177, type: 3}
  - {fileID: 8205160626042430821, guid: dee497fbd40799b4a95ad6cd7c66a8a0, type: 3}
  - {fileID: 5933092037205317136, guid: fa531cfea91ba6a419d99de3087a5681, type: 3}
  - {fileID: 1113446845017099131, guid: 363c9f4074439e744b37188394a87748, type: 3}
  - {fileID: 3570838275055280088, guid: 025b08cdefd8c8f4b841c38dd67a7bc4, type: 3}
  - {fileID: 3422600154384087881, guid: 60d44a33b576b024384c9cf7f3c79eba, type: 3}
  - {fileID: 437461934125212428, guid: 3e8997a0d4abe31498bb9fba78c49bcd, type: 3}
  - {fileID: 2052702023866204048, guid: 4288cebe2e774f442bfe1dc43bbf03a7, type: 3}
