%YAML 1.1
%TAG !u! tag:unity3d.com,2011:
--- !u!1 &2702687730398648332
GameObject:
  m_ObjectHideFlags: 0
  m_CorrespondingSourceObject: {fileID: 0}
  m_PrefabInstance: {fileID: 0}
  m_PrefabAsset: {fileID: 0}
  serializedVersion: 6
  m_Component:
  - component: {fileID: 2702687730398648331}
  m_Layer: 0
  m_Name: FullWallCandles
  m_TagString: Untagged
  m_Icon: {fileID: 0}
  m_NavMeshLayer: 0
  m_StaticEditorFlags: 0
  m_IsActive: 1
--- !u!4 &2702687730398648331
Transform:
  m_ObjectHideFlags: 0
  m_CorrespondingSourceObject: {fileID: 0}
  m_PrefabInstance: {fileID: 0}
  m_PrefabAsset: {fileID: 0}
  m_GameObject: {fileID: 2702687730398648332}
  m_LocalRotation: {x: -0, y: -0, z: -0, w: 1}
  m_LocalPosition: {x: 7.08, y: -2.646, z: 0}
  m_LocalScale: {x: 1, y: 1, z: 1}
  m_Children:
  - {fileID: 5339082224739768357}
  - {fileID: 7554315134347141649}
  m_Father: {fileID: 0}
  m_RootOrder: 0
  m_LocalEulerAnglesHint: {x: 0, y: 0, z: 0}
--- !u!1001 &2726234771340389587
PrefabInstance:
  m_ObjectHideFlags: 0
  serializedVersion: 2
  m_Modification:
    m_TransformParent: {fileID: 2702687730398648331}
    m_Modifications:
    - target: {fileID: 5549518324797378242, guid: 022c5067f04d04040913aca0edea2c87,
        type: 3}
      propertyPath: m_LocalPosition.x
      value: -5.143
      objectReference: {fileID: 0}
    - target: {fileID: 5549518324797378242, guid: 022c5067f04d04040913aca0edea2c87,
        type: 3}
      propertyPath: m_LocalPosition.y
      value: 1.785
      objectReference: {fileID: 0}
    - target: {fileID: 5549518324797378242, guid: 022c5067f04d04040913aca0edea2c87,
        type: 3}
      propertyPath: m_LocalPosition.z
      value: 0
      objectReference: {fileID: 0}
    - target: {fileID: 5549518324797378242, guid: 022c5067f04d04040913aca0edea2c87,
        type: 3}
      propertyPath: m_LocalRotation.x
      value: -0
      objectReference: {fileID: 0}
    - target: {fileID: 5549518324797378242, guid: 022c5067f04d04040913aca0edea2c87,
        type: 3}
      propertyPath: m_LocalRotation.y
      value: -0
      objectReference: {fileID: 0}
    - target: {fileID: 5549518324797378242, guid: 022c5067f04d04040913aca0edea2c87,
        type: 3}
      propertyPath: m_LocalRotation.z
      value: -0
      objectReference: {fileID: 0}
    - target: {fileID: 5549518324797378242, guid: 022c5067f04d04040913aca0edea2c87,
        type: 3}
      propertyPath: m_LocalRotation.w
      value: 1
      objectReference: {fileID: 0}
    - target: {fileID: 5549518324797378242, guid: 022c5067f04d04040913aca0edea2c87,
        type: 3}
      propertyPath: m_RootOrder
      value: 1
      objectReference: {fileID: 0}
    - target: {fileID: 5549518324797378242, guid: 022c5067f04d04040913aca0edea2c87,
        type: 3}
      propertyPath: m_LocalEulerAnglesHint.x
      value: 0
      objectReference: {fileID: 0}
    - target: {fileID: 5549518324797378242, guid: 022c5067f04d04040913aca0edea2c87,
        type: 3}
      propertyPath: m_LocalEulerAnglesHint.y
      value: 0
      objectReference: {fileID: 0}
    - target: {fileID: 5549518324797378242, guid: 022c5067f04d04040913aca0edea2c87,
        type: 3}
      propertyPath: m_LocalEulerAnglesHint.z
      value: 0
      objectReference: {fileID: 0}
    - target: {fileID: 5555140069054332218, guid: 022c5067f04d04040913aca0edea2c87,
        type: 3}
      propertyPath: m_Name
      value: WallCandles
      objectReference: {fileID: 0}
    m_RemovedComponents: []
  m_SourcePrefab: {fileID: 100100000, guid: 022c5067f04d04040913aca0edea2c87, type: 3}
--- !u!4 &7554315134347141649 stripped
Transform:
  m_CorrespondingSourceObject: {fileID: 5549518324797378242, guid: 022c5067f04d04040913aca0edea2c87,
    type: 3}
  m_PrefabInstance: {fileID: 2726234771340389587}
  m_PrefabAsset: {fileID: 0}
--- !u!1001 &7012207968147697163
PrefabInstance:
  m_ObjectHideFlags: 0
  serializedVersion: 2
  m_Modification:
    m_TransformParent: {fileID: 2702687730398648331}
    m_Modifications:
    - target: {fileID: 3118855992736757294, guid: c033ca3e63016d948899a46ead57b2fe,
        type: 3}
      propertyPath: m_LocalPosition.x
      value: -5.139
      objectReference: {fileID: 0}
    - target: {fileID: 3118855992736757294, guid: c033ca3e63016d948899a46ead57b2fe,
        type: 3}
      propertyPath: m_LocalPosition.y
      value: 1.5899001
      objectReference: {fileID: 0}
    - target: {fileID: 3118855992736757294, guid: c033ca3e63016d948899a46ead57b2fe,
        type: 3}
      propertyPath: m_LocalPosition.z
      value: 0
      objectReference: {fileID: 0}
    - target: {fileID: 3118855992736757294, guid: c033ca3e63016d948899a46ead57b2fe,
        type: 3}
      propertyPath: m_LocalRotation.x
      value: -0
      objectReference: {fileID: 0}
    - target: {fileID: 3118855992736757294, guid: c033ca3e63016d948899a46ead57b2fe,
        type: 3}
      propertyPath: m_LocalRotation.y
      value: -0
      objectReference: {fileID: 0}
    - target: {fileID: 3118855992736757294, guid: c033ca3e63016d948899a46ead57b2fe,
        type: 3}
      propertyPath: m_LocalRotation.z
      value: -0
      objectReference: {fileID: 0}
    - target: {fileID: 3118855992736757294, guid: c033ca3e63016d948899a46ead57b2fe,
        type: 3}
      propertyPath: m_LocalRotation.w
      value: 1
      objectReference: {fileID: 0}
    - target: {fileID: 3118855992736757294, guid: c033ca3e63016d948899a46ead57b2fe,
        type: 3}
      propertyPath: m_RootOrder
      value: 0
      objectReference: {fileID: 0}
    - target: {fileID: 3118855992736757294, guid: c033ca3e63016d948899a46ead57b2fe,
        type: 3}
      propertyPath: m_LocalEulerAnglesHint.x
      value: 0
      objectReference: {fileID: 0}
    - target: {fileID: 3118855992736757294, guid: c033ca3e63016d948899a46ead57b2fe,
        type: 3}
      propertyPath: m_LocalEulerAnglesHint.y
      value: 0
      objectReference: {fileID: 0}
    - target: {fileID: 3118855992736757294, guid: c033ca3e63016d948899a46ead57b2fe,
        type: 3}
      propertyPath: m_LocalEulerAnglesHint.z
      value: 0
      objectReference: {fileID: 0}
    - target: {fileID: 3124460512585219274, guid: c033ca3e63016d948899a46ead57b2fe,
        type: 3}
      propertyPath: m_Name
      value: WallMount
      objectReference: {fileID: 0}
    m_RemovedComponents: []
  m_SourcePrefab: {fileID: 100100000, guid: c033ca3e63016d948899a46ead57b2fe, type: 3}
--- !u!4 &5339082224739768357 stripped
Transform:
  m_CorrespondingSourceObject: {fileID: 3118855992736757294, guid: c033ca3e63016d948899a46ead57b2fe,
    type: 3}
  m_PrefabInstance: {fileID: 7012207968147697163}
  m_PrefabAsset: {fileID: 0}
