%YAML 1.1
%TAG !u! tag:unity3d.com,2011:
--- !u!29 &1
OcclusionCullingSettings:
  m_ObjectHideFlags: 0
  serializedVersion: 2
  m_OcclusionBakeSettings:
    smallestOccluder: 5
    smallestHole: 0.25
    backfaceThreshold: 100
  m_SceneGUID: 00000000000000000000000000000000
  m_OcclusionCullingData: {fileID: 0}
--- !u!104 &2
RenderSettings:
  m_ObjectHideFlags: 0
  serializedVersion: 9
  m_Fog: 0
  m_FogColor: {r: 0.5, g: 0.5, b: 0.5, a: 1}
  m_FogMode: 3
  m_FogDensity: 0.01
  m_LinearFogStart: 0
  m_LinearFogEnd: 300
  m_AmbientSkyColor: {r: 0.212, g: 0.227, b: 0.259, a: 1}
  m_AmbientEquatorColor: {r: 0.114, g: 0.125, b: 0.133, a: 1}
  m_AmbientGroundColor: {r: 0.047, g: 0.043, b: 0.035, a: 1}
  m_AmbientIntensity: 1
  m_AmbientMode: 3
  m_SubtractiveShadowColor: {r: 0.42, g: 0.478, b: 0.627, a: 1}
  m_SkyboxMaterial: {fileID: 0}
  m_HaloStrength: 0.5
  m_FlareStrength: 1
  m_FlareFadeSpeed: 3
  m_HaloTexture: {fileID: 0}
  m_SpotCookie: {fileID: 10001, guid: 0000000000000000e000000000000000, type: 0}
  m_DefaultReflectionMode: 0
  m_DefaultReflectionResolution: 128
  m_ReflectionBounces: 1
  m_ReflectionIntensity: 1
  m_CustomReflection: {fileID: 0}
  m_Sun: {fileID: 0}
  m_IndirectSpecularColor: {r: 0, g: 0, b: 0, a: 1}
  m_UseRadianceAmbientProbe: 0
--- !u!157 &3
LightmapSettings:
  m_ObjectHideFlags: 0
  serializedVersion: 12
  m_GIWorkflowMode: 1
  m_GISettings:
    serializedVersion: 2
    m_BounceScale: 1
    m_IndirectOutputScale: 1
    m_AlbedoBoost: 1
    m_EnvironmentLightingMode: 0
    m_EnableBakedLightmaps: 0
    m_EnableRealtimeLightmaps: 0
  m_LightmapEditorSettings:
    serializedVersion: 12
    m_Resolution: 2
    m_BakeResolution: 40
    m_AtlasSize: 1024
    m_AO: 0
    m_AOMaxDistance: 1
    m_CompAOExponent: 1
    m_CompAOExponentDirect: 0
    m_ExtractAmbientOcclusion: 0
    m_Padding: 2
    m_LightmapParameters: {fileID: 0}
    m_LightmapsBakeMode: 1
    m_TextureCompression: 1
    m_FinalGather: 0
    m_FinalGatherFiltering: 1
    m_FinalGatherRayCount: 256
    m_ReflectionCompression: 2
    m_MixedBakeMode: 2
    m_BakeBackend: 1
    m_PVRSampling: 1
    m_PVRDirectSampleCount: 32
    m_PVRSampleCount: 512
    m_PVRBounces: 2
    m_PVREnvironmentSampleCount: 256
    m_PVREnvironmentReferencePointCount: 2048
    m_PVRFilteringMode: 1
    m_PVRDenoiserTypeDirect: 1
    m_PVRDenoiserTypeIndirect: 1
    m_PVRDenoiserTypeAO: 1
    m_PVRFilterTypeDirect: 0
    m_PVRFilterTypeIndirect: 0
    m_PVRFilterTypeAO: 0
    m_PVREnvironmentMIS: 1
    m_PVRCulling: 1
    m_PVRFilteringGaussRadiusDirect: 1
    m_PVRFilteringGaussRadiusIndirect: 5
    m_PVRFilteringGaussRadiusAO: 2
    m_PVRFilteringAtrousPositionSigmaDirect: 0.5
    m_PVRFilteringAtrousPositionSigmaIndirect: 2
    m_PVRFilteringAtrousPositionSigmaAO: 1
    m_ExportTrainingData: 0
    m_TrainingDataDestination: TrainingData
    m_LightProbeSampleCountMultiplier: 4
  m_LightingDataAsset: {fileID: 0}
  m_LightingSettings: {fileID: 0}
--- !u!196 &4
NavMeshSettings:
  serializedVersion: 2
  m_ObjectHideFlags: 0
  m_BuildSettings:
    serializedVersion: 2
    agentTypeID: 0
    agentRadius: 0.5
    agentHeight: 2
    agentSlope: 45
    agentClimb: 0.4
    ledgeDropHeight: 0
    maxJumpAcrossDistance: 0
    minRegionArea: 2
    manualCellSize: 0
    cellSize: 0.16666667
    manualTileSize: 0
    tileSize: 256
    accuratePlacement: 0
    maxJobWorkers: 0
    preserveTilesOutsideBounds: 0
    debug:
      m_Flags: 0
  m_NavMeshData: {fileID: 0}
--- !u!1 &239264461
GameObject:
  m_ObjectHideFlags: 0
  m_CorrespondingSourceObject: {fileID: 0}
  m_PrefabInstance: {fileID: 0}
  m_PrefabAsset: {fileID: 0}
  serializedVersion: 6
  m_Component:
  - component: {fileID: 239264462}
  m_Layer: 0
  m_Name: ButtonsBundle
  m_TagString: Untagged
  m_Icon: {fileID: 0}
  m_NavMeshLayer: 0
  m_StaticEditorFlags: 0
  m_IsActive: 1
--- !u!4 &239264462
Transform:
  m_ObjectHideFlags: 0
  m_CorrespondingSourceObject: {fileID: 0}
  m_PrefabInstance: {fileID: 0}
  m_PrefabAsset: {fileID: 0}
  m_GameObject: {fileID: 239264461}
  m_LocalRotation: {x: -0, y: -0, z: -0, w: 1}
  m_LocalPosition: {x: -667.42126, y: -613, z: -96.83791}
  m_LocalScale: {x: 2.3674476, y: 2.3674476, z: 2.3674476}
  m_Children:
  - {fileID: 653483946}
  - {fileID: 2023158892}
  - {fileID: 853540739}
  - {fileID: 997761341}
  m_Father: {fileID: 1831466227}
  m_RootOrder: 2
  m_LocalEulerAnglesHint: {x: 0, y: 0, z: 0}
--- !u!1 &387326331
GameObject:
  m_ObjectHideFlags: 0
  m_CorrespondingSourceObject: {fileID: 0}
  m_PrefabInstance: {fileID: 0}
  m_PrefabAsset: {fileID: 0}
  serializedVersion: 6
  m_Component:
  - component: {fileID: 387326332}
  - component: {fileID: 387326334}
  - component: {fileID: 387326333}
  m_Layer: 5
  m_Name: TitlePause
  m_TagString: Untagged
  m_Icon: {fileID: 0}
  m_NavMeshLayer: 0
  m_StaticEditorFlags: 0
  m_IsActive: 1
--- !u!224 &387326332
RectTransform:
  m_ObjectHideFlags: 0
  m_CorrespondingSourceObject: {fileID: 0}
  m_PrefabInstance: {fileID: 0}
  m_PrefabAsset: {fileID: 0}
  m_GameObject: {fileID: 387326331}
  m_LocalRotation: {x: 0, y: 0, z: 0, w: 1}
  m_LocalPosition: {x: 0, y: 0, z: 0}
  m_LocalScale: {x: 1, y: 1, z: 1}
  m_Children: []
  m_Father: {fileID: 1831466227}
  m_RootOrder: 1
  m_LocalEulerAnglesHint: {x: 0, y: 0, z: 0}
  m_AnchorMin: {x: 0.5, y: 1}
  m_AnchorMax: {x: 0.5, y: 1}
  m_AnchoredPosition: {x: 0, y: -107}
  m_SizeDelta: {x: 635.9446, y: 189.02948}
  m_Pivot: {x: 0.5, y: 1}
--- !u!114 &387326333
MonoBehaviour:
  m_ObjectHideFlags: 0
  m_CorrespondingSourceObject: {fileID: 0}
  m_PrefabInstance: {fileID: 0}
  m_PrefabAsset: {fileID: 0}
  m_GameObject: {fileID: 387326331}
  m_Enabled: 1
  m_EditorHideFlags: 0
  m_Script: {fileID: 11500000, guid: f4688fdb7df04437aeb418b961361dc5, type: 3}
  m_Name: 
  m_EditorClassIdentifier: 
  m_Material: {fileID: 0}
  m_Color: {r: 1, g: 1, b: 1, a: 1}
  m_RaycastTarget: 1
  m_RaycastPadding: {x: 0, y: 0, z: 0, w: 0}
  m_Maskable: 1
  m_OnCullStateChanged:
    m_PersistentCalls:
      m_Calls: []
  m_text: Pause
  m_isRightToLeft: 0
  m_fontAsset: {fileID: 11400000, guid: e98afea5eb6cce34d8363d81a384fb9a, type: 2}
  m_sharedMaterial: {fileID: -220214642910921886, guid: e98afea5eb6cce34d8363d81a384fb9a,
    type: 2}
  m_fontSharedMaterials: []
  m_fontMaterial: {fileID: 0}
  m_fontMaterials: []
  m_fontColor32:
    serializedVersion: 2
    rgba: 4294967295
  m_fontColor: {r: 1, g: 1, b: 1, a: 1}
  m_enableVertexGradient: 0
  m_colorMode: 3
  m_fontColorGradient:
    topLeft: {r: 1, g: 1, b: 1, a: 1}
    topRight: {r: 1, g: 1, b: 1, a: 1}
    bottomLeft: {r: 1, g: 1, b: 1, a: 1}
    bottomRight: {r: 1, g: 1, b: 1, a: 1}
  m_fontColorGradientPreset: {fileID: 0}
  m_spriteAsset: {fileID: 0}
  m_tintAllSprites: 0
  m_StyleSheet: {fileID: 0}
  m_TextStyleHashCode: -1183493901
  m_overrideHtmlColors: 0
  m_faceColor:
    serializedVersion: 2
    rgba: 4294967295
  m_fontSize: 250
  m_fontSizeBase: 250
  m_fontWeight: 400
  m_enableAutoSizing: 0
  m_fontSizeMin: 18
  m_fontSizeMax: 72
  m_fontStyle: 0
  m_HorizontalAlignment: 2
  m_VerticalAlignment: 512
  m_textAlignment: 65535
  m_characterSpacing: 0
  m_wordSpacing: 0
  m_lineSpacing: 0
  m_lineSpacingMax: 0
  m_paragraphSpacing: 0
  m_charWidthMaxAdj: 0
  m_enableWordWrapping: 1
  m_wordWrappingRatios: 0.4
  m_overflowMode: 0
  m_linkedTextComponent: {fileID: 0}
  parentLinkedComponent: {fileID: 0}
  m_enableKerning: 1
  m_enableExtraPadding: 0
  checkPaddingRequired: 0
  m_isRichText: 1
  m_parseCtrlCharacters: 1
  m_isOrthographic: 1
  m_isCullingEnabled: 0
  m_horizontalMapping: 0
  m_verticalMapping: 0
  m_uvLineOffset: 0
  m_geometrySortingOrder: 0
  m_IsTextObjectScaleStatic: 0
  m_VertexBufferAutoSizeReduction: 1
  m_useMaxVisibleDescender: 1
  m_pageToDisplay: 1
  m_margin: {x: 0, y: 0, z: 0, w: 0}
  m_isUsingLegacyAnimationComponent: 0
  m_isVolumetricText: 0
  m_hasFontAssetChanged: 0
  m_baseMaterial: {fileID: 0}
  m_maskOffset: {x: 0, y: 0, z: 0, w: 0}
--- !u!222 &387326334
CanvasRenderer:
  m_ObjectHideFlags: 0
  m_CorrespondingSourceObject: {fileID: 0}
  m_PrefabInstance: {fileID: 0}
  m_PrefabAsset: {fileID: 0}
  m_GameObject: {fileID: 387326331}
  m_CullTransparentMesh: 0
--- !u!1001 &653483945
PrefabInstance:
  m_ObjectHideFlags: 0
  serializedVersion: 2
  m_Modification:
    m_TransformParent: {fileID: 239264462}
    m_Modifications:
    - target: {fileID: 5011845986032529196, guid: c87c6cef9345eea478c557a3653e0543,
        type: 3}
      propertyPath: m_OnClick.m_PersistentCalls.m_Calls.Array.size
      value: 1
      objectReference: {fileID: 0}
    - target: {fileID: 5011845986032529196, guid: c87c6cef9345eea478c557a3653e0543,
        type: 3}
      propertyPath: m_OnClick.m_PersistentCalls.m_Calls.Array.data[0].m_Target
      value: 
      objectReference: {fileID: 2481690412663161376, guid: 3644782b8dcf82a478806e9933b9c835,
        type: 3}
    - target: {fileID: 5011845986032529196, guid: c87c6cef9345eea478c557a3653e0543,
        type: 3}
      propertyPath: m_OnClick.m_PersistentCalls.m_Calls.Array.data[0].m_MethodName
      value: 
      objectReference: {fileID: 0}
    - target: {fileID: 5011845986032529196, guid: c87c6cef9345eea478c557a3653e0543,
        type: 3}
      propertyPath: m_OnClick.m_PersistentCalls.m_Calls.Array.data[0].m_Mode
      value: 2
      objectReference: {fileID: 0}
    - target: {fileID: 5011845986032529196, guid: c87c6cef9345eea478c557a3653e0543,
        type: 3}
      propertyPath: m_OnClick.m_PersistentCalls.m_Calls.Array.data[0].m_CallState
      value: 2
      objectReference: {fileID: 0}
    - target: {fileID: 5011845986032529196, guid: c87c6cef9345eea478c557a3653e0543,
        type: 3}
      propertyPath: m_OnClick.m_PersistentCalls.m_Calls.Array.data[0].m_TargetAssemblyTypeName
      value: UnityEngine.AudioSource, UnityEngine
      objectReference: {fileID: 0}
    - target: {fileID: 5011845986032529196, guid: c87c6cef9345eea478c557a3653e0543,
        type: 3}
      propertyPath: m_OnClick.m_PersistentCalls.m_Calls.Array.data[0].m_Arguments.m_ObjectArgumentAssemblyTypeName
      value: UnityEngine.AudioClip, UnityEngine
      objectReference: {fileID: 0}
    - target: {fileID: 5011845986032529196, guid: c87c6cef9345eea478c557a3653e0543,
        type: 3}
      propertyPath: m_OnClick.m_PersistentCalls.m_Calls.Array.data[0].m_Arguments.m_ObjectArgument
      value: 
      objectReference: {fileID: 8300000, guid: ceb03768a12f76f42927b33a07215494, type: 3}
    - target: {fileID: 5011845986032529198, guid: c87c6cef9345eea478c557a3653e0543,
        type: 3}
      propertyPath: m_Name
      value: PauseResume
      objectReference: {fileID: 0}
    - target: {fileID: 5011845986032529199, guid: c87c6cef9345eea478c557a3653e0543,
        type: 3}
      propertyPath: m_LocalPosition.x
      value: 0
      objectReference: {fileID: 0}
    - target: {fileID: 5011845986032529199, guid: c87c6cef9345eea478c557a3653e0543,
        type: 3}
      propertyPath: m_LocalPosition.y
      value: 0
      objectReference: {fileID: 0}
    - target: {fileID: 5011845986032529199, guid: c87c6cef9345eea478c557a3653e0543,
        type: 3}
      propertyPath: m_LocalPosition.z
      value: 0
      objectReference: {fileID: 0}
    - target: {fileID: 5011845986032529199, guid: c87c6cef9345eea478c557a3653e0543,
        type: 3}
      propertyPath: m_LocalRotation.x
      value: -0
      objectReference: {fileID: 0}
    - target: {fileID: 5011845986032529199, guid: c87c6cef9345eea478c557a3653e0543,
        type: 3}
      propertyPath: m_LocalRotation.y
      value: -0
      objectReference: {fileID: 0}
    - target: {fileID: 5011845986032529199, guid: c87c6cef9345eea478c557a3653e0543,
        type: 3}
      propertyPath: m_LocalRotation.z
      value: -0
      objectReference: {fileID: 0}
    - target: {fileID: 5011845986032529199, guid: c87c6cef9345eea478c557a3653e0543,
        type: 3}
      propertyPath: m_LocalRotation.w
      value: 1
      objectReference: {fileID: 0}
    - target: {fileID: 5011845986032529199, guid: c87c6cef9345eea478c557a3653e0543,
        type: 3}
      propertyPath: m_RootOrder
      value: 0
      objectReference: {fileID: 0}
    - target: {fileID: 5011845986032529199, guid: c87c6cef9345eea478c557a3653e0543,
        type: 3}
      propertyPath: m_LocalEulerAnglesHint.x
      value: 0
      objectReference: {fileID: 0}
    - target: {fileID: 5011845986032529199, guid: c87c6cef9345eea478c557a3653e0543,
        type: 3}
      propertyPath: m_LocalEulerAnglesHint.y
      value: 0
      objectReference: {fileID: 0}
    - target: {fileID: 5011845986032529199, guid: c87c6cef9345eea478c557a3653e0543,
        type: 3}
      propertyPath: m_LocalEulerAnglesHint.z
      value: 0
      objectReference: {fileID: 0}
    - target: {fileID: 5011845986032529199, guid: c87c6cef9345eea478c557a3653e0543,
        type: 3}
      propertyPath: m_AnchoredPosition.x
      value: 282
      objectReference: {fileID: 0}
    - target: {fileID: 5011845986032529199, guid: c87c6cef9345eea478c557a3653e0543,
        type: 3}
      propertyPath: m_AnchoredPosition.y
      value: 309
      objectReference: {fileID: 0}
    - target: {fileID: 5011845986032529199, guid: c87c6cef9345eea478c557a3653e0543,
        type: 3}
      propertyPath: m_SizeDelta.x
      value: 274.80313
      objectReference: {fileID: 0}
    - target: {fileID: 5011845986032529199, guid: c87c6cef9345eea478c557a3653e0543,
        type: 3}
      propertyPath: m_SizeDelta.y
      value: 91.18515
      objectReference: {fileID: 0}
    - target: {fileID: 5011845986032529199, guid: c87c6cef9345eea478c557a3653e0543,
        type: 3}
      propertyPath: m_AnchorMin.x
      value: 0.5
      objectReference: {fileID: 0}
    - target: {fileID: 5011845986032529199, guid: c87c6cef9345eea478c557a3653e0543,
        type: 3}
      propertyPath: m_AnchorMin.y
      value: 0.5
      objectReference: {fileID: 0}
    - target: {fileID: 5011845986032529199, guid: c87c6cef9345eea478c557a3653e0543,
        type: 3}
      propertyPath: m_AnchorMax.x
      value: 0.5
      objectReference: {fileID: 0}
    - target: {fileID: 5011845986032529199, guid: c87c6cef9345eea478c557a3653e0543,
        type: 3}
      propertyPath: m_AnchorMax.y
      value: 0.5
      objectReference: {fileID: 0}
    - target: {fileID: 5011845986032529199, guid: c87c6cef9345eea478c557a3653e0543,
        type: 3}
      propertyPath: m_Pivot.x
      value: 0.5
      objectReference: {fileID: 0}
    - target: {fileID: 5011845986032529199, guid: c87c6cef9345eea478c557a3653e0543,
        type: 3}
      propertyPath: m_Pivot.y
      value: 0.5
      objectReference: {fileID: 0}
    - target: {fileID: 5011845986032529199, guid: c87c6cef9345eea478c557a3653e0543,
        type: 3}
      propertyPath: m_LocalScale.x
      value: 0.42239583
      objectReference: {fileID: 0}
    - target: {fileID: 5011845986032529199, guid: c87c6cef9345eea478c557a3653e0543,
        type: 3}
      propertyPath: m_LocalScale.y
      value: 0.42239583
      objectReference: {fileID: 0}
    - target: {fileID: 5011845986032529199, guid: c87c6cef9345eea478c557a3653e0543,
        type: 3}
      propertyPath: m_LocalScale.z
      value: 0.42239583
      objectReference: {fileID: 0}
    - target: {fileID: 5011845986358185348, guid: c87c6cef9345eea478c557a3653e0543,
        type: 3}
      propertyPath: m_text
      value: Resume
      objectReference: {fileID: 0}
    - target: {fileID: 5011845986358185348, guid: c87c6cef9345eea478c557a3653e0543,
        type: 3}
      propertyPath: m_fontSize
      value: 90
      objectReference: {fileID: 0}
    - target: {fileID: 5011845986358185348, guid: c87c6cef9345eea478c557a3653e0543,
        type: 3}
      propertyPath: m_fontSizeBase
      value: 90
      objectReference: {fileID: 0}
    - target: {fileID: 5011845986358185348, guid: c87c6cef9345eea478c557a3653e0543,
        type: 3}
      propertyPath: m_margin.z
      value: -1.7380962
      objectReference: {fileID: 0}
    - target: {fileID: 5011845986358185348, guid: c87c6cef9345eea478c557a3653e0543,
        type: 3}
      propertyPath: m_enableAutoSizing
      value: 0
      objectReference: {fileID: 0}
    - target: {fileID: 5011845986358185351, guid: c87c6cef9345eea478c557a3653e0543,
        type: 3}
      propertyPath: m_AnchoredPosition.x
      value: 0
      objectReference: {fileID: 0}
    - target: {fileID: 5011845986358185351, guid: c87c6cef9345eea478c557a3653e0543,
        type: 3}
      propertyPath: m_SizeDelta.x
      value: 0
      objectReference: {fileID: 0}
    - target: {fileID: 5011845986358185351, guid: c87c6cef9345eea478c557a3653e0543,
        type: 3}
      propertyPath: m_AnchoredPosition.y
      value: 0
      objectReference: {fileID: 0}
    - target: {fileID: 5011845986358185351, guid: c87c6cef9345eea478c557a3653e0543,
        type: 3}
      propertyPath: m_AnchorMin.x
      value: 0
      objectReference: {fileID: 0}
    - target: {fileID: 5011845986358185351, guid: c87c6cef9345eea478c557a3653e0543,
        type: 3}
      propertyPath: m_AnchorMin.y
      value: 0
      objectReference: {fileID: 0}
    - target: {fileID: 5011845986358185351, guid: c87c6cef9345eea478c557a3653e0543,
        type: 3}
      propertyPath: m_AnchorMax.x
      value: 1
      objectReference: {fileID: 0}
    - target: {fileID: 5011845986358185351, guid: c87c6cef9345eea478c557a3653e0543,
        type: 3}
      propertyPath: m_SizeDelta.y
      value: 0
      objectReference: {fileID: 0}
    - target: {fileID: 5011845986358185351, guid: c87c6cef9345eea478c557a3653e0543,
        type: 3}
      propertyPath: m_Pivot.y
      value: 0.5
      objectReference: {fileID: 0}
    - target: {fileID: 5011845986358185351, guid: c87c6cef9345eea478c557a3653e0543,
        type: 3}
      propertyPath: m_AnchorMax.y
      value: 1
      objectReference: {fileID: 0}
    m_RemovedComponents:
    - {fileID: 5387647807116745601, guid: c87c6cef9345eea478c557a3653e0543, type: 3}
  m_SourcePrefab: {fileID: 100100000, guid: c87c6cef9345eea478c557a3653e0543, type: 3}
--- !u!224 &653483946 stripped
RectTransform:
  m_CorrespondingSourceObject: {fileID: 5011845986032529199, guid: c87c6cef9345eea478c557a3653e0543,
    type: 3}
  m_PrefabInstance: {fileID: 653483945}
  m_PrefabAsset: {fileID: 0}
--- !u!1001 &853540738
PrefabInstance:
  m_ObjectHideFlags: 0
  serializedVersion: 2
  m_Modification:
    m_TransformParent: {fileID: 239264462}
    m_Modifications:
    - target: {fileID: 5011845986032529196, guid: c87c6cef9345eea478c557a3653e0543,
        type: 3}
      propertyPath: m_OnClick.m_PersistentCalls.m_Calls.Array.size
      value: 1
      objectReference: {fileID: 0}
    - target: {fileID: 5011845986032529196, guid: c87c6cef9345eea478c557a3653e0543,
        type: 3}
      propertyPath: m_OnClick.m_PersistentCalls.m_Calls.Array.data[0].m_Target
      value: 
      objectReference: {fileID: 2481690412663161376, guid: 3644782b8dcf82a478806e9933b9c835,
        type: 3}
    - target: {fileID: 5011845986032529196, guid: c87c6cef9345eea478c557a3653e0543,
        type: 3}
      propertyPath: m_OnClick.m_PersistentCalls.m_Calls.Array.data[0].m_MethodName
      value: 
      objectReference: {fileID: 0}
    - target: {fileID: 5011845986032529196, guid: c87c6cef9345eea478c557a3653e0543,
        type: 3}
      propertyPath: m_OnClick.m_PersistentCalls.m_Calls.Array.data[0].m_Mode
      value: 2
      objectReference: {fileID: 0}
    - target: {fileID: 5011845986032529196, guid: c87c6cef9345eea478c557a3653e0543,
        type: 3}
      propertyPath: m_OnClick.m_PersistentCalls.m_Calls.Array.data[0].m_CallState
      value: 2
      objectReference: {fileID: 0}
    - target: {fileID: 5011845986032529196, guid: c87c6cef9345eea478c557a3653e0543,
        type: 3}
      propertyPath: m_OnClick.m_PersistentCalls.m_Calls.Array.data[0].m_TargetAssemblyTypeName
      value: UnityEngine.AudioSource, UnityEngine
      objectReference: {fileID: 0}
    - target: {fileID: 5011845986032529196, guid: c87c6cef9345eea478c557a3653e0543,
        type: 3}
      propertyPath: m_OnClick.m_PersistentCalls.m_Calls.Array.data[0].m_Arguments.m_ObjectArgumentAssemblyTypeName
      value: UnityEngine.AudioClip, UnityEngine
      objectReference: {fileID: 0}
    - target: {fileID: 5011845986032529196, guid: c87c6cef9345eea478c557a3653e0543,
        type: 3}
      propertyPath: m_OnClick.m_PersistentCalls.m_Calls.Array.data[0].m_Arguments.m_ObjectArgument
      value: 
      objectReference: {fileID: 8300000, guid: ceb03768a12f76f42927b33a07215494, type: 3}
    - target: {fileID: 5011845986032529198, guid: c87c6cef9345eea478c557a3653e0543,
        type: 3}
      propertyPath: m_Name
      value: PauseOptions
      objectReference: {fileID: 0}
    - target: {fileID: 5011845986032529199, guid: c87c6cef9345eea478c557a3653e0543,
        type: 3}
      propertyPath: m_LocalPosition.x
      value: 0
      objectReference: {fileID: 0}
    - target: {fileID: 5011845986032529199, guid: c87c6cef9345eea478c557a3653e0543,
        type: 3}
      propertyPath: m_LocalPosition.y
      value: 0
      objectReference: {fileID: 0}
    - target: {fileID: 5011845986032529199, guid: c87c6cef9345eea478c557a3653e0543,
        type: 3}
      propertyPath: m_LocalPosition.z
      value: 0
      objectReference: {fileID: 0}
    - target: {fileID: 5011845986032529199, guid: c87c6cef9345eea478c557a3653e0543,
        type: 3}
      propertyPath: m_LocalRotation.x
      value: -0
      objectReference: {fileID: 0}
    - target: {fileID: 5011845986032529199, guid: c87c6cef9345eea478c557a3653e0543,
        type: 3}
      propertyPath: m_LocalRotation.y
      value: -0
      objectReference: {fileID: 0}
    - target: {fileID: 5011845986032529199, guid: c87c6cef9345eea478c557a3653e0543,
        type: 3}
      propertyPath: m_LocalRotation.z
      value: -0
      objectReference: {fileID: 0}
    - target: {fileID: 5011845986032529199, guid: c87c6cef9345eea478c557a3653e0543,
        type: 3}
      propertyPath: m_LocalRotation.w
      value: 1
      objectReference: {fileID: 0}
    - target: {fileID: 5011845986032529199, guid: c87c6cef9345eea478c557a3653e0543,
        type: 3}
      propertyPath: m_RootOrder
      value: 2
      objectReference: {fileID: 0}
    - target: {fileID: 5011845986032529199, guid: c87c6cef9345eea478c557a3653e0543,
        type: 3}
      propertyPath: m_LocalEulerAnglesHint.x
      value: 0
      objectReference: {fileID: 0}
    - target: {fileID: 5011845986032529199, guid: c87c6cef9345eea478c557a3653e0543,
        type: 3}
      propertyPath: m_LocalEulerAnglesHint.y
      value: 0
      objectReference: {fileID: 0}
    - target: {fileID: 5011845986032529199, guid: c87c6cef9345eea478c557a3653e0543,
        type: 3}
      propertyPath: m_LocalEulerAnglesHint.z
      value: 0
      objectReference: {fileID: 0}
    - target: {fileID: 5011845986032529199, guid: c87c6cef9345eea478c557a3653e0543,
        type: 3}
      propertyPath: m_AnchoredPosition.x
      value: 283
      objectReference: {fileID: 0}
    - target: {fileID: 5011845986032529199, guid: c87c6cef9345eea478c557a3653e0543,
        type: 3}
      propertyPath: m_AnchoredPosition.y
      value: 221
      objectReference: {fileID: 0}
    - target: {fileID: 5011845986032529199, guid: c87c6cef9345eea478c557a3653e0543,
        type: 3}
      propertyPath: m_SizeDelta.x
      value: 266.92828
      objectReference: {fileID: 0}
    - target: {fileID: 5011845986032529199, guid: c87c6cef9345eea478c557a3653e0543,
        type: 3}
      propertyPath: m_SizeDelta.y
      value: 89.56056
      objectReference: {fileID: 0}
    - target: {fileID: 5011845986032529199, guid: c87c6cef9345eea478c557a3653e0543,
        type: 3}
      propertyPath: m_AnchorMin.x
      value: 0.5
      objectReference: {fileID: 0}
    - target: {fileID: 5011845986032529199, guid: c87c6cef9345eea478c557a3653e0543,
        type: 3}
      propertyPath: m_AnchorMin.y
      value: 0.5
      objectReference: {fileID: 0}
    - target: {fileID: 5011845986032529199, guid: c87c6cef9345eea478c557a3653e0543,
        type: 3}
      propertyPath: m_AnchorMax.x
      value: 0.5
      objectReference: {fileID: 0}
    - target: {fileID: 5011845986032529199, guid: c87c6cef9345eea478c557a3653e0543,
        type: 3}
      propertyPath: m_AnchorMax.y
      value: 0.5
      objectReference: {fileID: 0}
    - target: {fileID: 5011845986032529199, guid: c87c6cef9345eea478c557a3653e0543,
        type: 3}
      propertyPath: m_Pivot.x
      value: 0.5
      objectReference: {fileID: 0}
    - target: {fileID: 5011845986032529199, guid: c87c6cef9345eea478c557a3653e0543,
        type: 3}
      propertyPath: m_Pivot.y
      value: 0.5
      objectReference: {fileID: 0}
    - target: {fileID: 5011845986032529199, guid: c87c6cef9345eea478c557a3653e0543,
        type: 3}
      propertyPath: m_LocalScale.x
      value: 0.42239583
      objectReference: {fileID: 0}
    - target: {fileID: 5011845986032529199, guid: c87c6cef9345eea478c557a3653e0543,
        type: 3}
      propertyPath: m_LocalScale.y
      value: 0.42239583
      objectReference: {fileID: 0}
    - target: {fileID: 5011845986032529199, guid: c87c6cef9345eea478c557a3653e0543,
        type: 3}
      propertyPath: m_LocalScale.z
      value: 0.42239583
      objectReference: {fileID: 0}
    - target: {fileID: 5011845986358185348, guid: c87c6cef9345eea478c557a3653e0543,
        type: 3}
      propertyPath: m_fontSize
      value: 90
      objectReference: {fileID: 0}
    - target: {fileID: 5011845986358185348, guid: c87c6cef9345eea478c557a3653e0543,
        type: 3}
      propertyPath: m_fontSizeBase
      value: 90
      objectReference: {fileID: 0}
    - target: {fileID: 5011845986358185348, guid: c87c6cef9345eea478c557a3653e0543,
        type: 3}
      propertyPath: m_text
      value: Options
      objectReference: {fileID: 0}
    - target: {fileID: 5011845986358185348, guid: c87c6cef9345eea478c557a3653e0543,
        type: 3}
      propertyPath: m_enableAutoSizing
      value: 0
      objectReference: {fileID: 0}
    m_RemovedComponents:
    - {fileID: 5387647807116745601, guid: c87c6cef9345eea478c557a3653e0543, type: 3}
  m_SourcePrefab: {fileID: 100100000, guid: c87c6cef9345eea478c557a3653e0543, type: 3}
--- !u!224 &853540739 stripped
RectTransform:
  m_CorrespondingSourceObject: {fileID: 5011845986032529199, guid: c87c6cef9345eea478c557a3653e0543,
    type: 3}
  m_PrefabInstance: {fileID: 853540738}
  m_PrefabAsset: {fileID: 0}
--- !u!1 &885276120
GameObject:
  m_ObjectHideFlags: 0
  m_CorrespondingSourceObject: {fileID: 0}
  m_PrefabInstance: {fileID: 0}
  m_PrefabAsset: {fileID: 0}
  serializedVersion: 6
  m_Component:
  - component: {fileID: 885276121}
  - component: {fileID: 885276123}
  - component: {fileID: 885276122}
  m_Layer: 5
  m_Name: Background
  m_TagString: Untagged
  m_Icon: {fileID: 0}
  m_NavMeshLayer: 0
  m_StaticEditorFlags: 0
  m_IsActive: 1
--- !u!224 &885276121
RectTransform:
  m_ObjectHideFlags: 0
  m_CorrespondingSourceObject: {fileID: 0}
  m_PrefabInstance: {fileID: 0}
  m_PrefabAsset: {fileID: 0}
  m_GameObject: {fileID: 885276120}
  m_LocalRotation: {x: 0, y: 0, z: 0, w: 1}
  m_LocalPosition: {x: 0, y: 0, z: 0}
  m_LocalScale: {x: 19.188, y: 10.935, z: 1}
  m_Children: []
  m_Father: {fileID: 1831466227}
  m_RootOrder: 0
  m_LocalEulerAnglesHint: {x: 0, y: 0, z: 0}
  m_AnchorMin: {x: 0.5, y: 0.5}
  m_AnchorMax: {x: 0.5, y: 0.5}
  m_AnchoredPosition: {x: 0, y: 0}
  m_SizeDelta: {x: 100, y: 100}
  m_Pivot: {x: 0.5, y: 0.5}
--- !u!114 &885276122
MonoBehaviour:
  m_ObjectHideFlags: 0
  m_CorrespondingSourceObject: {fileID: 0}
  m_PrefabInstance: {fileID: 0}
  m_PrefabAsset: {fileID: 0}
  m_GameObject: {fileID: 885276120}
  m_Enabled: 1
  m_EditorHideFlags: 0
  m_Script: {fileID: 11500000, guid: fe87c0e1cc204ed48ad3b37840f39efc, type: 3}
  m_Name: 
  m_EditorClassIdentifier: 
  m_Material: {fileID: 0}
  m_Color: {r: 1, g: 1, b: 1, a: 1}
  m_RaycastTarget: 1
  m_RaycastPadding: {x: 0, y: 0, z: 0, w: 0}
  m_Maskable: 1
  m_OnCullStateChanged:
    m_PersistentCalls:
      m_Calls: []
  m_Sprite: {fileID: 21300000, guid: 45e55b3e7d7cb5947941ddfd915736ee, type: 3}
  m_Type: 0
  m_PreserveAspect: 0
  m_FillCenter: 1
  m_FillMethod: 4
  m_FillAmount: 1
  m_FillClockwise: 1
  m_FillOrigin: 0
  m_UseSpriteMesh: 0
  m_PixelsPerUnitMultiplier: 1
--- !u!222 &885276123
CanvasRenderer:
  m_ObjectHideFlags: 0
  m_CorrespondingSourceObject: {fileID: 0}
  m_PrefabInstance: {fileID: 0}
  m_PrefabAsset: {fileID: 0}
  m_GameObject: {fileID: 885276120}
  m_CullTransparentMesh: 0
--- !u!1001 &997761340
PrefabInstance:
  m_ObjectHideFlags: 0
  serializedVersion: 2
  m_Modification:
    m_TransformParent: {fileID: 239264462}
    m_Modifications:
    - target: {fileID: 5011845986032529196, guid: c87c6cef9345eea478c557a3653e0543,
        type: 3}
      propertyPath: m_OnClick.m_PersistentCalls.m_Calls.Array.size
      value: 1
      objectReference: {fileID: 0}
    - target: {fileID: 5011845986032529196, guid: c87c6cef9345eea478c557a3653e0543,
        type: 3}
      propertyPath: m_OnClick.m_PersistentCalls.m_Calls.Array.data[0].m_Target
      value: 
      objectReference: {fileID: 2481690412663161376, guid: 3644782b8dcf82a478806e9933b9c835,
        type: 3}
    - target: {fileID: 5011845986032529196, guid: c87c6cef9345eea478c557a3653e0543,
        type: 3}
      propertyPath: m_OnClick.m_PersistentCalls.m_Calls.Array.data[0].m_MethodName
      value: 
      objectReference: {fileID: 0}
    - target: {fileID: 5011845986032529196, guid: c87c6cef9345eea478c557a3653e0543,
        type: 3}
      propertyPath: m_OnClick.m_PersistentCalls.m_Calls.Array.data[0].m_Mode
      value: 2
      objectReference: {fileID: 0}
    - target: {fileID: 5011845986032529196, guid: c87c6cef9345eea478c557a3653e0543,
        type: 3}
      propertyPath: m_OnClick.m_PersistentCalls.m_Calls.Array.data[0].m_CallState
      value: 2
      objectReference: {fileID: 0}
    - target: {fileID: 5011845986032529196, guid: c87c6cef9345eea478c557a3653e0543,
        type: 3}
      propertyPath: m_OnClick.m_PersistentCalls.m_Calls.Array.data[0].m_TargetAssemblyTypeName
      value: UnityEngine.AudioSource, UnityEngine
      objectReference: {fileID: 0}
    - target: {fileID: 5011845986032529196, guid: c87c6cef9345eea478c557a3653e0543,
        type: 3}
      propertyPath: m_OnClick.m_PersistentCalls.m_Calls.Array.data[0].m_Arguments.m_ObjectArgumentAssemblyTypeName
      value: UnityEngine.AudioClip, UnityEngine
      objectReference: {fileID: 0}
    - target: {fileID: 5011845986032529196, guid: c87c6cef9345eea478c557a3653e0543,
        type: 3}
      propertyPath: m_OnClick.m_PersistentCalls.m_Calls.Array.data[0].m_Arguments.m_ObjectArgument
      value: 
      objectReference: {fileID: 8300000, guid: ceb03768a12f76f42927b33a07215494, type: 3}
    - target: {fileID: 5011845986032529198, guid: c87c6cef9345eea478c557a3653e0543,
        type: 3}
      propertyPath: m_Name
      value: PauseQuit
      objectReference: {fileID: 0}
    - target: {fileID: 5011845986032529199, guid: c87c6cef9345eea478c557a3653e0543,
        type: 3}
      propertyPath: m_LocalPosition.x
      value: 0
      objectReference: {fileID: 0}
    - target: {fileID: 5011845986032529199, guid: c87c6cef9345eea478c557a3653e0543,
        type: 3}
      propertyPath: m_LocalPosition.y
      value: 0
      objectReference: {fileID: 0}
    - target: {fileID: 5011845986032529199, guid: c87c6cef9345eea478c557a3653e0543,
        type: 3}
      propertyPath: m_LocalPosition.z
      value: 40.90394
      objectReference: {fileID: 0}
    - target: {fileID: 5011845986032529199, guid: c87c6cef9345eea478c557a3653e0543,
        type: 3}
      propertyPath: m_LocalRotation.x
      value: -0
      objectReference: {fileID: 0}
    - target: {fileID: 5011845986032529199, guid: c87c6cef9345eea478c557a3653e0543,
        type: 3}
      propertyPath: m_LocalRotation.y
      value: -0
      objectReference: {fileID: 0}
    - target: {fileID: 5011845986032529199, guid: c87c6cef9345eea478c557a3653e0543,
        type: 3}
      propertyPath: m_LocalRotation.z
      value: -0
      objectReference: {fileID: 0}
    - target: {fileID: 5011845986032529199, guid: c87c6cef9345eea478c557a3653e0543,
        type: 3}
      propertyPath: m_LocalRotation.w
      value: 1
      objectReference: {fileID: 0}
    - target: {fileID: 5011845986032529199, guid: c87c6cef9345eea478c557a3653e0543,
        type: 3}
      propertyPath: m_RootOrder
      value: 3
      objectReference: {fileID: 0}
    - target: {fileID: 5011845986032529199, guid: c87c6cef9345eea478c557a3653e0543,
        type: 3}
      propertyPath: m_LocalEulerAnglesHint.x
      value: 0
      objectReference: {fileID: 0}
    - target: {fileID: 5011845986032529199, guid: c87c6cef9345eea478c557a3653e0543,
        type: 3}
      propertyPath: m_LocalEulerAnglesHint.y
      value: 0
      objectReference: {fileID: 0}
    - target: {fileID: 5011845986032529199, guid: c87c6cef9345eea478c557a3653e0543,
        type: 3}
      propertyPath: m_LocalEulerAnglesHint.z
      value: 0
      objectReference: {fileID: 0}
    - target: {fileID: 5011845986032529199, guid: c87c6cef9345eea478c557a3653e0543,
        type: 3}
      propertyPath: m_AnchoredPosition.x
      value: 284
      objectReference: {fileID: 0}
    - target: {fileID: 5011845986032529199, guid: c87c6cef9345eea478c557a3653e0543,
        type: 3}
      propertyPath: m_AnchoredPosition.y
      value: 175
      objectReference: {fileID: 0}
    - target: {fileID: 5011845986032529199, guid: c87c6cef9345eea478c557a3653e0543,
        type: 3}
      propertyPath: m_SizeDelta.x
      value: 155.1087
      objectReference: {fileID: 0}
    - target: {fileID: 5011845986032529199, guid: c87c6cef9345eea478c557a3653e0543,
        type: 3}
      propertyPath: m_SizeDelta.y
      value: 93.56067
      objectReference: {fileID: 0}
    - target: {fileID: 5011845986032529199, guid: c87c6cef9345eea478c557a3653e0543,
        type: 3}
      propertyPath: m_AnchorMin.x
      value: 0.5
      objectReference: {fileID: 0}
    - target: {fileID: 5011845986032529199, guid: c87c6cef9345eea478c557a3653e0543,
        type: 3}
      propertyPath: m_AnchorMin.y
      value: 0.5
      objectReference: {fileID: 0}
    - target: {fileID: 5011845986032529199, guid: c87c6cef9345eea478c557a3653e0543,
        type: 3}
      propertyPath: m_AnchorMax.x
      value: 0.5
      objectReference: {fileID: 0}
    - target: {fileID: 5011845986032529199, guid: c87c6cef9345eea478c557a3653e0543,
        type: 3}
      propertyPath: m_AnchorMax.y
      value: 0.5
      objectReference: {fileID: 0}
    - target: {fileID: 5011845986032529199, guid: c87c6cef9345eea478c557a3653e0543,
        type: 3}
      propertyPath: m_Pivot.x
      value: 0.5
      objectReference: {fileID: 0}
    - target: {fileID: 5011845986032529199, guid: c87c6cef9345eea478c557a3653e0543,
        type: 3}
      propertyPath: m_Pivot.y
      value: 0.5
      objectReference: {fileID: 0}
    - target: {fileID: 5011845986032529199, guid: c87c6cef9345eea478c557a3653e0543,
        type: 3}
      propertyPath: m_LocalScale.x
      value: 0.42239583
      objectReference: {fileID: 0}
    - target: {fileID: 5011845986032529199, guid: c87c6cef9345eea478c557a3653e0543,
        type: 3}
      propertyPath: m_LocalScale.y
      value: 0.42239583
      objectReference: {fileID: 0}
    - target: {fileID: 5011845986032529199, guid: c87c6cef9345eea478c557a3653e0543,
        type: 3}
      propertyPath: m_LocalScale.z
      value: 0.42239583
      objectReference: {fileID: 0}
    - target: {fileID: 5011845986358185348, guid: c87c6cef9345eea478c557a3653e0543,
        type: 3}
      propertyPath: m_fontSize
      value: 90
      objectReference: {fileID: 0}
    - target: {fileID: 5011845986358185348, guid: c87c6cef9345eea478c557a3653e0543,
        type: 3}
      propertyPath: m_fontSizeBase
      value: 90
      objectReference: {fileID: 0}
    - target: {fileID: 5011845986358185348, guid: c87c6cef9345eea478c557a3653e0543,
        type: 3}
      propertyPath: m_text
      value: Quit
      objectReference: {fileID: 0}
    - target: {fileID: 5011845986358185348, guid: c87c6cef9345eea478c557a3653e0543,
        type: 3}
      propertyPath: m_enableAutoSizing
      value: 0
      objectReference: {fileID: 0}
    m_RemovedComponents:
    - {fileID: 5387647807116745601, guid: c87c6cef9345eea478c557a3653e0543, type: 3}
  m_SourcePrefab: {fileID: 100100000, guid: c87c6cef9345eea478c557a3653e0543, type: 3}
--- !u!224 &997761341 stripped
RectTransform:
  m_CorrespondingSourceObject: {fileID: 5011845986032529199, guid: c87c6cef9345eea478c557a3653e0543,
    type: 3}
  m_PrefabInstance: {fileID: 997761340}
  m_PrefabAsset: {fileID: 0}
--- !u!1 &1831466221
GameObject:
  m_ObjectHideFlags: 0
  m_CorrespondingSourceObject: {fileID: 0}
  m_PrefabInstance: {fileID: 0}
  m_PrefabAsset: {fileID: 0}
  serializedVersion: 6
  m_Component:
  - component: {fileID: 1831466227}
  - component: {fileID: 1831466226}
  - component: {fileID: 1831466225}
  - component: {fileID: 1831466224}
  - component: {fileID: 1831466223}
  - component: {fileID: 1831466222}
  - component: {fileID: 1831466228}
  m_Layer: 5
  m_Name: Pause
  m_TagString: Untagged
  m_Icon: {fileID: 0}
  m_NavMeshLayer: 0
  m_StaticEditorFlags: 0
  m_IsActive: 1
--- !u!114 &1831466222
MonoBehaviour:
  m_ObjectHideFlags: 0
  m_CorrespondingSourceObject: {fileID: 0}
  m_PrefabInstance: {fileID: 0}
  m_PrefabAsset: {fileID: 0}
  m_GameObject: {fileID: 1831466221}
  m_Enabled: 1
  m_EditorHideFlags: 0
  m_Script: {fileID: 11500000, guid: fe87c0e1cc204ed48ad3b37840f39efc, type: 3}
  m_Name: 
  m_EditorClassIdentifier: 
  m_Material: {fileID: 0}
  m_Color: {r: 0.24528301, g: 0.18543714, b: 0.11685653, a: 0}
  m_RaycastTarget: 1
  m_RaycastPadding: {x: 0, y: 0, z: 0, w: 0}
  m_Maskable: 1
  m_OnCullStateChanged:
    m_PersistentCalls:
      m_Calls: []
  m_Sprite: {fileID: 0}
  m_Type: 0
  m_PreserveAspect: 0
  m_FillCenter: 1
  m_FillMethod: 4
  m_FillAmount: 1
  m_FillClockwise: 1
  m_FillOrigin: 0
  m_UseSpriteMesh: 0
  m_PixelsPerUnitMultiplier: 1
--- !u!222 &1831466223
CanvasRenderer:
  m_ObjectHideFlags: 0
  m_CorrespondingSourceObject: {fileID: 0}
  m_PrefabInstance: {fileID: 0}
  m_PrefabAsset: {fileID: 0}
  m_GameObject: {fileID: 1831466221}
  m_CullTransparentMesh: 0
--- !u!114 &1831466224
MonoBehaviour:
  m_ObjectHideFlags: 0
  m_CorrespondingSourceObject: {fileID: 0}
  m_PrefabInstance: {fileID: 0}
  m_PrefabAsset: {fileID: 0}
  m_GameObject: {fileID: 1831466221}
  m_Enabled: 1
  m_EditorHideFlags: 0
  m_Script: {fileID: 11500000, guid: dc42784cf147c0c48a680349fa168899, type: 3}
  m_Name: 
  m_EditorClassIdentifier: 
  m_IgnoreReversedGraphics: 1
  m_BlockingObjects: 0
  m_BlockingMask:
    serializedVersion: 2
    m_Bits: 4294967295
--- !u!114 &1831466225
MonoBehaviour:
  m_ObjectHideFlags: 0
  m_CorrespondingSourceObject: {fileID: 0}
  m_PrefabInstance: {fileID: 0}
  m_PrefabAsset: {fileID: 0}
  m_GameObject: {fileID: 1831466221}
  m_Enabled: 1
  m_EditorHideFlags: 0
  m_Script: {fileID: 11500000, guid: 0cd44c1031e13a943bb63640046fad76, type: 3}
  m_Name: 
  m_EditorClassIdentifier: 
  m_UiScaleMode: 1
  m_ReferencePixelsPerUnit: 100
  m_ScaleFactor: 1
  m_ReferenceResolution: {x: 1920, y: 1080}
  m_ScreenMatchMode: 0
  m_MatchWidthOrHeight: 0
  m_PhysicalUnit: 3
  m_FallbackScreenDPI: 96
  m_DefaultSpriteDPI: 96
  m_DynamicPixelsPerUnit: 1
--- !u!223 &1831466226
Canvas:
  m_ObjectHideFlags: 0
  m_CorrespondingSourceObject: {fileID: 0}
  m_PrefabInstance: {fileID: 0}
  m_PrefabAsset: {fileID: 0}
  m_GameObject: {fileID: 1831466221}
  m_Enabled: 1
  serializedVersion: 3
  m_RenderMode: 0
  m_Camera: {fileID: 0}
  m_PlaneDistance: 100
  m_PixelPerfect: 0
  m_ReceivesEvents: 1
  m_OverrideSorting: 0
  m_OverridePixelPerfect: 0
  m_SortingBucketNormalizedSize: 0
  m_AdditionalShaderChannelsFlag: 25
  m_SortingLayerID: 0
  m_SortingOrder: 0
  m_TargetDisplay: 0
--- !u!224 &1831466227
RectTransform:
  m_ObjectHideFlags: 0
  m_CorrespondingSourceObject: {fileID: 0}
  m_PrefabInstance: {fileID: 0}
  m_PrefabAsset: {fileID: 0}
  m_GameObject: {fileID: 1831466221}
  m_LocalRotation: {x: 0, y: 0, z: 0, w: 1}
  m_LocalPosition: {x: 0, y: 0, z: 0}
  m_LocalScale: {x: 0, y: 0, z: 0}
  m_Children:
  - {fileID: 885276121}
  - {fileID: 387326332}
  - {fileID: 239264462}
  m_Father: {fileID: 0}
  m_RootOrder: 0
  m_LocalEulerAnglesHint: {x: 0, y: 0, z: 0}
  m_AnchorMin: {x: 0, y: 0}
  m_AnchorMax: {x: 0, y: 0}
  m_AnchoredPosition: {x: 0, y: 0}
  m_SizeDelta: {x: 0, y: 0}
  m_Pivot: {x: 0, y: 0}
--- !u!114 &1831466228
MonoBehaviour:
  m_ObjectHideFlags: 0
  m_CorrespondingSourceObject: {fileID: 0}
  m_PrefabInstance: {fileID: 0}
  m_PrefabAsset: {fileID: 0}
  m_GameObject: {fileID: 1831466221}
  m_Enabled: 1
  m_EditorHideFlags: 0
  m_Script: {fileID: 11500000, guid: d00db8c55d104107818f483f5bb25a70, type: 3}
  m_Name: 
  m_EditorClassIdentifier: 
--- !u!1001 &2023158891
PrefabInstance:
  m_ObjectHideFlags: 0
  serializedVersion: 2
  m_Modification:
    m_TransformParent: {fileID: 239264462}
    m_Modifications:
    - target: {fileID: 5011845986032529196, guid: c87c6cef9345eea478c557a3653e0543,
        type: 3}
      propertyPath: m_OnClick.m_PersistentCalls.m_Calls.Array.size
      value: 1
      objectReference: {fileID: 0}
    - target: {fileID: 5011845986032529196, guid: c87c6cef9345eea478c557a3653e0543,
        type: 3}
      propertyPath: m_OnClick.m_PersistentCalls.m_Calls.Array.data[0].m_Target
      value: 
      objectReference: {fileID: 2481690412663161376, guid: 3644782b8dcf82a478806e9933b9c835,
        type: 3}
    - target: {fileID: 5011845986032529196, guid: c87c6cef9345eea478c557a3653e0543,
        type: 3}
      propertyPath: m_OnClick.m_PersistentCalls.m_Calls.Array.data[0].m_MethodName
      value: 
      objectReference: {fileID: 0}
    - target: {fileID: 5011845986032529196, guid: c87c6cef9345eea478c557a3653e0543,
        type: 3}
      propertyPath: m_OnClick.m_PersistentCalls.m_Calls.Array.data[0].m_Mode
      value: 2
      objectReference: {fileID: 0}
    - target: {fileID: 5011845986032529196, guid: c87c6cef9345eea478c557a3653e0543,
        type: 3}
      propertyPath: m_OnClick.m_PersistentCalls.m_Calls.Array.data[0].m_CallState
      value: 2
      objectReference: {fileID: 0}
    - target: {fileID: 5011845986032529196, guid: c87c6cef9345eea478c557a3653e0543,
        type: 3}
      propertyPath: m_OnClick.m_PersistentCalls.m_Calls.Array.data[0].m_TargetAssemblyTypeName
      value: UnityEngine.AudioSource, UnityEngine
      objectReference: {fileID: 0}
    - target: {fileID: 5011845986032529196, guid: c87c6cef9345eea478c557a3653e0543,
        type: 3}
      propertyPath: m_OnClick.m_PersistentCalls.m_Calls.Array.data[0].m_Arguments.m_ObjectArgumentAssemblyTypeName
      value: UnityEngine.AudioClip, UnityEngine
      objectReference: {fileID: 0}
    - target: {fileID: 5011845986032529196, guid: c87c6cef9345eea478c557a3653e0543,
        type: 3}
      propertyPath: m_OnClick.m_PersistentCalls.m_Calls.Array.data[0].m_Arguments.m_ObjectArgument
      value: 
      objectReference: {fileID: 8300000, guid: ceb03768a12f76f42927b33a07215494, type: 3}
    - target: {fileID: 5011845986032529198, guid: c87c6cef9345eea478c557a3653e0543,
        type: 3}
      propertyPath: m_Name
      value: AchievementsButton
      objectReference: {fileID: 0}
    - target: {fileID: 5011845986032529199, guid: c87c6cef9345eea478c557a3653e0543,
        type: 3}
      propertyPath: m_LocalPosition.x
      value: 0
      objectReference: {fileID: 0}
    - target: {fileID: 5011845986032529199, guid: c87c6cef9345eea478c557a3653e0543,
        type: 3}
      propertyPath: m_LocalPosition.y
      value: 0
      objectReference: {fileID: 0}
    - target: {fileID: 5011845986032529199, guid: c87c6cef9345eea478c557a3653e0543,
        type: 3}
      propertyPath: m_LocalPosition.z
      value: 0
      objectReference: {fileID: 0}
    - target: {fileID: 5011845986032529199, guid: c87c6cef9345eea478c557a3653e0543,
        type: 3}
      propertyPath: m_LocalRotation.x
      value: -0
      objectReference: {fileID: 0}
    - target: {fileID: 5011845986032529199, guid: c87c6cef9345eea478c557a3653e0543,
        type: 3}
      propertyPath: m_LocalRotation.y
      value: -0
      objectReference: {fileID: 0}
    - target: {fileID: 5011845986032529199, guid: c87c6cef9345eea478c557a3653e0543,
        type: 3}
      propertyPath: m_LocalRotation.z
      value: -0
      objectReference: {fileID: 0}
    - target: {fileID: 5011845986032529199, guid: c87c6cef9345eea478c557a3653e0543,
        type: 3}
      propertyPath: m_LocalRotation.w
      value: 1
      objectReference: {fileID: 0}
    - target: {fileID: 5011845986032529199, guid: c87c6cef9345eea478c557a3653e0543,
        type: 3}
      propertyPath: m_RootOrder
      value: 1
      objectReference: {fileID: 0}
    - target: {fileID: 5011845986032529199, guid: c87c6cef9345eea478c557a3653e0543,
        type: 3}
      propertyPath: m_LocalEulerAnglesHint.x
      value: 0
      objectReference: {fileID: 0}
    - target: {fileID: 5011845986032529199, guid: c87c6cef9345eea478c557a3653e0543,
        type: 3}
      propertyPath: m_LocalEulerAnglesHint.y
      value: 0
      objectReference: {fileID: 0}
    - target: {fileID: 5011845986032529199, guid: c87c6cef9345eea478c557a3653e0543,
        type: 3}
      propertyPath: m_LocalEulerAnglesHint.z
      value: 0
      objectReference: {fileID: 0}
    - target: {fileID: 5011845986032529199, guid: c87c6cef9345eea478c557a3653e0543,
        type: 3}
      propertyPath: m_AnchoredPosition.x
      value: 282
      objectReference: {fileID: 0}
    - target: {fileID: 5011845986032529199, guid: c87c6cef9345eea478c557a3653e0543,
        type: 3}
      propertyPath: m_AnchoredPosition.y
      value: 266
      objectReference: {fileID: 0}
    - target: {fileID: 5011845986032529199, guid: c87c6cef9345eea478c557a3653e0543,
        type: 3}
      propertyPath: m_SizeDelta.x
      value: 470.19275
      objectReference: {fileID: 0}
    - target: {fileID: 5011845986032529199, guid: c87c6cef9345eea478c557a3653e0543,
        type: 3}
      propertyPath: m_SizeDelta.y
      value: 104.48642
      objectReference: {fileID: 0}
    - target: {fileID: 5011845986032529199, guid: c87c6cef9345eea478c557a3653e0543,
        type: 3}
      propertyPath: m_AnchorMin.x
      value: 0.5
      objectReference: {fileID: 0}
    - target: {fileID: 5011845986032529199, guid: c87c6cef9345eea478c557a3653e0543,
        type: 3}
      propertyPath: m_AnchorMin.y
      value: 0.5
      objectReference: {fileID: 0}
    - target: {fileID: 5011845986032529199, guid: c87c6cef9345eea478c557a3653e0543,
        type: 3}
      propertyPath: m_AnchorMax.x
      value: 0.5
      objectReference: {fileID: 0}
    - target: {fileID: 5011845986032529199, guid: c87c6cef9345eea478c557a3653e0543,
        type: 3}
      propertyPath: m_AnchorMax.y
      value: 0.5
      objectReference: {fileID: 0}
    - target: {fileID: 5011845986032529199, guid: c87c6cef9345eea478c557a3653e0543,
        type: 3}
      propertyPath: m_Pivot.x
      value: 0.5
      objectReference: {fileID: 0}
    - target: {fileID: 5011845986032529199, guid: c87c6cef9345eea478c557a3653e0543,
        type: 3}
      propertyPath: m_Pivot.y
      value: 0.5
      objectReference: {fileID: 0}
    - target: {fileID: 5011845986032529199, guid: c87c6cef9345eea478c557a3653e0543,
        type: 3}
      propertyPath: m_LocalScale.x
      value: 0.42239583
      objectReference: {fileID: 0}
    - target: {fileID: 5011845986032529199, guid: c87c6cef9345eea478c557a3653e0543,
        type: 3}
      propertyPath: m_LocalScale.y
      value: 0.42239583
      objectReference: {fileID: 0}
    - target: {fileID: 5011845986032529199, guid: c87c6cef9345eea478c557a3653e0543,
        type: 3}
      propertyPath: m_LocalScale.z
      value: 0.42239583
      objectReference: {fileID: 0}
    - target: {fileID: 5011845986358185348, guid: c87c6cef9345eea478c557a3653e0543,
        type: 3}
      propertyPath: m_text
      value: 'Achievements

'
      objectReference: {fileID: 0}
    - target: {fileID: 5011845986358185348, guid: c87c6cef9345eea478c557a3653e0543,
        type: 3}
      propertyPath: m_fontSize
      value: 90
      objectReference: {fileID: 0}
    - target: {fileID: 5011845986358185348, guid: c87c6cef9345eea478c557a3653e0543,
        type: 3}
      propertyPath: m_fontSizeBase
      value: 90
      objectReference: {fileID: 0}
    - target: {fileID: 5011845986358185348, guid: c87c6cef9345eea478c557a3653e0543,
        type: 3}
      propertyPath: m_margin.z
      value: -1.7380962
      objectReference: {fileID: 0}
    - target: {fileID: 5011845986358185348, guid: c87c6cef9345eea478c557a3653e0543,
        type: 3}
      propertyPath: m_enableAutoSizing
      value: 0
      objectReference: {fileID: 0}
    - target: {fileID: 5011845986358185351, guid: c87c6cef9345eea478c557a3653e0543,
        type: 3}
      propertyPath: m_AnchoredPosition.x
      value: 0
      objectReference: {fileID: 0}
    - target: {fileID: 5011845986358185351, guid: c87c6cef9345eea478c557a3653e0543,
        type: 3}
      propertyPath: m_SizeDelta.x
      value: 0
      objectReference: {fileID: 0}
    - target: {fileID: 5011845986358185351, guid: c87c6cef9345eea478c557a3653e0543,
        type: 3}
      propertyPath: m_AnchoredPosition.y
      value: 0
      objectReference: {fileID: 0}
    - target: {fileID: 5011845986358185351, guid: c87c6cef9345eea478c557a3653e0543,
        type: 3}
      propertyPath: m_AnchorMin.x
      value: 0
      objectReference: {fileID: 0}
    - target: {fileID: 5011845986358185351, guid: c87c6cef9345eea478c557a3653e0543,
        type: 3}
      propertyPath: m_AnchorMin.y
      value: 0
      objectReference: {fileID: 0}
    - target: {fileID: 5011845986358185351, guid: c87c6cef9345eea478c557a3653e0543,
        type: 3}
      propertyPath: m_AnchorMax.x
      value: 1
      objectReference: {fileID: 0}
    - target: {fileID: 5011845986358185351, guid: c87c6cef9345eea478c557a3653e0543,
        type: 3}
      propertyPath: m_SizeDelta.y
      value: 0
      objectReference: {fileID: 0}
    - target: {fileID: 5011845986358185351, guid: c87c6cef9345eea478c557a3653e0543,
        type: 3}
      propertyPath: m_Pivot.y
      value: 0.5
      objectReference: {fileID: 0}
    - target: {fileID: 5011845986358185351, guid: c87c6cef9345eea478c557a3653e0543,
        type: 3}
      propertyPath: m_AnchorMax.y
      value: 1
      objectReference: {fileID: 0}
    m_RemovedComponents:
    - {fileID: 5387647807116745601, guid: c87c6cef9345eea478c557a3653e0543, type: 3}
  m_SourcePrefab: {fileID: 100100000, guid: c87c6cef9345eea478c557a3653e0543, type: 3}
--- !u!224 &2023158892 stripped
RectTransform:
  m_CorrespondingSourceObject: {fileID: 5011845986032529199, guid: c87c6cef9345eea478c557a3653e0543,
    type: 3}
  m_PrefabInstance: {fileID: 2023158891}
  m_PrefabAsset: {fileID: 0}
