<mxfile host="app.diagrams.net" modified="2024-04-23T10:57:32.784Z" agent="Mozilla/5.0 (Windows NT 10.0; Win64; x64) AppleWebKit/537.36 (KHTML, like Gecko) Chrome/124.0.0.0 Safari/537.36 Edg/124.0.0.0" etag="eRv2yGIklsumgBV0FMMa" version="24.2.7" type="device">
  <diagram name="Pagina-1" id="5d7J0KkLj1aBf2WzUEbR">
    <mxGraphModel dx="5373" dy="-1718" grid="1" gridSize="10" guides="1" tooltips="1" connect="1" arrows="1" fold="1" page="1" pageScale="1" pageWidth="827" pageHeight="1169" math="0" shadow="0">
      <root>
        <mxCell id="0" />
        <mxCell id="1" parent="0" />
        <mxCell id="0_Y_4YDWGghsoqahOQmA-1" value="&lt;font style=&quot;font-size: 72px;&quot;&gt;&lt;b style=&quot;&quot;&gt;DEVELOPERS - STRUMENTO DI SUPPORTO ALLO SVILUPPO SW&lt;/b&gt;&lt;/font&gt;" style="text;html=1;align=center;verticalAlign=middle;resizable=0;points=[];autosize=1;strokeColor=none;fillColor=none;labelBackgroundColor=none;" vertex="1" parent="1">
          <mxGeometry x="2975" y="6120" width="2280" height="100" as="geometry" />
        </mxCell>
        <mxCell id="0_Y_4YDWGghsoqahOQmA-2" style="edgeStyle=orthogonalEdgeStyle;rounded=0;orthogonalLoop=1;jettySize=auto;html=1;entryX=1;entryY=0.5;entryDx=0;entryDy=0;endArrow=classic;endFill=1;" edge="1" parent="1" source="0_Y_4YDWGghsoqahOQmA-5" target="0_Y_4YDWGghsoqahOQmA-11">
          <mxGeometry relative="1" as="geometry">
            <mxPoint x="2510" y="7042.750000000001" as="targetPoint" />
          </mxGeometry>
        </mxCell>
        <mxCell id="0_Y_4YDWGghsoqahOQmA-3" style="edgeStyle=orthogonalEdgeStyle;rounded=0;orthogonalLoop=1;jettySize=auto;html=1;entryX=0;entryY=0.5;entryDx=0;entryDy=0;endArrow=none;endFill=0;" edge="1" parent="1" source="0_Y_4YDWGghsoqahOQmA-5" target="0_Y_4YDWGghsoqahOQmA-71">
          <mxGeometry relative="1" as="geometry">
            <Array as="points">
              <mxPoint x="2745" y="7012" />
              <mxPoint x="2790" y="7012" />
              <mxPoint x="2790" y="6977" />
            </Array>
          </mxGeometry>
        </mxCell>
        <mxCell id="0_Y_4YDWGghsoqahOQmA-4" style="edgeStyle=orthogonalEdgeStyle;rounded=0;orthogonalLoop=1;jettySize=auto;html=1;entryX=0.5;entryY=0;entryDx=0;entryDy=0;endArrow=none;endFill=0;" edge="1" parent="1" source="0_Y_4YDWGghsoqahOQmA-5" target="0_Y_4YDWGghsoqahOQmA-93">
          <mxGeometry relative="1" as="geometry">
            <Array as="points">
              <mxPoint x="2671.25" y="7062.25" />
              <mxPoint x="2671.25" y="7142.25" />
              <mxPoint x="2414.25" y="7142.25" />
            </Array>
          </mxGeometry>
        </mxCell>
        <mxCell id="0_Y_4YDWGghsoqahOQmA-5" value="SVILUPPATORE" style="rounded=0;whiteSpace=wrap;html=1;labelBackgroundColor=none;" vertex="1" parent="1">
          <mxGeometry x="2685" y="7012.75" width="120" height="60" as="geometry" />
        </mxCell>
        <mxCell id="0_Y_4YDWGghsoqahOQmA-6" style="edgeStyle=orthogonalEdgeStyle;rounded=0;orthogonalLoop=1;jettySize=auto;html=1;entryX=1;entryY=0.5;entryDx=0;entryDy=0;endArrow=none;endFill=0;" edge="1" parent="1" source="0_Y_4YDWGghsoqahOQmA-8" target="0_Y_4YDWGghsoqahOQmA-71">
          <mxGeometry relative="1" as="geometry">
            <Array as="points">
              <mxPoint x="3153.5" y="6976" />
            </Array>
          </mxGeometry>
        </mxCell>
        <mxCell id="0_Y_4YDWGghsoqahOQmA-7" style="edgeStyle=orthogonalEdgeStyle;rounded=0;orthogonalLoop=1;jettySize=auto;html=1;entryX=0.5;entryY=0;entryDx=0;entryDy=0;endArrow=none;endFill=0;" edge="1" parent="1" source="0_Y_4YDWGghsoqahOQmA-8" target="0_Y_4YDWGghsoqahOQmA-94">
          <mxGeometry relative="1" as="geometry" />
        </mxCell>
        <mxCell id="0_Y_4YDWGghsoqahOQmA-8" value="PROGETTO" style="rounded=0;whiteSpace=wrap;html=1;labelBackgroundColor=none;" vertex="1" parent="1">
          <mxGeometry x="3236.25" y="6956.5" width="120" height="60" as="geometry" />
        </mxCell>
        <mxCell id="0_Y_4YDWGghsoqahOQmA-9" style="edgeStyle=orthogonalEdgeStyle;rounded=0;orthogonalLoop=1;jettySize=auto;html=1;endArrow=none;endFill=0;entryX=0.5;entryY=1;entryDx=0;entryDy=0;" edge="1" parent="1" source="0_Y_4YDWGghsoqahOQmA-10" target="0_Y_4YDWGghsoqahOQmA-94">
          <mxGeometry relative="1" as="geometry">
            <mxPoint x="3501.25" y="7172.250000000001" as="targetPoint" />
            <Array as="points">
              <mxPoint x="3350" y="7272" />
              <mxPoint x="3504" y="7272" />
            </Array>
          </mxGeometry>
        </mxCell>
        <mxCell id="0_Y_4YDWGghsoqahOQmA-10" value="TASK" style="rounded=0;whiteSpace=wrap;html=1;labelBackgroundColor=none;" vertex="1" parent="1">
          <mxGeometry x="3230" y="7393.75" width="120" height="60" as="geometry" />
        </mxCell>
        <mxCell id="0_Y_4YDWGghsoqahOQmA-11" value="PERSONA" style="rounded=0;whiteSpace=wrap;html=1;labelBackgroundColor=none;" vertex="1" parent="1">
          <mxGeometry x="2347.5" y="7012.75" width="120" height="60" as="geometry" />
        </mxCell>
        <mxCell id="0_Y_4YDWGghsoqahOQmA-12" style="edgeStyle=orthogonalEdgeStyle;rounded=0;orthogonalLoop=1;jettySize=auto;html=1;endArrow=none;endFill=0;" edge="1" parent="1" source="0_Y_4YDWGghsoqahOQmA-13">
          <mxGeometry relative="1" as="geometry">
            <mxPoint x="2751.25" y="7165.25" as="targetPoint" />
            <Array as="points">
              <mxPoint x="2612" y="7185.28" />
              <mxPoint x="2612" y="7165.28" />
            </Array>
          </mxGeometry>
        </mxCell>
        <mxCell id="0_Y_4YDWGghsoqahOQmA-13" value="COORDINATORE" style="rounded=0;whiteSpace=wrap;html=1;labelBackgroundColor=none;" vertex="1" parent="1">
          <mxGeometry x="2552.5" y="7195.28" width="120" height="60" as="geometry" />
        </mxCell>
        <mxCell id="0_Y_4YDWGghsoqahOQmA-14" value="COLLABORATORE" style="rounded=0;whiteSpace=wrap;html=1;labelBackgroundColor=none;" vertex="1" parent="1">
          <mxGeometry x="2685" y="7195.28" width="120" height="60" as="geometry" />
        </mxCell>
        <mxCell id="0_Y_4YDWGghsoqahOQmA-15" value="SKILL" style="rounded=0;whiteSpace=wrap;html=1;labelBackgroundColor=none;" vertex="1" parent="1">
          <mxGeometry x="2685" y="6772.25" width="120" height="60" as="geometry" />
        </mxCell>
        <mxCell id="0_Y_4YDWGghsoqahOQmA-16" value="" style="edgeStyle=orthogonalEdgeStyle;rounded=0;orthogonalLoop=1;jettySize=auto;html=1;endArrow=none;endFill=0;" edge="1" parent="1" source="0_Y_4YDWGghsoqahOQmA-18" target="0_Y_4YDWGghsoqahOQmA-98">
          <mxGeometry relative="1" as="geometry" />
        </mxCell>
        <mxCell id="0_Y_4YDWGghsoqahOQmA-18" value="FILE" style="rounded=0;whiteSpace=wrap;html=1;labelBackgroundColor=none;" vertex="1" parent="1">
          <mxGeometry x="3767.03" y="7391.25" width="120" height="60" as="geometry" />
        </mxCell>
        <mxCell id="0_Y_4YDWGghsoqahOQmA-19" value="MESSAGGIO" style="rounded=0;whiteSpace=wrap;html=1;labelBackgroundColor=none;" vertex="1" parent="1">
          <mxGeometry x="3443.75" y="6602.25" width="120" height="60" as="geometry" />
        </mxCell>
        <mxCell id="0_Y_4YDWGghsoqahOQmA-20" style="edgeStyle=orthogonalEdgeStyle;rounded=0;orthogonalLoop=1;jettySize=auto;html=1;entryX=0;entryY=0.5;entryDx=0;entryDy=0;endArrow=none;endFill=0;" edge="1" parent="1" source="0_Y_4YDWGghsoqahOQmA-21" target="0_Y_4YDWGghsoqahOQmA-11">
          <mxGeometry relative="1" as="geometry">
            <Array as="points">
              <mxPoint x="2337.5" y="6938.25" />
              <mxPoint x="2337.5" y="7012.25" />
              <mxPoint x="2347.5" y="7012.25" />
            </Array>
          </mxGeometry>
        </mxCell>
        <mxCell id="0_Y_4YDWGghsoqahOQmA-21" value="&lt;font style=&quot;font-size: 10px;&quot;&gt;NOME&lt;/font&gt;" style="ellipse;whiteSpace=wrap;html=1;labelBackgroundColor=none;" vertex="1" parent="1">
          <mxGeometry x="2228.75" y="6906.25" width="62.5" height="42" as="geometry" />
        </mxCell>
        <mxCell id="0_Y_4YDWGghsoqahOQmA-24" style="edgeStyle=orthogonalEdgeStyle;rounded=0;orthogonalLoop=1;jettySize=auto;html=1;endArrow=block;endFill=0;entryX=0.5;entryY=1;entryDx=0;entryDy=0;" edge="1" parent="1" source="0_Y_4YDWGghsoqahOQmA-26" target="0_Y_4YDWGghsoqahOQmA-5">
          <mxGeometry relative="1" as="geometry">
            <mxPoint x="2740" y="7165.28" as="targetPoint" />
            <Array as="points">
              <mxPoint x="2888.25" y="7165.25" />
              <mxPoint x="2745.25" y="7165.25" />
            </Array>
          </mxGeometry>
        </mxCell>
        <mxCell id="0_Y_4YDWGghsoqahOQmA-25" value="" style="edgeStyle=orthogonalEdgeStyle;rounded=0;orthogonalLoop=1;jettySize=auto;html=1;" edge="1" parent="1" source="0_Y_4YDWGghsoqahOQmA-26" target="0_Y_4YDWGghsoqahOQmA-63">
          <mxGeometry relative="1" as="geometry" />
        </mxCell>
        <mxCell id="0_Y_4YDWGghsoqahOQmA-26" value="GRAFICO" style="rounded=0;whiteSpace=wrap;html=1;labelBackgroundColor=none;" vertex="1" parent="1">
          <mxGeometry x="2817.5" y="7195.28" width="120" height="60" as="geometry" />
        </mxCell>
        <mxCell id="0_Y_4YDWGghsoqahOQmA-27" value="&lt;font style=&quot;font-size: 72px;&quot;&gt;&lt;b style=&quot;&quot;&gt;ER&lt;/b&gt;&lt;/font&gt;" style="text;html=1;align=center;verticalAlign=middle;resizable=0;points=[];autosize=1;strokeColor=none;fillColor=none;labelBackgroundColor=none;" vertex="1" parent="1">
          <mxGeometry x="2852.5" y="6205" width="120" height="100" as="geometry" />
        </mxCell>
        <mxCell id="0_Y_4YDWGghsoqahOQmA-28" value="&lt;font style=&quot;font-size: 72px;&quot;&gt;&lt;b style=&quot;&quot;&gt;ER RISTRUTTURATO&lt;/b&gt;&lt;/font&gt;" style="text;html=1;align=center;verticalAlign=middle;resizable=0;points=[];autosize=1;strokeColor=none;fillColor=none;labelBackgroundColor=none;" vertex="1" parent="1">
          <mxGeometry x="5150" y="6205" width="750" height="100" as="geometry" />
        </mxCell>
        <mxCell id="0_Y_4YDWGghsoqahOQmA-29" value="ANAGRAFICA" style="rounded=0;whiteSpace=wrap;html=1;labelBackgroundColor=none;" vertex="1" parent="1">
          <mxGeometry x="4620" y="6845.0599999999995" width="120" height="60" as="geometry" />
        </mxCell>
        <mxCell id="0_Y_4YDWGghsoqahOQmA-30" value="RECAPITI" style="rounded=0;whiteSpace=wrap;html=1;labelBackgroundColor=none;" vertex="1" parent="1">
          <mxGeometry x="4751.25" y="6844.3099999999995" width="120" height="60" as="geometry" />
        </mxCell>
        <mxCell id="0_Y_4YDWGghsoqahOQmA-31" value="CV" style="rounded=0;whiteSpace=wrap;html=1;labelBackgroundColor=none;" vertex="1" parent="1">
          <mxGeometry x="4883.75" y="6844.3099999999995" width="120" height="60" as="geometry" />
        </mxCell>
        <mxCell id="0_Y_4YDWGghsoqahOQmA-32" style="edgeStyle=orthogonalEdgeStyle;rounded=0;orthogonalLoop=1;jettySize=auto;html=1;endArrow=none;endFill=0;" edge="1" parent="1" source="0_Y_4YDWGghsoqahOQmA-33">
          <mxGeometry relative="1" as="geometry">
            <mxPoint x="2347.500000000001" y="7032.25" as="targetPoint" />
            <Array as="points">
              <mxPoint x="2327.5" y="6980.25" />
              <mxPoint x="2327.5" y="7022.25" />
              <mxPoint x="2347.5" y="7022.25" />
            </Array>
          </mxGeometry>
        </mxCell>
        <mxCell id="0_Y_4YDWGghsoqahOQmA-33" value="&lt;font style=&quot;font-size: 10px;&quot;&gt;COGNOME&lt;/font&gt;" style="ellipse;whiteSpace=wrap;html=1;labelBackgroundColor=none;" vertex="1" parent="1">
          <mxGeometry x="2228.75" y="6948.25" width="62.5" height="42" as="geometry" />
        </mxCell>
        <mxCell id="0_Y_4YDWGghsoqahOQmA-34" style="edgeStyle=orthogonalEdgeStyle;rounded=0;orthogonalLoop=1;jettySize=auto;html=1;entryX=0;entryY=0;entryDx=0;entryDy=0;endArrow=none;endFill=0;" edge="1" parent="1" source="0_Y_4YDWGghsoqahOQmA-35" target="0_Y_4YDWGghsoqahOQmA-11">
          <mxGeometry relative="1" as="geometry" />
        </mxCell>
        <mxCell id="0_Y_4YDWGghsoqahOQmA-35" value="&lt;u&gt;&lt;font style=&quot;font-size: 10px;&quot;&gt;CF&lt;/font&gt;&lt;/u&gt;" style="ellipse;whiteSpace=wrap;html=1;labelBackgroundColor=none;" vertex="1" parent="1">
          <mxGeometry x="2228.75" y="6864.25" width="62.5" height="42" as="geometry" />
        </mxCell>
        <mxCell id="0_Y_4YDWGghsoqahOQmA-36" style="edgeStyle=orthogonalEdgeStyle;rounded=0;orthogonalLoop=1;jettySize=auto;html=1;endArrow=none;endFill=0;" edge="1" parent="1" source="0_Y_4YDWGghsoqahOQmA-37">
          <mxGeometry relative="1" as="geometry">
            <mxPoint x="2347.5" y="7042.25" as="targetPoint" />
            <Array as="points">
              <mxPoint x="2317.5" y="7018.25" />
              <mxPoint x="2317.5" y="7032.25" />
              <mxPoint x="2347.5" y="7032.25" />
            </Array>
          </mxGeometry>
        </mxCell>
        <mxCell id="0_Y_4YDWGghsoqahOQmA-37" value="&lt;span style=&quot;font-size: 10px;&quot;&gt;DATA DI NASCITA&lt;/span&gt;" style="ellipse;whiteSpace=wrap;html=1;labelBackgroundColor=none;" vertex="1" parent="1">
          <mxGeometry x="2231.25" y="6990.25" width="60" height="35" as="geometry" />
        </mxCell>
        <mxCell id="0_Y_4YDWGghsoqahOQmA-38" style="edgeStyle=orthogonalEdgeStyle;rounded=0;orthogonalLoop=1;jettySize=auto;html=1;endArrow=none;endFill=0;" edge="1" parent="1" source="0_Y_4YDWGghsoqahOQmA-39">
          <mxGeometry relative="1" as="geometry">
            <mxPoint x="2347.5" y="7042.25" as="targetPoint" />
          </mxGeometry>
        </mxCell>
        <mxCell id="0_Y_4YDWGghsoqahOQmA-39" value="&lt;span style=&quot;font-size: 10px;&quot;&gt;INDIRIZZO RESIDENZA&lt;/span&gt;" style="ellipse;whiteSpace=wrap;html=1;labelBackgroundColor=none;" vertex="1" parent="1">
          <mxGeometry x="2231.25" y="7025.25" width="60" height="35" as="geometry" />
        </mxCell>
        <mxCell id="0_Y_4YDWGghsoqahOQmA-45" style="edgeStyle=orthogonalEdgeStyle;rounded=0;orthogonalLoop=1;jettySize=auto;html=1;entryX=0;entryY=0.25;entryDx=0;entryDy=0;endArrow=none;endFill=0;" edge="1" parent="1" source="0_Y_4YDWGghsoqahOQmA-46" target="0_Y_4YDWGghsoqahOQmA-11">
          <mxGeometry relative="1" as="geometry">
            <Array as="points">
              <mxPoint x="2319.5" y="7088.25" />
              <mxPoint x="2319.5" y="7052.25" />
              <mxPoint x="2347.5" y="7052.25" />
            </Array>
          </mxGeometry>
        </mxCell>
        <mxCell id="0_Y_4YDWGghsoqahOQmA-46" value="&lt;span style=&quot;font-size: 10px;&quot;&gt;EMAIL&lt;/span&gt;" style="ellipse;whiteSpace=wrap;html=1;labelBackgroundColor=none;" vertex="1" parent="1">
          <mxGeometry x="2231.25" y="7060.25" width="60" height="35" as="geometry" />
        </mxCell>
        <mxCell id="0_Y_4YDWGghsoqahOQmA-47" style="edgeStyle=orthogonalEdgeStyle;rounded=0;orthogonalLoop=1;jettySize=auto;html=1;endArrow=none;endFill=0;" edge="1" parent="1" source="0_Y_4YDWGghsoqahOQmA-48" target="0_Y_4YDWGghsoqahOQmA-11">
          <mxGeometry relative="1" as="geometry">
            <Array as="points">
              <mxPoint x="2327.5" y="7123.25" />
              <mxPoint x="2327.5" y="7062.25" />
            </Array>
          </mxGeometry>
        </mxCell>
        <mxCell id="0_Y_4YDWGghsoqahOQmA-48" value="&lt;span style=&quot;font-size: 10px;&quot;&gt;TELEFONO&lt;/span&gt;" style="ellipse;whiteSpace=wrap;html=1;labelBackgroundColor=none;" vertex="1" parent="1">
          <mxGeometry x="2231.25" y="7095.25" width="60" height="35" as="geometry" />
        </mxCell>
        <mxCell id="0_Y_4YDWGghsoqahOQmA-49" value="&lt;span style=&quot;font-size: 10px;&quot;&gt;CELLULARE&lt;/span&gt;" style="ellipse;whiteSpace=wrap;html=1;labelBackgroundColor=none;" vertex="1" parent="1">
          <mxGeometry x="2231.25" y="7130.25" width="60" height="35" as="geometry" />
        </mxCell>
        <mxCell id="0_Y_4YDWGghsoqahOQmA-50" value="&lt;span style=&quot;font-size: 10px;&quot;&gt;CV&lt;/span&gt;" style="ellipse;whiteSpace=wrap;html=1;labelBackgroundColor=none;" vertex="1" parent="1">
          <mxGeometry x="2231.25" y="7165.25" width="60" height="35" as="geometry" />
        </mxCell>
        <mxCell id="0_Y_4YDWGghsoqahOQmA-51" style="edgeStyle=orthogonalEdgeStyle;rounded=0;orthogonalLoop=1;jettySize=auto;html=1;entryX=0;entryY=1;entryDx=0;entryDy=0;endArrow=none;endFill=0;exitX=1;exitY=0.5;exitDx=0;exitDy=0;" edge="1" parent="1" source="0_Y_4YDWGghsoqahOQmA-50" target="0_Y_4YDWGghsoqahOQmA-11">
          <mxGeometry relative="1" as="geometry">
            <mxPoint x="2297.5" y="7182.25" as="sourcePoint" />
          </mxGeometry>
        </mxCell>
        <mxCell id="0_Y_4YDWGghsoqahOQmA-52" style="edgeStyle=orthogonalEdgeStyle;rounded=0;orthogonalLoop=1;jettySize=auto;html=1;endArrow=none;endFill=0;entryX=0.038;entryY=0.999;entryDx=0;entryDy=0;entryPerimeter=0;" edge="1" parent="1" source="0_Y_4YDWGghsoqahOQmA-49" target="0_Y_4YDWGghsoqahOQmA-11">
          <mxGeometry relative="1" as="geometry">
            <mxPoint x="2347.5" y="7072.25" as="targetPoint" />
            <Array as="points">
              <mxPoint x="2337.5" y="7158.25" />
              <mxPoint x="2337.5" y="7072.25" />
              <mxPoint x="2346.5" y="7072.25" />
            </Array>
          </mxGeometry>
        </mxCell>
        <mxCell id="0_Y_4YDWGghsoqahOQmA-53" style="edgeStyle=orthogonalEdgeStyle;rounded=0;orthogonalLoop=1;jettySize=auto;html=1;endArrow=none;endFill=0;" edge="1" parent="1" source="0_Y_4YDWGghsoqahOQmA-54" target="0_Y_4YDWGghsoqahOQmA-50">
          <mxGeometry relative="1" as="geometry" />
        </mxCell>
        <mxCell id="0_Y_4YDWGghsoqahOQmA-54" value="&lt;span style=&quot;font-size: 10px;&quot;&gt;PDF&lt;/span&gt;" style="ellipse;whiteSpace=wrap;html=1;labelBackgroundColor=none;" vertex="1" parent="1">
          <mxGeometry x="2130" y="7147.75" width="60" height="35" as="geometry" />
        </mxCell>
        <mxCell id="0_Y_4YDWGghsoqahOQmA-55" value="&lt;span style=&quot;font-size: 10px;&quot;&gt;TESTUALE&lt;/span&gt;" style="ellipse;whiteSpace=wrap;html=1;labelBackgroundColor=none;" vertex="1" parent="1">
          <mxGeometry x="2130" y="7182.75" width="60" height="35" as="geometry" />
        </mxCell>
        <mxCell id="0_Y_4YDWGghsoqahOQmA-56" style="edgeStyle=orthogonalEdgeStyle;rounded=0;orthogonalLoop=1;jettySize=auto;html=1;entryX=0.007;entryY=0.535;entryDx=0;entryDy=0;entryPerimeter=0;endArrow=none;endFill=0;" edge="1" parent="1" source="0_Y_4YDWGghsoqahOQmA-55" target="0_Y_4YDWGghsoqahOQmA-50">
          <mxGeometry relative="1" as="geometry" />
        </mxCell>
        <mxCell id="0_Y_4YDWGghsoqahOQmA-57" value="" style="edgeStyle=orthogonalEdgeStyle;rounded=0;orthogonalLoop=1;jettySize=auto;html=1;endArrow=none;endFill=0;" edge="1" parent="1" source="0_Y_4YDWGghsoqahOQmA-59" target="0_Y_4YDWGghsoqahOQmA-5">
          <mxGeometry relative="1" as="geometry" />
        </mxCell>
        <mxCell id="0_Y_4YDWGghsoqahOQmA-58" value="" style="edgeStyle=orthogonalEdgeStyle;rounded=0;orthogonalLoop=1;jettySize=auto;html=1;endArrow=none;endFill=0;" edge="1" parent="1" source="0_Y_4YDWGghsoqahOQmA-59" target="0_Y_4YDWGghsoqahOQmA-15">
          <mxGeometry relative="1" as="geometry" />
        </mxCell>
        <mxCell id="0_Y_4YDWGghsoqahOQmA-59" value="SCEGLIE" style="rhombus;whiteSpace=wrap;html=1;labelBackgroundColor=none;" vertex="1" parent="1">
          <mxGeometry x="2705" y="6882.25" width="80" height="80" as="geometry" />
        </mxCell>
        <mxCell id="0_Y_4YDWGghsoqahOQmA-396" style="edgeStyle=orthogonalEdgeStyle;rounded=0;orthogonalLoop=1;jettySize=auto;html=1;entryX=0.25;entryY=0;entryDx=0;entryDy=0;endArrow=none;endFill=0;" edge="1" parent="1" source="0_Y_4YDWGghsoqahOQmA-60" target="0_Y_4YDWGghsoqahOQmA-15">
          <mxGeometry relative="1" as="geometry" />
        </mxCell>
        <mxCell id="0_Y_4YDWGghsoqahOQmA-60" value="&lt;u&gt;&lt;font style=&quot;font-size: 10px;&quot;&gt;ID SKILL&lt;/font&gt;&lt;/u&gt;" style="ellipse;whiteSpace=wrap;html=1;labelBackgroundColor=none;" vertex="1" parent="1">
          <mxGeometry x="2660" y="6704.25" width="62.5" height="42" as="geometry" />
        </mxCell>
        <mxCell id="0_Y_4YDWGghsoqahOQmA-61" value="" style="edgeStyle=orthogonalEdgeStyle;rounded=0;orthogonalLoop=1;jettySize=auto;html=1;endArrow=none;endFill=0;" edge="1" parent="1" source="0_Y_4YDWGghsoqahOQmA-62" target="0_Y_4YDWGghsoqahOQmA-5">
          <mxGeometry relative="1" as="geometry">
            <Array as="points">
              <mxPoint x="2780.25" y="7072.25" />
              <mxPoint x="2780.25" y="7072.25" />
            </Array>
          </mxGeometry>
        </mxCell>
        <mxCell id="0_Y_4YDWGghsoqahOQmA-62" value="&lt;u&gt;&lt;font style=&quot;font-size: 10px;&quot;&gt;ID SVILUPPATORE&lt;/font&gt;&lt;/u&gt;" style="ellipse;whiteSpace=wrap;html=1;labelBackgroundColor=none;" vertex="1" parent="1">
          <mxGeometry x="2676.25" y="7088.25" width="62.5" height="42" as="geometry" />
        </mxCell>
        <mxCell id="0_Y_4YDWGghsoqahOQmA-63" value="&lt;span style=&quot;font-size: 10px;&quot;&gt;&lt;u&gt;ID GRAFICO&lt;/u&gt;&lt;/span&gt;" style="ellipse;whiteSpace=wrap;html=1;labelBackgroundColor=none;" vertex="1" parent="1">
          <mxGeometry x="2846.25" y="7270.25" width="62.5" height="42" as="geometry" />
        </mxCell>
        <mxCell id="0_Y_4YDWGghsoqahOQmA-64" value="" style="edgeStyle=orthogonalEdgeStyle;rounded=0;orthogonalLoop=1;jettySize=auto;html=1;endArrow=none;endFill=0;" edge="1" parent="1" source="0_Y_4YDWGghsoqahOQmA-65" target="0_Y_4YDWGghsoqahOQmA-14">
          <mxGeometry relative="1" as="geometry">
            <Array as="points">
              <mxPoint x="2741.25" y="7252.25" />
              <mxPoint x="2741.25" y="7252.25" />
            </Array>
          </mxGeometry>
        </mxCell>
        <mxCell id="0_Y_4YDWGghsoqahOQmA-65" value="&lt;span style=&quot;font-size: 10px;&quot;&gt;&lt;u&gt;ID COLLABORATORE&lt;/u&gt;&lt;/span&gt;" style="ellipse;whiteSpace=wrap;html=1;labelBackgroundColor=none;" vertex="1" parent="1">
          <mxGeometry x="2712.5" y="7270.25" width="62.5" height="42" as="geometry" />
        </mxCell>
        <mxCell id="0_Y_4YDWGghsoqahOQmA-66" value="" style="edgeStyle=orthogonalEdgeStyle;rounded=0;orthogonalLoop=1;jettySize=auto;html=1;endArrow=none;endFill=0;" edge="1" parent="1" source="0_Y_4YDWGghsoqahOQmA-67" target="0_Y_4YDWGghsoqahOQmA-13">
          <mxGeometry relative="1" as="geometry" />
        </mxCell>
        <mxCell id="0_Y_4YDWGghsoqahOQmA-67" value="&lt;span style=&quot;font-size: 10px;&quot;&gt;&lt;u&gt;ID COORDINATORE&lt;/u&gt;&lt;/span&gt;" style="ellipse;whiteSpace=wrap;html=1;labelBackgroundColor=none;" vertex="1" parent="1">
          <mxGeometry x="2581.25" y="7270.25" width="62.5" height="42" as="geometry" />
        </mxCell>
        <mxCell id="0_Y_4YDWGghsoqahOQmA-397" style="edgeStyle=orthogonalEdgeStyle;rounded=0;orthogonalLoop=1;jettySize=auto;html=1;entryX=0.75;entryY=0;entryDx=0;entryDy=0;endArrow=none;endFill=0;" edge="1" parent="1" source="0_Y_4YDWGghsoqahOQmA-68" target="0_Y_4YDWGghsoqahOQmA-15">
          <mxGeometry relative="1" as="geometry" />
        </mxCell>
        <mxCell id="0_Y_4YDWGghsoqahOQmA-68" value="&lt;font style=&quot;font-size: 10px;&quot;&gt;NOME SKILL&lt;/font&gt;" style="ellipse;whiteSpace=wrap;html=1;labelBackgroundColor=none;" vertex="1" parent="1">
          <mxGeometry x="2766.25" y="6704.25" width="62.5" height="42" as="geometry" />
        </mxCell>
        <mxCell id="0_Y_4YDWGghsoqahOQmA-69" value="1,N" style="text;html=1;align=center;verticalAlign=middle;resizable=0;points=[];autosize=1;strokeColor=none;fillColor=none;" vertex="1" parent="1">
          <mxGeometry x="2740.5" y="6990.25" width="40" height="30" as="geometry" />
        </mxCell>
        <mxCell id="0_Y_4YDWGghsoqahOQmA-70" value="N,1" style="text;html=1;align=center;verticalAlign=middle;resizable=0;points=[];autosize=1;strokeColor=none;fillColor=none;" vertex="1" parent="1">
          <mxGeometry x="2740.5" y="6832.25" width="40" height="30" as="geometry" />
        </mxCell>
        <mxCell id="0_Y_4YDWGghsoqahOQmA-71" value="CREAZIONE" style="rhombus;whiteSpace=wrap;html=1;labelBackgroundColor=none;" vertex="1" parent="1">
          <mxGeometry x="2990" y="6936.5" width="80" height="80" as="geometry" />
        </mxCell>
        <mxCell id="0_Y_4YDWGghsoqahOQmA-72" value="1,N" style="text;html=1;align=center;verticalAlign=middle;resizable=0;points=[];autosize=1;strokeColor=none;fillColor=none;" vertex="1" parent="1">
          <mxGeometry x="2788.75" y="6986.25" width="40" height="30" as="geometry" />
        </mxCell>
        <mxCell id="0_Y_4YDWGghsoqahOQmA-73" value="1,1" style="text;html=1;align=center;verticalAlign=middle;resizable=0;points=[];autosize=1;strokeColor=none;fillColor=none;" vertex="1" parent="1">
          <mxGeometry x="3200" y="6948.25" width="40" height="30" as="geometry" />
        </mxCell>
        <mxCell id="0_Y_4YDWGghsoqahOQmA-74" style="edgeStyle=orthogonalEdgeStyle;rounded=0;orthogonalLoop=1;jettySize=auto;html=1;entryX=0.5;entryY=0;entryDx=0;entryDy=0;endArrow=none;endFill=0;" edge="1" parent="1" source="0_Y_4YDWGghsoqahOQmA-76" target="0_Y_4YDWGghsoqahOQmA-10">
          <mxGeometry relative="1" as="geometry">
            <Array as="points">
              <mxPoint x="3290" y="7065" />
            </Array>
          </mxGeometry>
        </mxCell>
        <mxCell id="0_Y_4YDWGghsoqahOQmA-75" style="edgeStyle=orthogonalEdgeStyle;rounded=0;orthogonalLoop=1;jettySize=auto;html=1;endArrow=none;endFill=0;entryX=1;entryY=0.75;entryDx=0;entryDy=0;" edge="1" parent="1" source="0_Y_4YDWGghsoqahOQmA-76" target="0_Y_4YDWGghsoqahOQmA-5">
          <mxGeometry relative="1" as="geometry">
            <mxPoint x="2811.25" y="7056.5" as="targetPoint" />
            <Array as="points">
              <mxPoint x="2805.25" y="7065.25" />
            </Array>
          </mxGeometry>
        </mxCell>
        <mxCell id="0_Y_4YDWGghsoqahOQmA-76" value="STILA" style="rhombus;whiteSpace=wrap;html=1;labelBackgroundColor=none;" vertex="1" parent="1">
          <mxGeometry x="2990" y="7025.25" width="80" height="80" as="geometry" />
        </mxCell>
        <mxCell id="0_Y_4YDWGghsoqahOQmA-77" value="1,N" style="text;html=1;align=center;verticalAlign=middle;resizable=0;points=[];autosize=1;strokeColor=none;fillColor=none;" vertex="1" parent="1">
          <mxGeometry x="2798.75" y="7036.75" width="40" height="30" as="geometry" />
        </mxCell>
        <mxCell id="0_Y_4YDWGghsoqahOQmA-78" value="N,1" style="text;html=1;align=center;verticalAlign=middle;resizable=0;points=[];autosize=1;strokeColor=none;fillColor=none;" vertex="1" parent="1">
          <mxGeometry x="3257.97" y="7363.75" width="40" height="30" as="geometry" />
        </mxCell>
        <mxCell id="0_Y_4YDWGghsoqahOQmA-79" value="&lt;u&gt;&lt;font style=&quot;font-size: 10px;&quot;&gt;ID TASK&lt;/font&gt;&lt;/u&gt;" style="ellipse;whiteSpace=wrap;html=1;labelBackgroundColor=none;" vertex="1" parent="1">
          <mxGeometry x="3210" y="7454.25" width="62.5" height="42" as="geometry" />
        </mxCell>
        <mxCell id="0_Y_4YDWGghsoqahOQmA-406" style="edgeStyle=orthogonalEdgeStyle;rounded=0;orthogonalLoop=1;jettySize=auto;html=1;endArrow=none;endFill=0;entryX=0.62;entryY=-0.001;entryDx=0;entryDy=0;entryPerimeter=0;" edge="1" parent="1" source="0_Y_4YDWGghsoqahOQmA-80" target="0_Y_4YDWGghsoqahOQmA-8">
          <mxGeometry relative="1" as="geometry">
            <mxPoint x="3310" y="6945" as="targetPoint" />
            <Array as="points">
              <mxPoint x="3311" y="6925" />
            </Array>
          </mxGeometry>
        </mxCell>
        <mxCell id="0_Y_4YDWGghsoqahOQmA-80" value="&lt;u&gt;&lt;font style=&quot;font-size: 10px;&quot;&gt;ID PROGETTO&lt;/font&gt;&lt;/u&gt;" style="ellipse;whiteSpace=wrap;html=1;labelBackgroundColor=none;" vertex="1" parent="1">
          <mxGeometry x="3230" y="6904.25" width="62.5" height="42" as="geometry" />
        </mxCell>
        <mxCell id="0_Y_4YDWGghsoqahOQmA-81" value="&lt;font style=&quot;font-size: 10px;&quot;&gt;DESCRIZIONE&lt;/font&gt;" style="ellipse;whiteSpace=wrap;html=1;labelBackgroundColor=none;" vertex="1" parent="1">
          <mxGeometry x="3306.38" y="7454.25" width="62.5" height="42" as="geometry" />
        </mxCell>
        <mxCell id="0_Y_4YDWGghsoqahOQmA-82" value="&lt;font style=&quot;font-size: 10px;&quot;&gt;N COLLABORATORI&lt;/font&gt;" style="ellipse;whiteSpace=wrap;html=1;labelBackgroundColor=none;" vertex="1" parent="1">
          <mxGeometry x="3210" y="7496.25" width="62.5" height="42" as="geometry" />
        </mxCell>
        <mxCell id="0_Y_4YDWGghsoqahOQmA-83" value="&lt;font style=&quot;font-size: 10px;&quot;&gt;DATA INIZIO&lt;/font&gt;" style="ellipse;whiteSpace=wrap;html=1;labelBackgroundColor=none;" vertex="1" parent="1">
          <mxGeometry x="3210" y="7538.25" width="62.5" height="42" as="geometry" />
        </mxCell>
        <mxCell id="0_Y_4YDWGghsoqahOQmA-84" value="&lt;font style=&quot;font-size: 10px;&quot;&gt;DATA FINE&lt;/font&gt;" style="ellipse;whiteSpace=wrap;html=1;labelBackgroundColor=none;" vertex="1" parent="1">
          <mxGeometry x="3210" y="7580.25" width="62.5" height="42" as="geometry" />
        </mxCell>
        <mxCell id="0_Y_4YDWGghsoqahOQmA-85" value="&lt;font style=&quot;font-size: 10px;&quot;&gt;TIPOLOGIA&lt;/font&gt;" style="ellipse;whiteSpace=wrap;html=1;labelBackgroundColor=none;" vertex="1" parent="1">
          <mxGeometry x="3306.38" y="7496.25" width="62.5" height="42" as="geometry" />
        </mxCell>
        <mxCell id="0_Y_4YDWGghsoqahOQmA-86" value="&lt;font style=&quot;font-size: 10px;&quot;&gt;ELENCO SKILL&lt;/font&gt;" style="ellipse;whiteSpace=wrap;html=1;labelBackgroundColor=none;" vertex="1" parent="1">
          <mxGeometry x="3306.38" y="7538.25" width="62.5" height="42" as="geometry" />
        </mxCell>
        <mxCell id="0_Y_4YDWGghsoqahOQmA-87" value="&lt;font style=&quot;font-size: 10px;&quot;&gt;STATO DEL TASK&lt;/font&gt;" style="ellipse;whiteSpace=wrap;html=1;labelBackgroundColor=none;" vertex="1" parent="1">
          <mxGeometry x="3306.38" y="7580.25" width="62.5" height="42" as="geometry" />
        </mxCell>
        <mxCell id="0_Y_4YDWGghsoqahOQmA-88" style="edgeStyle=orthogonalEdgeStyle;rounded=0;orthogonalLoop=1;jettySize=auto;html=1;entryX=0;entryY=0.5;entryDx=0;entryDy=0;endArrow=none;endFill=0;" edge="1" parent="1" source="0_Y_4YDWGghsoqahOQmA-89" target="0_Y_4YDWGghsoqahOQmA-10">
          <mxGeometry relative="1" as="geometry">
            <Array as="points">
              <mxPoint x="3151" y="7178" />
              <mxPoint x="3151" y="7395" />
              <mxPoint x="3230" y="7395" />
            </Array>
          </mxGeometry>
        </mxCell>
        <mxCell id="0_Y_4YDWGghsoqahOQmA-89" value="COLLABORAZIONE" style="rhombus;whiteSpace=wrap;html=1;labelBackgroundColor=none;" vertex="1" parent="1">
          <mxGeometry x="3080" y="7138.25" width="80" height="80" as="geometry" />
        </mxCell>
        <mxCell id="0_Y_4YDWGghsoqahOQmA-90" style="edgeStyle=orthogonalEdgeStyle;rounded=0;orthogonalLoop=1;jettySize=auto;html=1;entryX=0.897;entryY=0.999;entryDx=0;entryDy=0;entryPerimeter=0;endArrow=none;endFill=0;" edge="1" parent="1" source="0_Y_4YDWGghsoqahOQmA-89" target="0_Y_4YDWGghsoqahOQmA-5">
          <mxGeometry relative="1" as="geometry">
            <Array as="points">
              <mxPoint x="3120" y="7122" />
              <mxPoint x="2793" y="7122" />
            </Array>
          </mxGeometry>
        </mxCell>
        <mxCell id="0_Y_4YDWGghsoqahOQmA-91" value="N,1" style="text;html=1;align=center;verticalAlign=middle;resizable=0;points=[];autosize=1;strokeColor=none;fillColor=none;" vertex="1" parent="1">
          <mxGeometry x="2788.75" y="7071.25" width="40" height="30" as="geometry" />
        </mxCell>
        <mxCell id="0_Y_4YDWGghsoqahOQmA-92" value="1,N" style="text;html=1;align=center;verticalAlign=middle;resizable=0;points=[];autosize=1;strokeColor=none;fillColor=none;" vertex="1" parent="1">
          <mxGeometry x="3190.75" y="7367.25" width="40" height="30" as="geometry" />
        </mxCell>
        <mxCell id="0_Y_4YDWGghsoqahOQmA-128" style="edgeStyle=orthogonalEdgeStyle;rounded=0;orthogonalLoop=1;jettySize=auto;html=1;entryX=0;entryY=1;entryDx=0;entryDy=0;endArrow=none;endFill=0;" edge="1" parent="1" source="0_Y_4YDWGghsoqahOQmA-93" target="0_Y_4YDWGghsoqahOQmA-10">
          <mxGeometry relative="1" as="geometry">
            <Array as="points">
              <mxPoint x="2842" y="7372" />
              <mxPoint x="2842" y="7445" />
              <mxPoint x="3230" y="7445" />
            </Array>
          </mxGeometry>
        </mxCell>
        <mxCell id="0_Y_4YDWGghsoqahOQmA-93" value="VALUTAZIONE" style="rhombus;whiteSpace=wrap;html=1;labelBackgroundColor=none;" vertex="1" parent="1">
          <mxGeometry x="2373.75" y="7332.25" width="80" height="80" as="geometry" />
        </mxCell>
        <mxCell id="0_Y_4YDWGghsoqahOQmA-94" value="ASSOCIAZIONE" style="rhombus;whiteSpace=wrap;html=1;labelBackgroundColor=none;" vertex="1" parent="1">
          <mxGeometry x="3463.7500000000005" y="7088.25" width="80" height="80" as="geometry" />
        </mxCell>
        <mxCell id="0_Y_4YDWGghsoqahOQmA-95" value="1,N" style="text;html=1;align=center;verticalAlign=middle;resizable=0;points=[];autosize=1;strokeColor=none;fillColor=none;" vertex="1" parent="1">
          <mxGeometry x="3356.25" y="6956.5" width="40" height="30" as="geometry" />
        </mxCell>
        <mxCell id="0_Y_4YDWGghsoqahOQmA-96" value="N,1" style="text;html=1;align=center;verticalAlign=middle;resizable=0;points=[];autosize=1;strokeColor=none;fillColor=none;" vertex="1" parent="1">
          <mxGeometry x="3310" y="7367.25" width="40" height="30" as="geometry" />
        </mxCell>
        <mxCell id="0_Y_4YDWGghsoqahOQmA-97" style="edgeStyle=orthogonalEdgeStyle;rounded=0;orthogonalLoop=1;jettySize=auto;html=1;entryX=1;entryY=0.5;entryDx=0;entryDy=0;endArrow=none;endFill=0;exitX=0.5;exitY=1;exitDx=0;exitDy=0;" edge="1" parent="1" source="0_Y_4YDWGghsoqahOQmA-98" target="0_Y_4YDWGghsoqahOQmA-10">
          <mxGeometry relative="1" as="geometry">
            <Array as="points">
              <mxPoint x="3630" y="7421" />
              <mxPoint x="3350" y="7421" />
            </Array>
            <mxPoint x="3426.3336363636367" y="7526.863636363636" as="sourcePoint" />
          </mxGeometry>
        </mxCell>
        <mxCell id="0_Y_4YDWGghsoqahOQmA-98" value="ASSOCIAZIONE" style="rhombus;whiteSpace=wrap;html=1;labelBackgroundColor=none;" vertex="1" parent="1">
          <mxGeometry x="3590.0000000000005" y="7381.25" width="80" height="80" as="geometry" />
        </mxCell>
        <mxCell id="0_Y_4YDWGghsoqahOQmA-99" value="1,N" style="text;html=1;align=center;verticalAlign=middle;resizable=0;points=[];autosize=1;strokeColor=none;fillColor=none;" vertex="1" parent="1">
          <mxGeometry x="3350" y="7397.75" width="40" height="30" as="geometry" />
        </mxCell>
        <mxCell id="0_Y_4YDWGghsoqahOQmA-100" value="N,1" style="text;html=1;align=center;verticalAlign=middle;resizable=0;points=[];autosize=1;strokeColor=none;fillColor=none;" vertex="1" parent="1">
          <mxGeometry x="3727.03" y="7397.25" width="40" height="30" as="geometry" />
        </mxCell>
        <mxCell id="0_Y_4YDWGghsoqahOQmA-408" style="edgeStyle=orthogonalEdgeStyle;rounded=0;orthogonalLoop=1;jettySize=auto;html=1;endArrow=none;endFill=0;entryX=0.697;entryY=0.004;entryDx=0;entryDy=0;entryPerimeter=0;" edge="1" parent="1" source="0_Y_4YDWGghsoqahOQmA-101" target="0_Y_4YDWGghsoqahOQmA-8">
          <mxGeometry relative="1" as="geometry">
            <mxPoint x="3320" y="6955" as="targetPoint" />
            <Array as="points">
              <mxPoint x="3320" y="6874" />
            </Array>
          </mxGeometry>
        </mxCell>
        <mxCell id="0_Y_4YDWGghsoqahOQmA-101" value="&lt;font style=&quot;font-size: 10px;&quot;&gt;NOME PROGETTO&lt;/font&gt;" style="ellipse;whiteSpace=wrap;html=1;labelBackgroundColor=none;" vertex="1" parent="1">
          <mxGeometry x="3230" y="6853.31" width="62.5" height="42" as="geometry" />
        </mxCell>
        <mxCell id="0_Y_4YDWGghsoqahOQmA-399" style="edgeStyle=orthogonalEdgeStyle;rounded=0;orthogonalLoop=1;jettySize=auto;html=1;endArrow=none;endFill=0;entryX=0.523;entryY=0.994;entryDx=0;entryDy=0;entryPerimeter=0;" edge="1" parent="1" source="0_Y_4YDWGghsoqahOQmA-103" target="0_Y_4YDWGghsoqahOQmA-18">
          <mxGeometry relative="1" as="geometry">
            <mxPoint x="3841" y="7446" as="targetPoint" />
            <Array as="points">
              <mxPoint x="3830" y="7487" />
              <mxPoint x="3830" y="7446" />
            </Array>
          </mxGeometry>
        </mxCell>
        <mxCell id="0_Y_4YDWGghsoqahOQmA-103" value="&lt;u&gt;&lt;font style=&quot;font-size: 10px;&quot;&gt;ID FILE&lt;/font&gt;&lt;/u&gt;" style="ellipse;whiteSpace=wrap;html=1;labelBackgroundColor=none;" vertex="1" parent="1">
          <mxGeometry x="3758.25" y="7466.25" width="62.5" height="42" as="geometry" />
        </mxCell>
        <mxCell id="0_Y_4YDWGghsoqahOQmA-400" style="edgeStyle=orthogonalEdgeStyle;rounded=0;orthogonalLoop=1;jettySize=auto;html=1;endArrow=none;endFill=0;entryX=0.691;entryY=0.992;entryDx=0;entryDy=0;entryPerimeter=0;" edge="1" parent="1" source="0_Y_4YDWGghsoqahOQmA-104" target="0_Y_4YDWGghsoqahOQmA-18">
          <mxGeometry relative="1" as="geometry">
            <mxPoint x="3840" y="7455" as="targetPoint" />
            <Array as="points">
              <mxPoint x="3850" y="7529" />
            </Array>
          </mxGeometry>
        </mxCell>
        <mxCell id="0_Y_4YDWGghsoqahOQmA-104" value="&lt;font style=&quot;font-size: 10px;&quot;&gt;NOME&lt;/font&gt;" style="ellipse;whiteSpace=wrap;html=1;labelBackgroundColor=none;" vertex="1" parent="1">
          <mxGeometry x="3758.25" y="7508.25" width="62.5" height="42" as="geometry" />
        </mxCell>
        <mxCell id="0_Y_4YDWGghsoqahOQmA-401" style="edgeStyle=orthogonalEdgeStyle;rounded=0;orthogonalLoop=1;jettySize=auto;html=1;endArrow=none;endFill=0;entryX=0.773;entryY=0.987;entryDx=0;entryDy=0;entryPerimeter=0;" edge="1" parent="1" source="0_Y_4YDWGghsoqahOQmA-105" target="0_Y_4YDWGghsoqahOQmA-18">
          <mxGeometry relative="1" as="geometry">
            <mxPoint x="3850" y="7455" as="targetPoint" />
            <Array as="points">
              <mxPoint x="3860" y="7571" />
              <mxPoint x="3860" y="7455" />
              <mxPoint x="3860" y="7455" />
            </Array>
          </mxGeometry>
        </mxCell>
        <mxCell id="0_Y_4YDWGghsoqahOQmA-105" value="&lt;font style=&quot;font-size: 10px;&quot;&gt;TIPOLOGIA&lt;/font&gt;" style="ellipse;whiteSpace=wrap;html=1;labelBackgroundColor=none;" vertex="1" parent="1">
          <mxGeometry x="3758.25" y="7550.25" width="62.5" height="42" as="geometry" />
        </mxCell>
        <mxCell id="0_Y_4YDWGghsoqahOQmA-402" style="edgeStyle=orthogonalEdgeStyle;rounded=0;orthogonalLoop=1;jettySize=auto;html=1;endArrow=none;endFill=0;entryX=0.861;entryY=1.006;entryDx=0;entryDy=0;entryPerimeter=0;" edge="1" parent="1" source="0_Y_4YDWGghsoqahOQmA-106" target="0_Y_4YDWGghsoqahOQmA-18">
          <mxGeometry relative="1" as="geometry">
            <mxPoint x="3860" y="7455" as="targetPoint" />
            <Array as="points">
              <mxPoint x="3870" y="7613" />
              <mxPoint x="3870" y="7455" />
              <mxPoint x="3870" y="7455" />
            </Array>
          </mxGeometry>
        </mxCell>
        <mxCell id="0_Y_4YDWGghsoqahOQmA-106" value="DATA ULTIMA MODIFICA" style="ellipse;whiteSpace=wrap;html=1;labelBackgroundColor=none;" vertex="1" parent="1">
          <mxGeometry x="3758.25" y="7592.25" width="62.5" height="42" as="geometry" />
        </mxCell>
        <mxCell id="0_Y_4YDWGghsoqahOQmA-107" value="" style="edgeStyle=orthogonalEdgeStyle;rounded=0;orthogonalLoop=1;jettySize=auto;html=1;endArrow=none;endFill=0;" edge="1" parent="1" source="0_Y_4YDWGghsoqahOQmA-108" target="0_Y_4YDWGghsoqahOQmA-106">
          <mxGeometry relative="1" as="geometry" />
        </mxCell>
        <mxCell id="0_Y_4YDWGghsoqahOQmA-108" value="UTENTE ULTIMA MODIFICA" style="ellipse;whiteSpace=wrap;html=1;labelBackgroundColor=none;" vertex="1" parent="1">
          <mxGeometry x="3642" y="7592.25" width="62.5" height="42" as="geometry" />
        </mxCell>
        <mxCell id="0_Y_4YDWGghsoqahOQmA-109" value="&lt;font style=&quot;font-size: 10px;&quot;&gt;CONTENUTO&lt;/font&gt;" style="ellipse;whiteSpace=wrap;html=1;labelBackgroundColor=none;" vertex="1" parent="1">
          <mxGeometry x="3758.25" y="7634.25" width="62.5" height="42" as="geometry" />
        </mxCell>
        <mxCell id="0_Y_4YDWGghsoqahOQmA-116" style="edgeStyle=orthogonalEdgeStyle;rounded=0;orthogonalLoop=1;jettySize=auto;html=1;entryX=0.5;entryY=1;entryDx=0;entryDy=0;endArrow=none;endFill=0;" edge="1" parent="1" source="0_Y_4YDWGghsoqahOQmA-118" target="0_Y_4YDWGghsoqahOQmA-19">
          <mxGeometry relative="1" as="geometry" />
        </mxCell>
        <mxCell id="0_Y_4YDWGghsoqahOQmA-117" style="edgeStyle=orthogonalEdgeStyle;rounded=0;orthogonalLoop=1;jettySize=auto;html=1;entryX=1;entryY=0;entryDx=0;entryDy=0;endArrow=none;endFill=0;" edge="1" parent="1" source="0_Y_4YDWGghsoqahOQmA-118" target="0_Y_4YDWGghsoqahOQmA-8">
          <mxGeometry relative="1" as="geometry" />
        </mxCell>
        <mxCell id="0_Y_4YDWGghsoqahOQmA-118" value="POSTARE" style="rhombus;whiteSpace=wrap;html=1;labelBackgroundColor=none;" vertex="1" parent="1">
          <mxGeometry x="3464.2500000000005" y="6782.25" width="80" height="80" as="geometry" />
        </mxCell>
        <mxCell id="0_Y_4YDWGghsoqahOQmA-409" style="edgeStyle=orthogonalEdgeStyle;rounded=0;orthogonalLoop=1;jettySize=auto;html=1;entryX=0;entryY=0;entryDx=0;entryDy=0;endArrow=none;endFill=0;" edge="1" parent="1" source="0_Y_4YDWGghsoqahOQmA-119" target="0_Y_4YDWGghsoqahOQmA-19">
          <mxGeometry relative="1" as="geometry" />
        </mxCell>
        <mxCell id="0_Y_4YDWGghsoqahOQmA-119" value="&lt;span style=&quot;font-size: 10px;&quot;&gt;&lt;u&gt;ID MESSAGGIO&lt;/u&gt;&lt;/span&gt;" style="ellipse;whiteSpace=wrap;html=1;labelBackgroundColor=none;" vertex="1" parent="1">
          <mxGeometry x="3401.75" y="6529" width="62.5" height="42" as="geometry" />
        </mxCell>
        <mxCell id="0_Y_4YDWGghsoqahOQmA-410" style="edgeStyle=orthogonalEdgeStyle;rounded=0;orthogonalLoop=1;jettySize=auto;html=1;entryX=1;entryY=0;entryDx=0;entryDy=0;endArrow=none;endFill=0;" edge="1" parent="1" source="0_Y_4YDWGghsoqahOQmA-120" target="0_Y_4YDWGghsoqahOQmA-19">
          <mxGeometry relative="1" as="geometry" />
        </mxCell>
        <mxCell id="0_Y_4YDWGghsoqahOQmA-120" value="&lt;span style=&quot;font-size: 10px;&quot;&gt;STATO MESSAGGIO&lt;/span&gt;" style="ellipse;whiteSpace=wrap;html=1;labelBackgroundColor=none;" vertex="1" parent="1">
          <mxGeometry x="3543.75" y="6529" width="62.5" height="42" as="geometry" />
        </mxCell>
        <mxCell id="0_Y_4YDWGghsoqahOQmA-412" style="edgeStyle=orthogonalEdgeStyle;rounded=0;orthogonalLoop=1;jettySize=auto;html=1;entryX=0.75;entryY=0;entryDx=0;entryDy=0;endArrow=none;endFill=0;" edge="1" parent="1" source="0_Y_4YDWGghsoqahOQmA-121" target="0_Y_4YDWGghsoqahOQmA-19">
          <mxGeometry relative="1" as="geometry">
            <Array as="points">
              <mxPoint x="3534" y="6508" />
              <mxPoint x="3534" y="6566" />
            </Array>
          </mxGeometry>
        </mxCell>
        <mxCell id="0_Y_4YDWGghsoqahOQmA-121" value="&lt;span style=&quot;font-size: 10px;&quot;&gt;TIPOLOGIA&lt;/span&gt;" style="ellipse;whiteSpace=wrap;html=1;labelBackgroundColor=none;" vertex="1" parent="1">
          <mxGeometry x="3543.75" y="6487" width="62.5" height="42" as="geometry" />
        </mxCell>
        <mxCell id="0_Y_4YDWGghsoqahOQmA-122" value="1,N" style="text;html=1;align=center;verticalAlign=middle;resizable=0;points=[];autosize=1;strokeColor=none;fillColor=none;" vertex="1" parent="1">
          <mxGeometry x="3318" y="6926.5" width="40" height="30" as="geometry" />
        </mxCell>
        <mxCell id="0_Y_4YDWGghsoqahOQmA-123" value="N,1" style="text;html=1;align=center;verticalAlign=middle;resizable=0;points=[];autosize=1;strokeColor=none;fillColor=none;" vertex="1" parent="1">
          <mxGeometry x="3466.25" y="6662.25" width="40" height="30" as="geometry" />
        </mxCell>
        <mxCell id="0_Y_4YDWGghsoqahOQmA-125" value="&lt;span style=&quot;font-size: 10px;&quot;&gt;TESTO&lt;/span&gt;" style="ellipse;whiteSpace=wrap;html=1;labelBackgroundColor=none;" vertex="1" parent="1">
          <mxGeometry x="3401.75" y="6487" width="62.5" height="42" as="geometry" />
        </mxCell>
        <mxCell id="0_Y_4YDWGghsoqahOQmA-413" style="edgeStyle=orthogonalEdgeStyle;rounded=0;orthogonalLoop=1;jettySize=auto;html=1;entryX=0.5;entryY=0;entryDx=0;entryDy=0;endArrow=none;endFill=0;" edge="1" parent="1" source="0_Y_4YDWGghsoqahOQmA-126" target="0_Y_4YDWGghsoqahOQmA-19">
          <mxGeometry relative="1" as="geometry">
            <Array as="points">
              <mxPoint x="3504" y="6466" />
              <mxPoint x="3504" y="6545" />
            </Array>
          </mxGeometry>
        </mxCell>
        <mxCell id="0_Y_4YDWGghsoqahOQmA-126" value="&lt;span style=&quot;font-size: 10px;&quot;&gt;AUTORE&lt;/span&gt;" style="ellipse;whiteSpace=wrap;html=1;labelBackgroundColor=none;" vertex="1" parent="1">
          <mxGeometry x="3401.75" y="6445" width="62.5" height="42" as="geometry" />
        </mxCell>
        <mxCell id="0_Y_4YDWGghsoqahOQmA-127" value="&lt;font style=&quot;font-size: 10px;&quot;&gt;VALUTAZIONE&lt;/font&gt;" style="ellipse;whiteSpace=wrap;html=1;labelBackgroundColor=none;" vertex="1" parent="1">
          <mxGeometry x="3307.13" y="7622.25" width="62.5" height="42" as="geometry" />
        </mxCell>
        <mxCell id="0_Y_4YDWGghsoqahOQmA-129" value="1,N" style="text;html=1;align=center;verticalAlign=middle;resizable=0;points=[];autosize=1;strokeColor=none;fillColor=none;" vertex="1" parent="1">
          <mxGeometry x="2632.5" y="7058.25" width="40" height="30" as="geometry" />
        </mxCell>
        <mxCell id="0_Y_4YDWGghsoqahOQmA-130" value="N,1" style="text;html=1;align=center;verticalAlign=middle;resizable=0;points=[];autosize=1;strokeColor=none;fillColor=none;" vertex="1" parent="1">
          <mxGeometry x="3190.75" y="7416.25" width="40" height="30" as="geometry" />
        </mxCell>
        <mxCell id="0_Y_4YDWGghsoqahOQmA-241" style="edgeStyle=orthogonalEdgeStyle;rounded=0;orthogonalLoop=1;jettySize=auto;html=1;entryX=0;entryY=0.5;entryDx=0;entryDy=0;endArrow=none;endFill=0;" edge="1" parent="1" source="0_Y_4YDWGghsoqahOQmA-243" target="0_Y_4YDWGghsoqahOQmA-296">
          <mxGeometry relative="1" as="geometry">
            <Array as="points">
              <mxPoint x="4812" y="7096" />
              <mxPoint x="4870" y="7096" />
              <mxPoint x="4870" y="7061" />
            </Array>
          </mxGeometry>
        </mxCell>
        <mxCell id="0_Y_4YDWGghsoqahOQmA-351" style="edgeStyle=orthogonalEdgeStyle;rounded=0;orthogonalLoop=1;jettySize=auto;html=1;entryX=0.5;entryY=1;entryDx=0;entryDy=0;endArrow=none;endFill=0;" edge="1" parent="1" source="0_Y_4YDWGghsoqahOQmA-243" target="0_Y_4YDWGghsoqahOQmA-349">
          <mxGeometry relative="1" as="geometry">
            <mxPoint x="4811.88" y="7016.25" as="targetPoint" />
          </mxGeometry>
        </mxCell>
        <mxCell id="0_Y_4YDWGghsoqahOQmA-360" style="edgeStyle=orthogonalEdgeStyle;rounded=0;orthogonalLoop=1;jettySize=auto;html=1;entryX=0.5;entryY=0;entryDx=0;entryDy=0;endArrow=none;endFill=0;" edge="1" parent="1" source="0_Y_4YDWGghsoqahOQmA-243" target="0_Y_4YDWGghsoqahOQmA-359">
          <mxGeometry relative="1" as="geometry">
            <Array as="points">
              <mxPoint x="4661" y="7125" />
            </Array>
          </mxGeometry>
        </mxCell>
        <mxCell id="0_Y_4YDWGghsoqahOQmA-387" style="edgeStyle=orthogonalEdgeStyle;rounded=0;orthogonalLoop=1;jettySize=auto;html=1;entryX=0;entryY=0.5;entryDx=0;entryDy=0;endArrow=none;endFill=0;" edge="1" parent="1" source="0_Y_4YDWGghsoqahOQmA-243" target="0_Y_4YDWGghsoqahOQmA-319">
          <mxGeometry relative="1" as="geometry">
            <Array as="points">
              <mxPoint x="4867" y="7269" />
            </Array>
          </mxGeometry>
        </mxCell>
        <mxCell id="0_Y_4YDWGghsoqahOQmA-243" value="SVILUPPATORE" style="rounded=0;whiteSpace=wrap;html=1;labelBackgroundColor=none;" vertex="1" parent="1">
          <mxGeometry x="4751.88" y="7096.75" width="120" height="60" as="geometry" />
        </mxCell>
        <mxCell id="0_Y_4YDWGghsoqahOQmA-244" style="edgeStyle=orthogonalEdgeStyle;rounded=0;orthogonalLoop=1;jettySize=auto;html=1;entryX=1;entryY=0.5;entryDx=0;entryDy=0;endArrow=none;endFill=0;" edge="1" parent="1" source="0_Y_4YDWGghsoqahOQmA-246" target="0_Y_4YDWGghsoqahOQmA-296">
          <mxGeometry relative="1" as="geometry">
            <Array as="points">
              <mxPoint x="5220.38" y="7060" />
            </Array>
          </mxGeometry>
        </mxCell>
        <mxCell id="0_Y_4YDWGghsoqahOQmA-368" style="edgeStyle=orthogonalEdgeStyle;rounded=0;orthogonalLoop=1;jettySize=auto;html=1;endArrow=none;endFill=0;" edge="1" parent="1" source="0_Y_4YDWGghsoqahOQmA-246" target="0_Y_4YDWGghsoqahOQmA-301">
          <mxGeometry relative="1" as="geometry" />
        </mxCell>
        <mxCell id="0_Y_4YDWGghsoqahOQmA-246" value="PROGETTO" style="rounded=0;whiteSpace=wrap;html=1;labelBackgroundColor=none;" vertex="1" parent="1">
          <mxGeometry x="5303.13" y="7040.5" width="120" height="60" as="geometry" />
        </mxCell>
        <mxCell id="0_Y_4YDWGghsoqahOQmA-248" value="TASK" style="rounded=0;whiteSpace=wrap;html=1;labelBackgroundColor=none;" vertex="1" parent="1">
          <mxGeometry x="5319.88" y="7356.25" width="120" height="60" as="geometry" />
        </mxCell>
        <mxCell id="0_Y_4YDWGghsoqahOQmA-371" style="edgeStyle=orthogonalEdgeStyle;rounded=0;orthogonalLoop=1;jettySize=auto;html=1;entryX=0;entryY=0.5;entryDx=0;entryDy=0;endArrow=none;endFill=0;" edge="1" parent="1" source="0_Y_4YDWGghsoqahOQmA-253" target="0_Y_4YDWGghsoqahOQmA-370">
          <mxGeometry relative="1" as="geometry" />
        </mxCell>
        <mxCell id="0_Y_4YDWGghsoqahOQmA-253" value="SKILL" style="rounded=0;whiteSpace=wrap;html=1;labelBackgroundColor=none;" vertex="1" parent="1">
          <mxGeometry x="4750.63" y="7536.75" width="120" height="60" as="geometry" />
        </mxCell>
        <mxCell id="0_Y_4YDWGghsoqahOQmA-254" value="" style="edgeStyle=orthogonalEdgeStyle;rounded=0;orthogonalLoop=1;jettySize=auto;html=1;endArrow=none;endFill=0;" edge="1" parent="1" source="0_Y_4YDWGghsoqahOQmA-255" target="0_Y_4YDWGghsoqahOQmA-324">
          <mxGeometry relative="1" as="geometry" />
        </mxCell>
        <mxCell id="0_Y_4YDWGghsoqahOQmA-255" value="FILE" style="rounded=0;whiteSpace=wrap;html=1;labelBackgroundColor=none;" vertex="1" parent="1">
          <mxGeometry x="5973.25" y="7356.25" width="120" height="60" as="geometry" />
        </mxCell>
        <mxCell id="0_Y_4YDWGghsoqahOQmA-256" value="MESSAGGIO" style="rounded=0;whiteSpace=wrap;html=1;labelBackgroundColor=none;" vertex="1" parent="1">
          <mxGeometry x="5510.63" y="6686.25" width="120" height="60" as="geometry" />
        </mxCell>
        <mxCell id="0_Y_4YDWGghsoqahOQmA-258" value="&lt;font style=&quot;font-size: 10px;&quot;&gt;NOME&lt;/font&gt;" style="ellipse;whiteSpace=wrap;html=1;labelBackgroundColor=none;" vertex="1" parent="1">
          <mxGeometry x="4648.75" y="6691.0599999999995" width="62.5" height="42" as="geometry" />
        </mxCell>
        <mxCell id="0_Y_4YDWGghsoqahOQmA-263" value="&lt;font style=&quot;font-size: 10px;&quot;&gt;COGNOME&lt;/font&gt;" style="ellipse;whiteSpace=wrap;html=1;labelBackgroundColor=none;" vertex="1" parent="1">
          <mxGeometry x="4648.75" y="6733.0599999999995" width="62.5" height="42" as="geometry" />
        </mxCell>
        <mxCell id="0_Y_4YDWGghsoqahOQmA-265" value="&lt;font style=&quot;font-size: 10px;&quot;&gt;CF&lt;/font&gt;" style="ellipse;whiteSpace=wrap;html=1;labelBackgroundColor=none;" vertex="1" parent="1">
          <mxGeometry x="4648.75" y="6649.0599999999995" width="62.5" height="42" as="geometry" />
        </mxCell>
        <mxCell id="0_Y_4YDWGghsoqahOQmA-267" value="&lt;span style=&quot;font-size: 10px;&quot;&gt;DATA DI NASCITA&lt;/span&gt;" style="ellipse;whiteSpace=wrap;html=1;labelBackgroundColor=none;" vertex="1" parent="1">
          <mxGeometry x="4651.25" y="6775.0599999999995" width="60" height="35" as="geometry" />
        </mxCell>
        <mxCell id="0_Y_4YDWGghsoqahOQmA-269" value="&lt;span style=&quot;font-size: 10px;&quot;&gt;INDIRIZZO RESIDENZA&lt;/span&gt;" style="ellipse;whiteSpace=wrap;html=1;labelBackgroundColor=none;" vertex="1" parent="1">
          <mxGeometry x="4651.25" y="6810.0599999999995" width="60" height="35" as="geometry" />
        </mxCell>
        <mxCell id="0_Y_4YDWGghsoqahOQmA-271" value="&lt;span style=&quot;font-size: 10px;&quot;&gt;EMAIL&lt;/span&gt;" style="ellipse;whiteSpace=wrap;html=1;labelBackgroundColor=none;" vertex="1" parent="1">
          <mxGeometry x="4781.25" y="6739.3099999999995" width="60" height="35" as="geometry" />
        </mxCell>
        <mxCell id="0_Y_4YDWGghsoqahOQmA-273" value="&lt;span style=&quot;font-size: 10px;&quot;&gt;TELEFONO&lt;/span&gt;" style="ellipse;whiteSpace=wrap;html=1;labelBackgroundColor=none;" vertex="1" parent="1">
          <mxGeometry x="4781.25" y="6774.3099999999995" width="60" height="35" as="geometry" />
        </mxCell>
        <mxCell id="0_Y_4YDWGghsoqahOQmA-274" value="&lt;span style=&quot;font-size: 10px;&quot;&gt;CELLULARE&lt;/span&gt;" style="ellipse;whiteSpace=wrap;html=1;labelBackgroundColor=none;" vertex="1" parent="1">
          <mxGeometry x="4781.25" y="6809.3099999999995" width="60" height="35" as="geometry" />
        </mxCell>
        <mxCell id="0_Y_4YDWGghsoqahOQmA-279" value="&lt;span style=&quot;font-size: 10px;&quot;&gt;PDF&lt;/span&gt;" style="ellipse;whiteSpace=wrap;html=1;labelBackgroundColor=none;" vertex="1" parent="1">
          <mxGeometry x="4881.25" y="6805.5599999999995" width="60" height="35" as="geometry" />
        </mxCell>
        <mxCell id="0_Y_4YDWGghsoqahOQmA-280" value="&lt;span style=&quot;font-size: 10px;&quot;&gt;TESTUALE&lt;/span&gt;" style="ellipse;whiteSpace=wrap;html=1;labelBackgroundColor=none;" vertex="1" parent="1">
          <mxGeometry x="4943.75" y="6805.5599999999995" width="60" height="35" as="geometry" />
        </mxCell>
        <mxCell id="0_Y_4YDWGghsoqahOQmA-285" value="&lt;u&gt;&lt;font style=&quot;font-size: 10px;&quot;&gt;ID SKILL&lt;/font&gt;&lt;/u&gt;" style="ellipse;whiteSpace=wrap;html=1;labelBackgroundColor=none;" vertex="1" parent="1">
          <mxGeometry x="4749.38" y="7596.75" width="62.5" height="42" as="geometry" />
        </mxCell>
        <mxCell id="0_Y_4YDWGghsoqahOQmA-286" value="" style="edgeStyle=orthogonalEdgeStyle;rounded=0;orthogonalLoop=1;jettySize=auto;html=1;endArrow=none;endFill=0;" edge="1" parent="1" source="0_Y_4YDWGghsoqahOQmA-287" target="0_Y_4YDWGghsoqahOQmA-243">
          <mxGeometry relative="1" as="geometry">
            <Array as="points">
              <mxPoint x="4847.13" y="7156.25" />
              <mxPoint x="4847.13" y="7156.25" />
            </Array>
          </mxGeometry>
        </mxCell>
        <mxCell id="0_Y_4YDWGghsoqahOQmA-287" value="&lt;u&gt;&lt;font style=&quot;font-size: 10px;&quot;&gt;ID SVILUPPATORE&lt;/font&gt;&lt;/u&gt;" style="ellipse;whiteSpace=wrap;html=1;labelBackgroundColor=none;" vertex="1" parent="1">
          <mxGeometry x="4744.38" y="7176.25" width="62.5" height="42" as="geometry" />
        </mxCell>
        <mxCell id="0_Y_4YDWGghsoqahOQmA-293" value="&lt;font style=&quot;font-size: 10px;&quot;&gt;NOME SKILL&lt;/font&gt;" style="ellipse;whiteSpace=wrap;html=1;labelBackgroundColor=none;" vertex="1" parent="1">
          <mxGeometry x="4811.88" y="7596.75" width="62.5" height="42" as="geometry" />
        </mxCell>
        <mxCell id="0_Y_4YDWGghsoqahOQmA-296" value="CREAZIONE" style="rhombus;whiteSpace=wrap;html=1;labelBackgroundColor=none;" vertex="1" parent="1">
          <mxGeometry x="5056.88" y="7020.5" width="80" height="80" as="geometry" />
        </mxCell>
        <mxCell id="0_Y_4YDWGghsoqahOQmA-297" value="1,N" style="text;html=1;align=center;verticalAlign=middle;resizable=0;points=[];autosize=1;strokeColor=none;fillColor=none;" vertex="1" parent="1">
          <mxGeometry x="4865.63" y="7066.75" width="40" height="30" as="geometry" />
        </mxCell>
        <mxCell id="0_Y_4YDWGghsoqahOQmA-298" value="1,1" style="text;html=1;align=center;verticalAlign=middle;resizable=0;points=[];autosize=1;strokeColor=none;fillColor=none;" vertex="1" parent="1">
          <mxGeometry x="5271.38" y="7036.75" width="40" height="30" as="geometry" />
        </mxCell>
        <mxCell id="0_Y_4YDWGghsoqahOQmA-299" style="edgeStyle=orthogonalEdgeStyle;rounded=0;orthogonalLoop=1;jettySize=auto;html=1;entryX=0.5;entryY=0;entryDx=0;entryDy=0;endArrow=none;endFill=0;" edge="1" parent="1" source="0_Y_4YDWGghsoqahOQmA-301" target="0_Y_4YDWGghsoqahOQmA-248">
          <mxGeometry relative="1" as="geometry">
            <Array as="points">
              <mxPoint x="5440" y="7208" />
              <mxPoint x="5440" y="7356" />
            </Array>
          </mxGeometry>
        </mxCell>
        <mxCell id="0_Y_4YDWGghsoqahOQmA-300" style="edgeStyle=orthogonalEdgeStyle;rounded=0;orthogonalLoop=1;jettySize=auto;html=1;endArrow=none;endFill=0;entryX=1;entryY=0.75;entryDx=0;entryDy=0;" edge="1" parent="1" source="0_Y_4YDWGghsoqahOQmA-415" target="0_Y_4YDWGghsoqahOQmA-243">
          <mxGeometry relative="1" as="geometry">
            <mxPoint x="4878.13" y="7140.5" as="targetPoint" />
            <Array as="points">
              <mxPoint x="4872" y="7125" />
            </Array>
            <mxPoint x="5390" y="7355" as="sourcePoint" />
          </mxGeometry>
        </mxCell>
        <mxCell id="0_Y_4YDWGghsoqahOQmA-301" value="ASSOCIA" style="rhombus;whiteSpace=wrap;html=1;labelBackgroundColor=none;" vertex="1" parent="1">
          <mxGeometry x="5453.13" y="7168.25" width="80" height="80" as="geometry" />
        </mxCell>
        <mxCell id="0_Y_4YDWGghsoqahOQmA-302" value="1,N" style="text;html=1;align=center;verticalAlign=middle;resizable=0;points=[];autosize=1;strokeColor=none;fillColor=none;" vertex="1" parent="1">
          <mxGeometry x="4865.63" y="7117.75" width="40" height="30" as="geometry" />
        </mxCell>
        <mxCell id="0_Y_4YDWGghsoqahOQmA-304" value="&lt;u&gt;&lt;font style=&quot;font-size: 10px;&quot;&gt;ID TASK&lt;/font&gt;&lt;/u&gt;" style="ellipse;whiteSpace=wrap;html=1;labelBackgroundColor=none;" vertex="1" parent="1">
          <mxGeometry x="5386.88" y="7416.25" width="62.5" height="42" as="geometry" />
        </mxCell>
        <mxCell id="0_Y_4YDWGghsoqahOQmA-305" value="&lt;u&gt;&lt;font style=&quot;font-size: 10px;&quot;&gt;ID PROGETTO&lt;/font&gt;&lt;/u&gt;" style="ellipse;whiteSpace=wrap;html=1;labelBackgroundColor=none;" vertex="1" parent="1">
          <mxGeometry x="5296.88" y="6994.75" width="62.5" height="42" as="geometry" />
        </mxCell>
        <mxCell id="0_Y_4YDWGghsoqahOQmA-306" value="&lt;font style=&quot;font-size: 10px;&quot;&gt;DESCRIZIONE&lt;/font&gt;" style="ellipse;whiteSpace=wrap;html=1;labelBackgroundColor=none;" vertex="1" parent="1">
          <mxGeometry x="5386.88" y="7584.25" width="62.5" height="42" as="geometry" />
        </mxCell>
        <mxCell id="0_Y_4YDWGghsoqahOQmA-307" value="&lt;font style=&quot;font-size: 10px;&quot;&gt;N COLLABORATORI&lt;/font&gt;" style="ellipse;whiteSpace=wrap;html=1;labelBackgroundColor=none;" vertex="1" parent="1">
          <mxGeometry x="5386.88" y="7458.25" width="62.5" height="42" as="geometry" />
        </mxCell>
        <mxCell id="0_Y_4YDWGghsoqahOQmA-308" value="&lt;font style=&quot;font-size: 10px;&quot;&gt;DATA INIZIO&lt;/font&gt;" style="ellipse;whiteSpace=wrap;html=1;labelBackgroundColor=none;" vertex="1" parent="1">
          <mxGeometry x="5386.88" y="7500.25" width="62.5" height="42" as="geometry" />
        </mxCell>
        <mxCell id="0_Y_4YDWGghsoqahOQmA-309" value="&lt;font style=&quot;font-size: 10px;&quot;&gt;DATA FINE&lt;/font&gt;" style="ellipse;whiteSpace=wrap;html=1;labelBackgroundColor=none;" vertex="1" parent="1">
          <mxGeometry x="5386.88" y="7542.25" width="62.5" height="42" as="geometry" />
        </mxCell>
        <mxCell id="0_Y_4YDWGghsoqahOQmA-312" value="&lt;font style=&quot;font-size: 10px;&quot;&gt;STATO DEL TASK&lt;/font&gt;" style="ellipse;whiteSpace=wrap;html=1;labelBackgroundColor=none;" vertex="1" parent="1">
          <mxGeometry x="5386.88" y="7626.25" width="62.5" height="42" as="geometry" />
        </mxCell>
        <mxCell id="0_Y_4YDWGghsoqahOQmA-313" style="edgeStyle=orthogonalEdgeStyle;rounded=0;orthogonalLoop=1;jettySize=auto;html=1;entryX=0;entryY=0.5;entryDx=0;entryDy=0;endArrow=none;endFill=0;" edge="1" parent="1" source="0_Y_4YDWGghsoqahOQmA-314" target="0_Y_4YDWGghsoqahOQmA-248">
          <mxGeometry relative="1" as="geometry">
            <Array as="points">
              <mxPoint x="5097" y="7385" />
              <mxPoint x="5320" y="7385" />
            </Array>
          </mxGeometry>
        </mxCell>
        <mxCell id="0_Y_4YDWGghsoqahOQmA-314" value="COLLABORAZIONE" style="rhombus;whiteSpace=wrap;html=1;labelBackgroundColor=none;" vertex="1" parent="1">
          <mxGeometry x="5056.88" y="7393.75" width="80" height="80" as="geometry" />
        </mxCell>
        <mxCell id="0_Y_4YDWGghsoqahOQmA-315" style="edgeStyle=orthogonalEdgeStyle;rounded=0;orthogonalLoop=1;jettySize=auto;html=1;entryX=0.897;entryY=0.999;entryDx=0;entryDy=0;entryPerimeter=0;endArrow=none;endFill=0;" edge="1" parent="1" source="0_Y_4YDWGghsoqahOQmA-314" target="0_Y_4YDWGghsoqahOQmA-243">
          <mxGeometry relative="1" as="geometry">
            <Array as="points">
              <mxPoint x="4810" y="7437" />
              <mxPoint x="4810" y="7157" />
            </Array>
          </mxGeometry>
        </mxCell>
        <mxCell id="0_Y_4YDWGghsoqahOQmA-316" value="N,1" style="text;html=1;align=center;verticalAlign=middle;resizable=0;points=[];autosize=1;strokeColor=none;fillColor=none;" vertex="1" parent="1">
          <mxGeometry x="4803.75" y="7156.75" width="40" height="30" as="geometry" />
        </mxCell>
        <mxCell id="0_Y_4YDWGghsoqahOQmA-317" value="1,N" style="text;html=1;align=center;verticalAlign=middle;resizable=0;points=[];autosize=1;strokeColor=none;fillColor=none;" vertex="1" parent="1">
          <mxGeometry x="5288.13" y="7360.25" width="40" height="30" as="geometry" />
        </mxCell>
        <mxCell id="0_Y_4YDWGghsoqahOQmA-388" style="edgeStyle=orthogonalEdgeStyle;rounded=0;orthogonalLoop=1;jettySize=auto;html=1;entryX=0;entryY=0;entryDx=0;entryDy=0;endArrow=none;endFill=0;" edge="1" parent="1" source="0_Y_4YDWGghsoqahOQmA-319" target="0_Y_4YDWGghsoqahOQmA-248">
          <mxGeometry relative="1" as="geometry">
            <Array as="points">
              <mxPoint x="5096.88" y="7316.25" />
              <mxPoint x="5319.88" y="7316.25" />
            </Array>
          </mxGeometry>
        </mxCell>
        <mxCell id="0_Y_4YDWGghsoqahOQmA-319" value="VALUTAZIONE" style="rhombus;whiteSpace=wrap;html=1;labelBackgroundColor=none;" vertex="1" parent="1">
          <mxGeometry x="5056.88" y="7228.75" width="80" height="80" as="geometry" />
        </mxCell>
        <mxCell id="0_Y_4YDWGghsoqahOQmA-321" value="1,N" style="text;html=1;align=center;verticalAlign=middle;resizable=0;points=[];autosize=1;strokeColor=none;fillColor=none;" vertex="1" parent="1">
          <mxGeometry x="5423.13" y="7040.5" width="40" height="30" as="geometry" />
        </mxCell>
        <mxCell id="0_Y_4YDWGghsoqahOQmA-322" value="N,1" style="text;html=1;align=center;verticalAlign=middle;resizable=0;points=[];autosize=1;strokeColor=none;fillColor=none;" vertex="1" parent="1">
          <mxGeometry x="5410" y="7327.25" width="40" height="30" as="geometry" />
        </mxCell>
        <mxCell id="0_Y_4YDWGghsoqahOQmA-323" style="edgeStyle=orthogonalEdgeStyle;rounded=0;orthogonalLoop=1;jettySize=auto;html=1;entryX=1;entryY=0;entryDx=0;entryDy=0;endArrow=none;endFill=0;" edge="1" parent="1" source="0_Y_4YDWGghsoqahOQmA-324" target="0_Y_4YDWGghsoqahOQmA-248">
          <mxGeometry relative="1" as="geometry">
            <Array as="points">
              <mxPoint x="5440" y="7386" />
            </Array>
            <mxPoint x="5533.13" y="7288.75" as="targetPoint" />
          </mxGeometry>
        </mxCell>
        <mxCell id="0_Y_4YDWGghsoqahOQmA-324" value="ASSOCIAZIONE" style="rhombus;whiteSpace=wrap;html=1;labelBackgroundColor=none;" vertex="1" parent="1">
          <mxGeometry x="5680" y="7346.25" width="80" height="80" as="geometry" />
        </mxCell>
        <mxCell id="0_Y_4YDWGghsoqahOQmA-325" value="1,N" style="text;html=1;align=center;verticalAlign=middle;resizable=0;points=[];autosize=1;strokeColor=none;fillColor=none;" vertex="1" parent="1">
          <mxGeometry x="5439.88" y="7357.25" width="40" height="30" as="geometry" />
        </mxCell>
        <mxCell id="0_Y_4YDWGghsoqahOQmA-326" value="N,1" style="text;html=1;align=center;verticalAlign=middle;resizable=0;points=[];autosize=1;strokeColor=none;fillColor=none;" vertex="1" parent="1">
          <mxGeometry x="5940.75" y="7356.25" width="40" height="30" as="geometry" />
        </mxCell>
        <mxCell id="0_Y_4YDWGghsoqahOQmA-327" value="&lt;font style=&quot;font-size: 10px;&quot;&gt;NOME PROGETTO&lt;/font&gt;" style="ellipse;whiteSpace=wrap;html=1;labelBackgroundColor=none;" vertex="1" parent="1">
          <mxGeometry x="5296.88" y="6948.75" width="62.5" height="42" as="geometry" />
        </mxCell>
        <mxCell id="0_Y_4YDWGghsoqahOQmA-328" value="&lt;u&gt;&lt;font style=&quot;font-size: 10px;&quot;&gt;ID FILE&lt;/font&gt;&lt;/u&gt;" style="ellipse;whiteSpace=wrap;html=1;labelBackgroundColor=none;" vertex="1" parent="1">
          <mxGeometry x="5973.25" y="7416.25" width="62.5" height="42" as="geometry" />
        </mxCell>
        <mxCell id="0_Y_4YDWGghsoqahOQmA-329" value="&lt;font style=&quot;font-size: 10px;&quot;&gt;NOME&lt;/font&gt;" style="ellipse;whiteSpace=wrap;html=1;labelBackgroundColor=none;" vertex="1" parent="1">
          <mxGeometry x="5973.25" y="7458.25" width="62.5" height="42" as="geometry" />
        </mxCell>
        <mxCell id="0_Y_4YDWGghsoqahOQmA-330" value="&lt;font style=&quot;font-size: 10px;&quot;&gt;TIPOLOGIA&lt;/font&gt;" style="ellipse;whiteSpace=wrap;html=1;labelBackgroundColor=none;" vertex="1" parent="1">
          <mxGeometry x="5973.25" y="7500.25" width="62.5" height="42" as="geometry" />
        </mxCell>
        <mxCell id="0_Y_4YDWGghsoqahOQmA-331" value="DATA ULTIMA MODIFICA" style="ellipse;whiteSpace=wrap;html=1;labelBackgroundColor=none;" vertex="1" parent="1">
          <mxGeometry x="6035.75" y="7416.25" width="62.5" height="42" as="geometry" />
        </mxCell>
        <mxCell id="0_Y_4YDWGghsoqahOQmA-333" value="UTENTE ULTIMA MODIFICA" style="ellipse;whiteSpace=wrap;html=1;labelBackgroundColor=none;" vertex="1" parent="1">
          <mxGeometry x="6035.75" y="7500.25" width="62.5" height="42" as="geometry" />
        </mxCell>
        <mxCell id="0_Y_4YDWGghsoqahOQmA-334" value="&lt;font style=&quot;font-size: 10px;&quot;&gt;CONTENUTO&lt;/font&gt;" style="ellipse;whiteSpace=wrap;html=1;labelBackgroundColor=none;" vertex="1" parent="1">
          <mxGeometry x="6035.75" y="7458.25" width="62.5" height="42" as="geometry" />
        </mxCell>
        <mxCell id="0_Y_4YDWGghsoqahOQmA-335" style="edgeStyle=orthogonalEdgeStyle;rounded=0;orthogonalLoop=1;jettySize=auto;html=1;entryX=0.5;entryY=1;entryDx=0;entryDy=0;endArrow=none;endFill=0;" edge="1" parent="1" source="0_Y_4YDWGghsoqahOQmA-337" target="0_Y_4YDWGghsoqahOQmA-256">
          <mxGeometry relative="1" as="geometry" />
        </mxCell>
        <mxCell id="0_Y_4YDWGghsoqahOQmA-336" style="edgeStyle=orthogonalEdgeStyle;rounded=0;orthogonalLoop=1;jettySize=auto;html=1;entryX=1;entryY=0;entryDx=0;entryDy=0;endArrow=none;endFill=0;" edge="1" parent="1" source="0_Y_4YDWGghsoqahOQmA-337" target="0_Y_4YDWGghsoqahOQmA-246">
          <mxGeometry relative="1" as="geometry" />
        </mxCell>
        <mxCell id="0_Y_4YDWGghsoqahOQmA-337" value="POSTARE" style="rhombus;whiteSpace=wrap;html=1;labelBackgroundColor=none;" vertex="1" parent="1">
          <mxGeometry x="5531.130000000001" y="6866.25" width="80" height="80" as="geometry" />
        </mxCell>
        <mxCell id="0_Y_4YDWGghsoqahOQmA-338" value="&lt;span style=&quot;font-size: 10px;&quot;&gt;&lt;u&gt;ID MESSAGGIO&lt;/u&gt;&lt;/span&gt;" style="ellipse;whiteSpace=wrap;html=1;labelBackgroundColor=none;" vertex="1" parent="1">
          <mxGeometry x="5510.63" y="6644.25" width="62.5" height="42" as="geometry" />
        </mxCell>
        <mxCell id="0_Y_4YDWGghsoqahOQmA-339" value="&lt;span style=&quot;font-size: 10px;&quot;&gt;STATO MESSAGGIO&lt;/span&gt;" style="ellipse;whiteSpace=wrap;html=1;labelBackgroundColor=none;" vertex="1" parent="1">
          <mxGeometry x="5576.88" y="6644.25" width="62.5" height="42" as="geometry" />
        </mxCell>
        <mxCell id="0_Y_4YDWGghsoqahOQmA-340" value="&lt;span style=&quot;font-size: 10px;&quot;&gt;TIPOLOGIA&lt;/span&gt;" style="ellipse;whiteSpace=wrap;html=1;labelBackgroundColor=none;" vertex="1" parent="1">
          <mxGeometry x="5576.88" y="6602.25" width="62.5" height="42" as="geometry" />
        </mxCell>
        <mxCell id="0_Y_4YDWGghsoqahOQmA-341" value="1,N" style="text;html=1;align=center;verticalAlign=middle;resizable=0;points=[];autosize=1;strokeColor=none;fillColor=none;" vertex="1" parent="1">
          <mxGeometry x="5383.13" y="7016.25" width="40" height="30" as="geometry" />
        </mxCell>
        <mxCell id="0_Y_4YDWGghsoqahOQmA-342" value="N,1" style="text;html=1;align=center;verticalAlign=middle;resizable=0;points=[];autosize=1;strokeColor=none;fillColor=none;" vertex="1" parent="1">
          <mxGeometry x="5533.13" y="6746.25" width="40" height="30" as="geometry" />
        </mxCell>
        <mxCell id="0_Y_4YDWGghsoqahOQmA-343" value="&lt;span style=&quot;font-size: 10px;&quot;&gt;TESTO&lt;/span&gt;" style="ellipse;whiteSpace=wrap;html=1;labelBackgroundColor=none;" vertex="1" parent="1">
          <mxGeometry x="5510.63" y="6602.25" width="62.5" height="42" as="geometry" />
        </mxCell>
        <mxCell id="0_Y_4YDWGghsoqahOQmA-344" value="&lt;span style=&quot;font-size: 10px;&quot;&gt;AUTORE&lt;/span&gt;" style="ellipse;whiteSpace=wrap;html=1;labelBackgroundColor=none;" vertex="1" parent="1">
          <mxGeometry x="5510.63" y="6560.25" width="62.5" height="42" as="geometry" />
        </mxCell>
        <mxCell id="0_Y_4YDWGghsoqahOQmA-352" style="edgeStyle=orthogonalEdgeStyle;rounded=0;orthogonalLoop=1;jettySize=auto;html=1;entryX=0.5;entryY=1;entryDx=0;entryDy=0;endArrow=none;endFill=0;" edge="1" parent="1" source="0_Y_4YDWGghsoqahOQmA-349" target="0_Y_4YDWGghsoqahOQmA-30">
          <mxGeometry relative="1" as="geometry" />
        </mxCell>
        <mxCell id="0_Y_4YDWGghsoqahOQmA-364" style="edgeStyle=orthogonalEdgeStyle;rounded=0;orthogonalLoop=1;jettySize=auto;html=1;endArrow=none;endFill=0;" edge="1" parent="1" source="0_Y_4YDWGghsoqahOQmA-349">
          <mxGeometry relative="1" as="geometry">
            <mxPoint x="4946.88" y="6906.25" as="targetPoint" />
          </mxGeometry>
        </mxCell>
        <mxCell id="0_Y_4YDWGghsoqahOQmA-365" style="edgeStyle=orthogonalEdgeStyle;rounded=0;orthogonalLoop=1;jettySize=auto;html=1;endArrow=none;endFill=0;" edge="1" parent="1" source="0_Y_4YDWGghsoqahOQmA-349">
          <mxGeometry relative="1" as="geometry">
            <mxPoint x="4676.88" y="6906.25" as="targetPoint" />
          </mxGeometry>
        </mxCell>
        <mxCell id="0_Y_4YDWGghsoqahOQmA-349" value="POSSIEDE" style="rhombus;whiteSpace=wrap;html=1;labelBackgroundColor=none;" vertex="1" parent="1">
          <mxGeometry x="4778.75" y="6953.19" width="65" height="60" as="geometry" />
        </mxCell>
        <mxCell id="0_Y_4YDWGghsoqahOQmA-361" style="edgeStyle=orthogonalEdgeStyle;rounded=0;orthogonalLoop=1;jettySize=auto;html=1;entryX=0;entryY=0.5;entryDx=0;entryDy=0;endArrow=none;endFill=0;" edge="1" parent="1" source="0_Y_4YDWGghsoqahOQmA-359" target="0_Y_4YDWGghsoqahOQmA-253">
          <mxGeometry relative="1" as="geometry">
            <Array as="points">
              <mxPoint x="4660.88" y="7567.25" />
            </Array>
          </mxGeometry>
        </mxCell>
        <mxCell id="0_Y_4YDWGghsoqahOQmA-359" value="POSSIEDE" style="rhombus;whiteSpace=wrap;html=1;labelBackgroundColor=none;" vertex="1" parent="1">
          <mxGeometry x="4628.88" y="7311.25" width="65" height="60" as="geometry" />
        </mxCell>
        <mxCell id="0_Y_4YDWGghsoqahOQmA-362" value="1,1" style="text;html=1;align=center;verticalAlign=middle;resizable=0;points=[];autosize=1;strokeColor=none;fillColor=none;" vertex="1" parent="1">
          <mxGeometry x="4803.75" y="7070.5" width="40" height="30" as="geometry" />
        </mxCell>
        <mxCell id="0_Y_4YDWGghsoqahOQmA-366" value="1,N" style="text;html=1;align=center;verticalAlign=middle;resizable=0;points=[];autosize=1;strokeColor=none;fillColor=none;" vertex="1" parent="1">
          <mxGeometry x="4711.88" y="7126.75" width="40" height="30" as="geometry" />
        </mxCell>
        <mxCell id="0_Y_4YDWGghsoqahOQmA-367" value="N,1" style="text;html=1;align=center;verticalAlign=middle;resizable=0;points=[];autosize=1;strokeColor=none;fillColor=none;" vertex="1" parent="1">
          <mxGeometry x="4711.88" y="7538.75" width="40" height="30" as="geometry" />
        </mxCell>
        <mxCell id="0_Y_4YDWGghsoqahOQmA-372" style="edgeStyle=orthogonalEdgeStyle;rounded=0;orthogonalLoop=1;jettySize=auto;html=1;entryX=0;entryY=1;entryDx=0;entryDy=0;endArrow=none;endFill=0;" edge="1" parent="1" source="0_Y_4YDWGghsoqahOQmA-370" target="0_Y_4YDWGghsoqahOQmA-248">
          <mxGeometry relative="1" as="geometry">
            <mxPoint x="5246.879999999999" y="7476.25" as="targetPoint" />
          </mxGeometry>
        </mxCell>
        <mxCell id="0_Y_4YDWGghsoqahOQmA-370" value="RICHIEDE" style="rhombus;whiteSpace=wrap;html=1;labelBackgroundColor=none;" vertex="1" parent="1">
          <mxGeometry x="5056.88" y="7526.75" width="80" height="80" as="geometry" />
        </mxCell>
        <mxCell id="0_Y_4YDWGghsoqahOQmA-373" value="N,1" style="text;html=1;align=center;verticalAlign=middle;resizable=0;points=[];autosize=1;strokeColor=none;fillColor=none;" vertex="1" parent="1">
          <mxGeometry x="4870.63" y="7538.25" width="40" height="30" as="geometry" />
        </mxCell>
        <mxCell id="0_Y_4YDWGghsoqahOQmA-374" value="1,N" style="text;html=1;align=center;verticalAlign=middle;resizable=0;points=[];autosize=1;strokeColor=none;fillColor=none;" vertex="1" parent="1">
          <mxGeometry x="5279.88" y="7416.25" width="40" height="30" as="geometry" />
        </mxCell>
        <mxCell id="0_Y_4YDWGghsoqahOQmA-375" value="TIPOLOGIA TASK" style="rounded=0;whiteSpace=wrap;html=1;labelBackgroundColor=none;" vertex="1" parent="1">
          <mxGeometry x="5056.88" y="7786.25" width="120" height="60" as="geometry" />
        </mxCell>
        <mxCell id="0_Y_4YDWGghsoqahOQmA-376" value="&lt;u&gt;&lt;font style=&quot;font-size: 10px;&quot;&gt;ID TIPOLOGIA&lt;/font&gt;&lt;/u&gt;" style="ellipse;whiteSpace=wrap;html=1;labelBackgroundColor=none;" vertex="1" parent="1">
          <mxGeometry x="5051.88" y="7846.25" width="62.5" height="42" as="geometry" />
        </mxCell>
        <mxCell id="0_Y_4YDWGghsoqahOQmA-379" style="edgeStyle=orthogonalEdgeStyle;rounded=0;orthogonalLoop=1;jettySize=auto;html=1;entryX=0.75;entryY=0;entryDx=0;entryDy=0;endArrow=none;endFill=0;" edge="1" parent="1" source="0_Y_4YDWGghsoqahOQmA-377" target="0_Y_4YDWGghsoqahOQmA-375">
          <mxGeometry relative="1" as="geometry" />
        </mxCell>
        <mxCell id="0_Y_4YDWGghsoqahOQmA-377" value="APPARTIENE" style="rhombus;whiteSpace=wrap;html=1;labelBackgroundColor=none;" vertex="1" parent="1">
          <mxGeometry x="5216.88" y="7626.25" width="80" height="80" as="geometry" />
        </mxCell>
        <mxCell id="0_Y_4YDWGghsoqahOQmA-378" value="&lt;font style=&quot;font-size: 10px;&quot;&gt;NOME TIPOLOGIA&lt;/font&gt;" style="ellipse;whiteSpace=wrap;html=1;labelBackgroundColor=none;" vertex="1" parent="1">
          <mxGeometry x="5114.38" y="7846.25" width="62.5" height="42" as="geometry" />
        </mxCell>
        <mxCell id="0_Y_4YDWGghsoqahOQmA-380" style="edgeStyle=orthogonalEdgeStyle;rounded=0;orthogonalLoop=1;jettySize=auto;html=1;entryX=0.41;entryY=1.01;entryDx=0;entryDy=0;entryPerimeter=0;endArrow=none;endFill=0;" edge="1" parent="1" source="0_Y_4YDWGghsoqahOQmA-377" target="0_Y_4YDWGghsoqahOQmA-248">
          <mxGeometry relative="1" as="geometry" />
        </mxCell>
        <mxCell id="0_Y_4YDWGghsoqahOQmA-381" value="1,1" style="text;html=1;align=center;verticalAlign=middle;resizable=0;points=[];autosize=1;strokeColor=none;fillColor=none;" vertex="1" parent="1">
          <mxGeometry x="5328.13" y="7418.75" width="40" height="30" as="geometry" />
        </mxCell>
        <mxCell id="0_Y_4YDWGghsoqahOQmA-382" value="1,N" style="text;html=1;align=center;verticalAlign=middle;resizable=0;points=[];autosize=1;strokeColor=none;fillColor=none;" vertex="1" parent="1">
          <mxGeometry x="5136.88" y="7765" width="40" height="30" as="geometry" />
        </mxCell>
        <mxCell id="0_Y_4YDWGghsoqahOQmA-385" style="edgeStyle=orthogonalEdgeStyle;rounded=0;orthogonalLoop=1;jettySize=auto;html=1;endArrow=none;endFill=0;entryX=0.169;entryY=0.003;entryDx=0;entryDy=0;entryPerimeter=0;" edge="1" parent="1" source="0_Y_4YDWGghsoqahOQmA-370" target="0_Y_4YDWGghsoqahOQmA-375">
          <mxGeometry relative="1" as="geometry">
            <mxPoint x="5080" y="7785" as="targetPoint" />
            <Array as="points">
              <mxPoint x="5097" y="7786" />
            </Array>
          </mxGeometry>
        </mxCell>
        <mxCell id="0_Y_4YDWGghsoqahOQmA-386" value="1,N" style="text;html=1;align=center;verticalAlign=middle;resizable=0;points=[];autosize=1;strokeColor=none;fillColor=none;" vertex="1" parent="1">
          <mxGeometry x="5056.88" y="7765" width="40" height="30" as="geometry" />
        </mxCell>
        <mxCell id="0_Y_4YDWGghsoqahOQmA-389" value="1,N" style="text;html=1;align=center;verticalAlign=middle;resizable=0;points=[];autosize=1;strokeColor=none;fillColor=none;" vertex="1" parent="1">
          <mxGeometry x="4865.63" y="7161.25" width="40" height="30" as="geometry" />
        </mxCell>
        <mxCell id="0_Y_4YDWGghsoqahOQmA-390" value="N,1" style="text;html=1;align=center;verticalAlign=middle;resizable=0;points=[];autosize=1;strokeColor=none;fillColor=none;" vertex="1" parent="1">
          <mxGeometry x="5279.88" y="7326.25" width="40" height="30" as="geometry" />
        </mxCell>
        <mxCell id="0_Y_4YDWGghsoqahOQmA-391" value="1,N" style="text;html=1;align=center;verticalAlign=middle;resizable=0;points=[];autosize=1;strokeColor=none;fillColor=none;" vertex="1" parent="1">
          <mxGeometry x="5346" y="7327.25" width="40" height="30" as="geometry" />
        </mxCell>
        <mxCell id="0_Y_4YDWGghsoqahOQmA-392" value="&lt;font style=&quot;font-size: 10px;&quot;&gt;TITOLO&lt;/font&gt;" style="ellipse;whiteSpace=wrap;html=1;labelBackgroundColor=none;" vertex="1" parent="1">
          <mxGeometry x="3306.38" y="7664.25" width="62.5" height="42" as="geometry" />
        </mxCell>
        <mxCell id="0_Y_4YDWGghsoqahOQmA-393" value="&lt;font style=&quot;font-size: 10px;&quot;&gt;TITOLO&lt;/font&gt;" style="ellipse;whiteSpace=wrap;html=1;labelBackgroundColor=none;" vertex="1" parent="1">
          <mxGeometry x="5383.13" y="7676.25" width="62.5" height="42" as="geometry" />
        </mxCell>
        <mxCell id="0_Y_4YDWGghsoqahOQmA-394" value="&lt;p style=&quot;text-align: justify;&quot; class=&quot;MsoNormal&quot;&gt;&lt;font style=&quot;font-size: 72px;&quot;&gt;&lt;b style=&quot;&quot;&gt;Modello relazionale “Developers”&lt;/b&gt;&lt;/font&gt;&lt;/p&gt;&lt;br&gt;&lt;br&gt;&lt;p style=&quot;text-align: justify;&quot; class=&quot;MsoNormal&quot;&gt;&lt;font size=&quot;3&quot;&gt;&amp;nbsp;&lt;/font&gt;&lt;b style=&quot;background-color: initial; font-size: medium;&quot;&gt;Sviluppatore&lt;/b&gt;&lt;span style=&quot;background-color: initial; font-size: medium;&quot;&gt; (&lt;/span&gt;&lt;u style=&quot;background-color: initial; font-size: medium;&quot;&gt;ID&lt;/u&gt;&lt;span style=&quot;background-color: initial; font-size: medium;&quot;&gt;, nome, cognome, cf, data_nascita,residenza, email, telefono, cellulare, cv_text, cv_pdf)&lt;/span&gt;&lt;/p&gt;&lt;br&gt;&lt;br&gt;&lt;p style=&quot;text-align: justify;&quot; class=&quot;MsoNormal&quot;&gt;&lt;font size=&quot;3&quot;&gt;&lt;b&gt;Skill&lt;/b&gt; (&lt;u&gt;ID&lt;/u&gt;, nome_skill)&lt;/font&gt;&lt;/p&gt;&lt;br&gt;&lt;br&gt;&lt;p style=&quot;text-align: justify;&quot; class=&quot;MsoNormal&quot;&gt;&lt;font size=&quot;3&quot;&gt;&lt;b&gt;Progetto&lt;/b&gt; (&lt;u&gt;ID&lt;/u&gt;, nome_progetto&lt;u&gt;, IDsviluppatore&lt;/u&gt;)&lt;/font&gt;&lt;/p&gt;&lt;br&gt;&lt;br&gt;&lt;p style=&quot;text-align: justify;&quot; class=&quot;MsoNormal&quot;&gt;&lt;font size=&quot;3&quot;&gt;&lt;b&gt;Task&lt;/b&gt; (&lt;u&gt;ID&lt;/u&gt;, numero_max_collaboratori, data_inizio,data_fine, titolo, descrizione, stato_task, &lt;u&gt;ID_tipo_task, ID_progetto&lt;/u&gt;)&lt;/font&gt;&lt;/p&gt;&lt;br&gt;&lt;br&gt;&lt;p style=&quot;text-align: justify;&quot; class=&quot;MsoNormal&quot;&gt;&lt;font size=&quot;3&quot;&gt;&lt;b&gt;Tipologia&lt;/b&gt; &lt;b&gt;Task&lt;/b&gt; (&lt;u&gt;ID&lt;/u&gt;, nome_tipologia)&lt;/font&gt;&lt;/p&gt;&lt;br&gt;&lt;br&gt;&lt;p style=&quot;text-align: justify;&quot; class=&quot;MsoNormal&quot;&gt;&lt;font size=&quot;3&quot;&gt;&lt;b&gt;Allegato&lt;/b&gt; (&lt;u&gt;ID&lt;/u&gt;, nome_file, tipologia, data _modifica,contenuto,&lt;u&gt; ID sviluppatore&lt;/u&gt;,&lt;u&gt; ID_task&lt;/u&gt; )&lt;/font&gt;&lt;/p&gt;&lt;br&gt;&lt;br&gt;&lt;p style=&quot;text-align: justify;&quot; class=&quot;MsoNormal&quot;&gt;&lt;font size=&quot;3&quot;&gt;&lt;b&gt;Messaggio&lt;/b&gt; (&lt;u&gt;ID&lt;/u&gt;, stato_messaggio, tipologia,testo, &lt;u&gt;ID sviluppatore&lt;/u&gt;,&lt;u&gt; ID_progetto&lt;/u&gt; )&lt;/font&gt;&lt;/p&gt;&lt;br&gt;&lt;br&gt;&lt;p style=&quot;text-align: justify;&quot; class=&quot;MsoNormal&quot;&gt;&lt;font size=&quot;3&quot;&gt;&lt;b&gt;Sviluppatore_skill&lt;/b&gt;&lt;/font&gt;&lt;span style=&quot;background-color: initial; font-size: medium;&quot;&gt;(&lt;/span&gt;&lt;u style=&quot;background-color: initial; font-size: medium;&quot;&gt;ID sviluppatore&lt;/u&gt;&lt;span style=&quot;background-color: initial; font-size: medium;&quot;&gt;, &lt;/span&gt;&lt;u style=&quot;background-color: initial; font-size: medium;&quot;&gt;ID_skill&lt;/u&gt;&lt;span style=&quot;background-color: initial; font-size: medium;&quot;&gt;, livello_competenza)&lt;/span&gt;&lt;/p&gt;&lt;br&gt;&lt;br&gt;&lt;p style=&quot;text-align: justify;&quot; class=&quot;MsoNormal&quot;&gt;&lt;font size=&quot;3&quot;&gt;&lt;b&gt;&lt;span lang=&quot;EN-US&quot;&gt;Task_skill&lt;/span&gt;&lt;/b&gt;&lt;span lang=&quot;EN-US&quot;&gt;(&lt;u&gt;ID_task&lt;/u&gt; , &lt;u&gt;ID_skill&lt;/u&gt;,competenza_minima)&lt;/span&gt;&lt;/font&gt;&lt;/p&gt;&lt;br&gt;&lt;br&gt;&lt;p style=&quot;text-align: justify;&quot; class=&quot;MsoNormal&quot;&gt;&lt;font size=&quot;3&quot;&gt;&lt;b&gt;&lt;span lang=&quot;EN-US&quot;&gt;TipoTask_skill&lt;/span&gt;&lt;/b&gt;&lt;span lang=&quot;EN-US&quot;&gt; (&lt;u&gt;ID_tipo_task&lt;/u&gt;, &lt;u&gt;ID_&lt;/u&gt;skill)&lt;/span&gt;&lt;/font&gt;&lt;/p&gt;&lt;br&gt;&lt;br&gt;&lt;p style=&quot;text-align: justify;&quot; class=&quot;MsoNormal&quot;&gt;&lt;font size=&quot;3&quot;&gt;&lt;b&gt;Sviluppatore_task&lt;/b&gt; (&lt;u&gt;ID_sviluppatore&lt;/u&gt;, &lt;u&gt;ID_task&lt;/u&gt;,valutazione)&lt;/font&gt;&lt;/p&gt;" style="text;html=1;align=center;verticalAlign=middle;resizable=0;points=[];autosize=1;strokeColor=none;fillColor=none;" vertex="1" parent="1">
          <mxGeometry x="3633.75" y="8105" width="1170" height="920" as="geometry" />
        </mxCell>
        <mxCell id="0_Y_4YDWGghsoqahOQmA-403" style="edgeStyle=orthogonalEdgeStyle;rounded=0;orthogonalLoop=1;jettySize=auto;html=1;entryX=0.979;entryY=0.991;entryDx=0;entryDy=0;entryPerimeter=0;endArrow=none;endFill=0;" edge="1" parent="1" source="0_Y_4YDWGghsoqahOQmA-109" target="0_Y_4YDWGghsoqahOQmA-18">
          <mxGeometry relative="1" as="geometry">
            <Array as="points">
              <mxPoint x="3885" y="7655" />
            </Array>
          </mxGeometry>
        </mxCell>
        <mxCell id="0_Y_4YDWGghsoqahOQmA-414" style="edgeStyle=orthogonalEdgeStyle;rounded=0;orthogonalLoop=1;jettySize=auto;html=1;entryX=0.331;entryY=-0.024;entryDx=0;entryDy=0;entryPerimeter=0;endArrow=none;endFill=0;" edge="1" parent="1" source="0_Y_4YDWGghsoqahOQmA-125" target="0_Y_4YDWGghsoqahOQmA-19">
          <mxGeometry relative="1" as="geometry">
            <Array as="points">
              <mxPoint x="3483" y="6508" />
              <mxPoint x="3483" y="6566" />
              <mxPoint x="3484" y="6566" />
            </Array>
          </mxGeometry>
        </mxCell>
        <mxCell id="0_Y_4YDWGghsoqahOQmA-417" style="edgeStyle=orthogonalEdgeStyle;rounded=0;orthogonalLoop=1;jettySize=auto;html=1;entryX=0.5;entryY=0;entryDx=0;entryDy=0;endArrow=none;endFill=0;" edge="1" parent="1" source="0_Y_4YDWGghsoqahOQmA-415" target="0_Y_4YDWGghsoqahOQmA-248">
          <mxGeometry relative="1" as="geometry" />
        </mxCell>
        <mxCell id="0_Y_4YDWGghsoqahOQmA-415" value="ASSOCIA" style="rhombus;whiteSpace=wrap;html=1;labelBackgroundColor=none;" vertex="1" parent="1">
          <mxGeometry x="5339.88" y="7168.25" width="80" height="80" as="geometry" />
        </mxCell>
      </root>
    </mxGraphModel>
  </diagram>
</mxfile>
