<?xml version="1.0" encoding="UTF-8" standalone="no"?>
<!-- Created with Inkscape (http://www.inkscape.org/) -->

<svg
   version="1.1"
   id="svg9"
   xml:space="preserve"
   width="199.46973"
   height="158.99062"
   viewBox="0 0 199.46972 158.99061"
   sodipodi:docname="cartesian_a.svg"
   inkscape:version="1.1 (c68e22c387, 2021-05-23)"
   xmlns:inkscape="http://www.inkscape.org/namespaces/inkscape"
   xmlns:sodipodi="http://sodipodi.sourceforge.net/DTD/sodipodi-0.dtd"
   xmlns="http://www.w3.org/2000/svg"
   xmlns:svg="http://www.w3.org/2000/svg"><defs
     id="defs13" /><sodipodi:namedview
     id="namedview11"
     pagecolor="#ffffff"
     bordercolor="#666666"
     borderopacity="1.0"
     inkscape:pageshadow="2"
     inkscape:pageopacity="0.0"
     inkscape:pagecheckerboard="0"
     showgrid="false"
     fit-margin-top="0"
     fit-margin-left="0"
     fit-margin-right="0"
     fit-margin-bottom="0"
     inkscape:zoom="4.1414261"
     inkscape:cx="94.291191"
     inkscape:cy="76.905876"
     inkscape:window-width="1680"
     inkscape:window-height="971"
     inkscape:window-x="-9"
     inkscape:window-y="-9"
     inkscape:window-maximized="1"
     inkscape:current-layer="g15" /><g
     id="g15"
     inkscape:groupmode="layer"
     inkscape:label="ink_ext_XXXXXX"
     transform="matrix(1.3333333,0,0,-1.3333333,-22.915599,162.83333)"><path
       d="M 33.7039,85.1656 64.6348,113.501 V 44.3168 L 33.7039,8.425 v 76.7406"
       style="fill:#f5f4f5;fill-opacity:1;fill-rule:evenodd;stroke:none;stroke-width:0.1"
       id="path19" /><path
       d="M 33.7039,85.1656 64.6348,113.501 V 44.3168 L 33.7039,8.425 Z"
       style="fill:none;stroke:#f5f4f5;stroke-width:0.567;stroke-linecap:butt;stroke-linejoin:miter;stroke-miterlimit:2.613;stroke-dasharray:none;stroke-opacity:1"
       id="path21" /><path
       d="m 64.352,44.3156 h 93.2699 v 69.1852 H 64.352 Z"
       style="fill:#efeeee;fill-opacity:1;fill-rule:nonzero;stroke:none;stroke-width:0.1"
       id="path23" /><path
       d="M 33.6547,8.94492 65.0598,44.5996 H 158.095 L 141.094,8.70898 33.6547,8.94492"
       style="fill:#f3f3f3;fill-opacity:1;fill-rule:evenodd;stroke:none;stroke-width:0.1"
       id="path25" /><path
       d="M 29.5746,6.51016 C 29.7027,6.375 29.7988,6.23906 29.8648,6.10508 29.9117,6.01016 29.9887,5.76406 30.0949,5.36602 l 0.3438,0.51601 c 0.091,0.12383 0.2031,0.24414 0.332,0.35703 0.1289,0.11289 0.2449,0.19102 0.343,0.23203 0.0633,0.02696 0.1332,0.03907 0.2082,0.03907 0.1129,0 0.2,-0.03008 0.266,-0.09024 0.0668,-0.05898 0.1,-0.13281 0.1,-0.21797 0,-0.09882 -0.0191,-0.16679 -0.0582,-0.20312 -0.0731,-0.06485 -0.1551,-0.09766 -0.2488,-0.09766 -0.0551,0 -0.1129,0.01094 -0.175,0.03594 -0.1243,0.04102 -0.2071,0.06172 -0.2481,0.06172 -0.0629,0 -0.1359,-0.03672 -0.223,-0.10899 -0.161,-0.13593 -0.3532,-0.39687 -0.577,-0.78476 l 0.3199,-1.34492 c 0.0493,-0.20508 0.0911,-0.3293 0.125,-0.36914 0.034,-0.03985 0.0672,-0.06016 0.1032,-0.06016 0.0531,0 0.1168,0.0293 0.189,0.09023 0.1438,0.11875 0.266,0.27579 0.368,0.46875 l 0.1359,-0.0707 C 31.2348,3.51094 31.027,3.25586 30.7738,3.05391 30.6309,2.93906 30.5098,2.88203 30.4117,2.88203 c -0.1449,0 -0.2621,0.08086 -0.3488,0.24492 C 30.009,3.22891 29.8949,3.66719 29.7238,4.43984 29.318,3.73398 28.993,3.28086 28.7469,3.07617 28.5887,2.94688 28.4348,2.88203 28.2867,2.88203 c -0.1039,0 -0.2,0.03711 -0.2859,0.11289 -0.0621,0.05821 -0.0942,0.13399 -0.0942,0.23125 0,0.08477 0.0301,0.15703 0.0883,0.21485 0.0547,0.05703 0.1258,0.08515 0.2098,0.08515 0.0832,0 0.1723,-0.04101 0.2652,-0.12617 0.0688,-0.05898 0.1199,-0.08906 0.1559,-0.08906 0.032,0 0.0719,0.02226 0.1211,0.06289 0.1238,0.09805 0.291,0.31211 0.5,0.64023 0.2109,0.32813 0.3508,0.56485 0.416,0.71211 -0.1641,0.63203 -0.2492,0.96602 -0.2641,1.00196 -0.0601,0.16992 -0.1371,0.28984 -0.234,0.35976 -0.0968,0.07109 -0.2378,0.10625 -0.4261,0.10625 -0.0598,0 -0.1289,-0.00312 -0.2059,-0.0082 v 0.14101 l 1.0418,0.18321"
       style="fill:#bdbbbc;fill-opacity:1;fill-rule:evenodd;stroke:none;stroke-width:0.1"
       id="path27" /><path
       d="m 164.559,46.0387 c 0.088,-0.15 0.149,-0.2918 0.184,-0.4219 0.033,-0.132 0.067,-0.391 0.102,-0.7762 l 0.171,-1.9211 c 0.157,0.1864 0.383,0.4832 0.68,0.8903 0.144,0.198 0.321,0.4668 0.531,0.8078 0.128,0.2082 0.206,0.3551 0.235,0.4371 0.014,0.0422 0.022,0.0859 0.022,0.1301 0,0.0281 -0.008,0.0519 -0.027,0.0711 -0.018,0.0168 -0.064,0.0379 -0.142,0.0629 -0.077,0.0238 -0.141,0.071 -0.192,0.1359 -0.051,0.0672 -0.075,0.143 -0.075,0.2301 0,0.107 0.031,0.1918 0.093,0.257 0.062,0.066 0.14,0.0969 0.234,0.0969 0.115,0 0.212,-0.0461 0.293,-0.1418 0.081,-0.0953 0.121,-0.2262 0.121,-0.3922 0,-0.2051 -0.069,-0.4418 -0.21,-0.7051 -0.141,-0.2641 -0.412,-0.6699 -0.813,-1.2168 -0.4,-0.5473 -0.886,-1.143 -1.456,-1.789 -0.394,-0.445 -0.686,-0.727 -0.876,-0.8422 -0.19,-0.1149 -0.353,-0.1739 -0.488,-0.1739 -0.081,0 -0.153,0.0309 -0.214,0.0918 -0.06,0.0621 -0.089,0.1321 -0.089,0.2141 0,0.1012 0.041,0.193 0.125,0.2769 0.084,0.0833 0.176,0.1243 0.275,0.1243 0.053,0 0.097,-0.011 0.13,-0.0352 0.021,-0.0129 0.044,-0.05 0.067,-0.1117 0.026,-0.0602 0.048,-0.1012 0.07,-0.1223 0.012,-0.014 0.029,-0.0187 0.046,-0.0187 0.015,0 0.043,0.0117 0.082,0.0386 0.143,0.0883 0.31,0.2293 0.5,0.4211 0.25,0.2563 0.434,0.4641 0.554,0.625 l -0.218,2.4762 c -0.036,0.409 -0.09,0.659 -0.164,0.7469 -0.074,0.0879 -0.195,0.1332 -0.367,0.1332 -0.055,0 -0.152,-0.0082 -0.293,-0.0242 l -0.035,0.1441 1.144,0.2809"
       style="fill:#bdbbbc;fill-opacity:1;fill-rule:evenodd;stroke:none;stroke-width:0.1"
       id="path29" /><path
       d="m 62.5598,122.125 h 2.4789 v -0.097 l -2.702,-2.814 h 1.1442 c 0.2699,0 0.4418,0.011 0.516,0.032 0.073,0.022 0.1398,0.066 0.2008,0.133 0.0613,0.067 0.13,0.19 0.205,0.367 h 0.1442 l -0.3403,-1.062 h -2.5418 v 0.113 l 2.702,2.812 h -1.1219 c -0.239,0 -0.3832,-0.007 -0.432,-0.019 -0.0723,-0.016 -0.1449,-0.057 -0.2152,-0.124 -0.0731,-0.065 -0.145,-0.176 -0.2219,-0.329 H 62.227 l 0.3328,0.988"
       style="fill:#bdbbbc;fill-opacity:1;fill-rule:evenodd;stroke:none;stroke-width:0.1"
       id="path31" /><path
       d="M 153.919,44.3168 H 64.352 v 64.5842"
       style="fill:none;stroke:#a8a6a7;stroke-width:0.567;stroke-linecap:butt;stroke-linejoin:miter;stroke-miterlimit:2.613;stroke-dasharray:none;stroke-opacity:1"
       id="path33" /><path
       d="m 158.322,44.3168 -5.64,-1.698 c 0.805,1.1308 0.805,2.264 0,3.396 l 5.64,-1.698"
       style="fill:#a8a6a7;fill-opacity:1;fill-rule:evenodd;stroke:none;stroke-width:0.1"
       id="path35" /><path
       d="m 64.352,113.303 -1.6981,-5.641 c 1.1328,0.806 2.2641,0.806 3.3957,0 l -1.6976,5.641"
       style="fill:#a8a6a7;fill-opacity:1;fill-rule:evenodd;stroke:none;stroke-width:0.1"
       id="path37" /><path
       d="M 64.7059,44.3156 36.9859,12.1582"
       style="fill:none;stroke:#a8a6a7;stroke-width:0.567;stroke-linecap:butt;stroke-linejoin:miter;stroke-miterlimit:2.613;stroke-dasharray:none;stroke-opacity:1"
       id="path39" /><path
       d="m 34.1117,8.82305 4.9692,3.16405 c -1.384,0.1289 -2.2411,0.868 -2.5719,2.218 L 34.1117,8.82305"
       style="fill:#a8a6a7;fill-opacity:1;fill-rule:evenodd;stroke:none;stroke-width:0.1"
       id="path41" /><path
       d="m 64.7566,45.5027 c 0.775,0 1.4071,-0.632 1.4071,-1.407 0,-0.775 -0.6321,-1.407 -1.4071,-1.407 -0.775,0 -1.4058,0.632 -1.4058,1.407 0,0.775 0.6308,1.407 1.4058,1.407"
       style="fill:#231f20;fill-opacity:1;fill-rule:evenodd;stroke:none;stroke-width:0.1"
       id="path43" /><path
       d="m 64.7566,45.5027 c 0.775,0 1.4071,-0.632 1.4071,-1.407 0,-0.775 -0.6321,-1.407 -1.4071,-1.407 -0.775,0 -1.4058,0.632 -1.4058,1.407 0,0.775 0.6308,1.407 1.4058,1.407 z"
       style="fill:none;stroke:#231f20;stroke-width:0.567;stroke-linecap:butt;stroke-linejoin:miter;stroke-miterlimit:2.613;stroke-dasharray:none;stroke-opacity:1"
       id="path45" /><path
       d="m 94.2258,77.0355 c 0.1262,-0.1347 0.2219,-0.2707 0.289,-0.4046 0.045,-0.0954 0.1239,-0.3411 0.229,-0.7391 l 0.3449,0.516 c 0.091,0.1238 0.2011,0.2438 0.332,0.357 0.1301,0.1129 0.243,0.1911 0.343,0.2321 0.0621,0.0269 0.1312,0.0386 0.2082,0.0386 0.1109,0 0.2,-0.0296 0.266,-0.0898 0.068,-0.059 0.1008,-0.1328 0.1008,-0.218 0,-0.0988 -0.0207,-0.1672 -0.0598,-0.2031 -0.073,-0.0648 -0.1562,-0.098 -0.2492,-0.098 -0.0539,0 -0.1141,0.0113 -0.1758,0.0351 -0.123,0.0422 -0.2062,0.0629 -0.2473,0.0629 -0.0628,0 -0.1347,-0.0367 -0.2218,-0.109 -0.161,-0.1359 -0.3539,-0.3968 -0.577,-0.7847 l 0.3192,-1.3454 c 0.05,-0.2046 0.0918,-0.3289 0.125,-0.3687 0.0339,-0.0402 0.0668,-0.0602 0.1019,-0.0602 0.0551,0 0.1188,0.0289 0.1899,0.0891 0.1441,0.1199 0.266,0.277 0.3691,0.4699 l 0.1359,-0.0711 c -0.164,-0.3078 -0.3718,-0.5629 -0.625,-0.7648 -0.1441,-0.1149 -0.2648,-0.1719 -0.364,-0.1719 -0.145,0 -0.2602,0.0809 -0.3469,0.2449 -0.0551,0.102 -0.1672,0.5399 -0.341,1.3129 -0.4039,-0.7058 -0.7301,-1.1597 -0.975,-1.364 -0.159,-0.1289 -0.3129,-0.1938 -0.4621,-0.1938 -0.1039,0 -0.1981,0.0367 -0.2848,0.1129 -0.0613,0.0578 -0.0922,0.134 -0.0922,0.2309 0,0.0851 0.0281,0.157 0.0852,0.2152 0.0558,0.057 0.1269,0.0848 0.2109,0.0848 0.082,0 0.1719,-0.0411 0.2649,-0.1258 0.0679,-0.059 0.1199,-0.0891 0.1562,-0.0891 0.0328,0 0.0727,0.0219 0.1219,0.0629 0.1219,0.0981 0.289,0.3121 0.5,0.6402 0.2097,0.3278 0.3488,0.5649 0.414,0.7118 -0.1621,0.632 -0.2492,0.966 -0.2621,1.0023 -0.0609,0.1699 -0.1379,0.2899 -0.2351,0.3598 -0.0949,0.0711 -0.2367,0.1058 -0.4239,0.1058 -0.0621,0 -0.13,-0.0027 -0.207,-0.0078 v 0.141 l 1.043,0.1828"
       style="fill:#231f20;fill-opacity:1;fill-rule:evenodd;stroke:none;stroke-width:0.1"
       id="path47" /><path
       d="m 98.5328,76.9496 h 4.21602 V 76.629678 H 98.5328 Z m 0,-1.273 h 4.21602 V 75.356678 H 98.5328 Z"
       style="fill:#231f20;fill-opacity:1;fill-rule:evenodd;stroke:none;stroke-width:0.1"
       id="path49" /><path
       d="m 105.19,76.1176 c 0,0.6043 0.091,1.1242 0.274,1.5613 0.182,0.4348 0.424,0.7609 0.726,0.9738 0.235,0.1692 0.476,0.2551 0.726,0.2551 0.406,0 0.771,-0.2082 1.095,-0.6223 0.403,-0.5128 0.604,-1.2078 0.604,-2.0859 0,-0.6148 -0.088,-1.1359 -0.264,-1.566 -0.178,-0.4301 -0.404,-0.7418 -0.678,-0.9359 -0.275,-0.1938 -0.54,-0.2899 -0.797,-0.2899 -0.504,0 -0.925,0.2969 -1.261,0.8949 -0.284,0.502 -0.425,1.1078 -0.425,1.8149 z m 0.765,-0.0969 c 0,-0.7289 0.089,-1.325 0.271,-1.7852 0.146,-0.3878 0.37,-0.5828 0.663,-0.5828 0.141,0 0.287,0.0641 0.437,0.1891 0.152,0.127 0.267,0.3391 0.345,0.6348 0.119,0.448 0.18,1.08 0.18,1.8953 0,0.6039 -0.064,1.1078 -0.189,1.5117 -0.094,0.3 -0.215,0.5121 -0.362,0.6371 -0.107,0.0852 -0.237,0.1281 -0.388,0.1281 -0.177,0 -0.334,-0.0793 -0.473,-0.2371 -0.186,-0.216 -0.315,-0.5558 -0.382,-1.0199 -0.069,-0.4641 -0.102,-0.9199 -0.102,-1.3711"
       style="fill:#231f20;fill-opacity:1;fill-rule:evenodd;stroke:none;stroke-width:0.1"
       id="path51" /><path
       d="m 110.893,76.7238 1.101,0.445 h 0.149 v -0.836 c 0.184,0.3149 0.37,0.536 0.556,0.6629 0.188,0.125 0.383,0.1891 0.588,0.1891 0.36,0 0.659,-0.141 0.899,-0.4231 0.294,-0.3429 0.441,-0.7898 0.441,-1.3429 0,-0.6161 -0.177,-1.127 -0.531,-1.5309 -0.29,-0.3313 -0.66,-0.4961 -1.102,-0.4961 -0.191,0 -0.358,0.0258 -0.5,0.0828 -0.103,0.0383 -0.222,0.1152 -0.351,0.2332 v -1.0902 c 0,-0.2449 0.015,-0.3988 0.044,-0.466 0.032,-0.0668 0.083,-0.12 0.158,-0.159 0.073,-0.0379 0.208,-0.059 0.403,-0.059 v -0.143 h -1.874 v 0.143 h 0.098 c 0.142,-0.002 0.264,0.0262 0.367,0.0832 0.049,0.0277 0.088,0.075 0.115,0.1391 0.026,0.0636 0.04,0.225 0.04,0.4847 v 3.384 c 0,0.2313 -0.01,0.3793 -0.03,0.441 -0.022,0.0633 -0.056,0.1102 -0.101,0.1403 -0.045,0.0328 -0.106,0.0468 -0.184,0.0468 -0.064,0 -0.142,-0.0172 -0.24,-0.0539 z m 1.25,-0.6222 v -1.3348 c 0,-0.2902 0.011,-0.4789 0.036,-0.5711 0.036,-0.1512 0.125,-0.2828 0.267,-0.3969 0.142,-0.1152 0.321,-0.173 0.537,-0.173 0.26,0 0.471,0.1019 0.632,0.3051 0.211,0.2648 0.317,0.6386 0.317,1.1207 0,0.5472 -0.12,0.9679 -0.36,1.2613 -0.166,0.2039 -0.365,0.3047 -0.593,0.3047 -0.125,0 -0.249,-0.0321 -0.372,-0.093 -0.092,-0.048 -0.248,-0.1879 -0.464,-0.423"
       style="fill:#231f20;fill-opacity:1;fill-rule:evenodd;stroke:none;stroke-width:0.1"
       id="path53" /><path
       d="m 116.381,79.0559 v -4.7473 c 0,-0.2238 0.017,-0.3719 0.05,-0.4449 0.032,-0.0719 0.082,-0.1282 0.149,-0.166 0.068,-0.0372 0.194,-0.0571 0.379,-0.0571 v -0.1398 h -1.753 v 0.1398 c 0.164,0 0.276,0.0172 0.334,0.052 0.061,0.034 0.108,0.089 0.143,0.1679 0.033,0.0782 0.049,0.2274 0.049,0.4481 v 3.2512 c 0,0.4039 -0.008,0.6519 -0.026,0.7441 -0.019,0.0918 -0.048,0.1559 -0.088,0.1887 -0.042,0.0351 -0.092,0.0512 -0.154,0.0512 -0.069,0 -0.154,-0.02 -0.258,-0.0629 l -0.066,0.1367 1.066,0.4383 h 0.175"
       style="fill:#231f20;fill-opacity:1;fill-rule:evenodd;stroke:none;stroke-width:0.1"
       id="path55" /><path
       d="m 119.4,74.0168 c -0.367,-0.284 -0.596,-0.448 -0.692,-0.4922 -0.14,-0.0648 -0.289,-0.098 -0.447,-0.098 -0.248,0 -0.452,0.0851 -0.613,0.2543 -0.16,0.1687 -0.24,0.3918 -0.24,0.6679 0,0.175 0.039,0.325 0.118,0.4539 0.107,0.1762 0.292,0.3418 0.556,0.5 0.265,0.1551 0.703,0.345 1.318,0.5692 v 0.141 c 0,0.3559 -0.055,0.6008 -0.169,0.7348 -0.113,0.132 -0.279,0.198 -0.495,0.198 -0.164,0 -0.294,-0.0441 -0.389,-0.1328 -0.1,-0.0883 -0.149,-0.1891 -0.149,-0.3043 l 0.008,-0.227 c 0,-0.1187 -0.03,-0.2121 -0.092,-0.2769 -0.061,-0.0649 -0.141,-0.0969 -0.24,-0.0969 -0.098,0 -0.176,0.0328 -0.237,0.1008 -0.062,0.068 -0.093,0.1602 -0.093,0.2769 0,0.2243 0.115,0.4301 0.345,0.6184 0.229,0.1859 0.55,0.2809 0.964,0.2809 0.319,0 0.578,-0.0532 0.783,-0.1602 0.152,-0.0808 0.265,-0.2078 0.34,-0.3801 0.046,-0.1117 0.068,-0.3398 0.068,-0.6859 v -1.2148 c 0,-0.3411 0.008,-0.5512 0.02,-0.6282 0.013,-0.0758 0.035,-0.1277 0.064,-0.1539 0.031,-0.0262 0.066,-0.0398 0.104,-0.0398 0.042,0 0.079,0.0097 0.111,0.0277 0.053,0.034 0.159,0.1301 0.314,0.2859 v -0.2187 c -0.29,-0.391 -0.568,-0.5859 -0.835,-0.5859 -0.127,0 -0.227,0.0437 -0.304,0.1328 -0.076,0.0879 -0.115,0.2402 -0.118,0.4531 z m 0,0.2527 v 1.3653 c -0.392,-0.1582 -0.645,-0.2692 -0.76,-0.3321 -0.207,-0.1148 -0.354,-0.2351 -0.442,-0.3601 -0.09,-0.1258 -0.134,-0.2617 -0.134,-0.411 0,-0.1871 0.056,-0.3429 0.168,-0.4668 0.113,-0.1222 0.242,-0.1851 0.387,-0.1851 0.198,0 0.459,0.1308 0.781,0.3898"
       style="fill:#231f20;fill-opacity:1;fill-rule:evenodd;stroke:none;stroke-width:0.1"
       id="path57" /><path
       d="m 121.968,76.4266 c 0.419,0.505 0.818,0.7582 1.197,0.7582 0.197,0 0.364,-0.0493 0.504,-0.1469 0.142,-0.0973 0.255,-0.2582 0.337,-0.482 0.057,-0.1563 0.086,-0.3961 0.086,-0.7192 v -1.5281 c 0,-0.225 0.017,-0.3797 0.055,-0.4598 0.029,-0.0652 0.075,-0.116 0.138,-0.1531 0.064,-0.0359 0.183,-0.0551 0.355,-0.0551 v -0.1398 h -1.772 v 0.1398 h 0.075 c 0.167,0 0.284,0.027 0.349,0.0782 0.067,0.05 0.114,0.125 0.14,0.2238 0.01,0.0383 0.015,0.1613 0.015,0.366 v 1.466 c 0,0.325 -0.043,0.5609 -0.127,0.709 -0.085,0.1473 -0.227,0.2199 -0.427,0.2199 -0.31,0 -0.62,-0.1687 -0.925,-0.5078 v -1.8871 c 0,-0.241 0.012,-0.391 0.043,-0.4481 0.036,-0.0757 0.086,-0.1316 0.149,-0.166 0.064,-0.0347 0.194,-0.0539 0.389,-0.0539 v -0.1398 h -1.77 v 0.1398 h 0.079 c 0.181,0 0.305,0.0473 0.369,0.1391 0.063,0.093 0.095,0.2691 0.095,0.5289 v 1.3293 c 0,0.4297 -0.01,0.6906 -0.03,0.7848 -0.018,0.0941 -0.049,0.1582 -0.089,0.191 -0.04,0.034 -0.095,0.0511 -0.163,0.0511 -0.071,0 -0.159,-0.0203 -0.261,-0.0589 l -0.058,0.1418 1.079,0.4371 h 0.168 v -0.7582"
       style="fill:#231f20;fill-opacity:1;fill-rule:evenodd;stroke:none;stroke-width:0.1"
       id="path59" /><path
       d="m 125.526,75.7316 c -0.003,-0.532 0.125,-0.948 0.386,-1.2507 0.261,-0.3012 0.567,-0.452 0.917,-0.452 0.235,0 0.439,0.0637 0.612,0.1938 0.174,0.1269 0.319,0.3492 0.435,0.6609 l 0.121,-0.077 c -0.054,-0.3578 -0.213,-0.6828 -0.476,-0.975 -0.262,-0.2929 -0.592,-0.4398 -0.987,-0.4398 -0.431,0 -0.799,0.166 -1.104,0.5008 -0.307,0.3351 -0.458,0.7851 -0.458,1.3512 0,0.6121 0.155,1.089 0.469,1.4308 0.315,0.3422 0.707,0.5141 1.182,0.5141 0.401,0 0.73,-0.1321 0.988,-0.3969 0.257,-0.2641 0.386,-0.618 0.386,-1.0602 z m 0,0.227 h 1.657 c -0.015,0.2293 -0.041,0.3902 -0.084,0.4832 -0.064,0.1461 -0.162,0.2609 -0.29,0.3437 -0.129,0.0833 -0.265,0.1262 -0.405,0.1262 -0.216,0 -0.409,-0.084 -0.58,-0.2519 -0.171,-0.168 -0.27,-0.4032 -0.298,-0.7012"
       style="fill:#231f20;fill-opacity:1;fill-rule:evenodd;stroke:none;stroke-width:0.1"
       id="path61" /><path
       d="m 82.059,28.2719 h 2.4789 v -0.0981 l -2.7031,-2.8129 h 1.1441 c 0.2711,0 0.4438,0.011 0.516,0.0321 0.0731,0.0211 0.141,0.0652 0.2008,0.132 0.0633,0.068 0.1301,0.191 0.2063,0.368 h 0.1449 l -0.341,-1.0629 h -2.543 v 0.114 l 2.7027,2.8118 h -1.1238 c -0.2371,0 -0.382,-0.0071 -0.4309,-0.0188 -0.0722,-0.016 -0.1453,-0.057 -0.2152,-0.1242 -0.073,-0.0649 -0.1461,-0.1758 -0.2219,-0.3289 h -0.148 l 0.3332,0.9879"
       style="fill:#231f20;fill-opacity:1;fill-rule:evenodd;stroke:none;stroke-width:0.1"
       id="path63" /><path
       d="m 86.643,28.2789 h 4.21602 V 27.958978 H 86.643 Z m 0,-1.273 h 4.21602 V 26.685978 H 86.643 Z"
       style="fill:#231f20;fill-opacity:1;fill-rule:evenodd;stroke:none;stroke-width:0.1"
       id="path65" /><path
       d="m 93.302,27.448 c 0,0.604 0.0898,1.1231 0.2718,1.5598 0.1828,0.436 0.4239,0.761 0.727,0.9738 0.234,0.1692 0.4762,0.2551 0.7262,0.2551 0.4058,0 0.7718,-0.2078 1.0929,-0.6219 0.4039,-0.5132 0.6059,-1.2066 0.6059,-2.0859 0,-0.6148 -0.0871,-1.1359 -0.266,-1.5648 -0.177,-0.4309 -0.4008,-0.743 -0.677,-0.936 -0.2738,-0.1949 -0.5398,-0.291 -0.7961,-0.291 -0.5039,0 -0.925,0.2969 -1.2609,0.8949 -0.284,0.502 -0.4238,1.1078 -0.4238,1.816 z m 0.7636,-0.098 c 0,-0.7289 0.0891,-1.325 0.2692,-1.7852 0.148,-0.3878 0.3711,-0.5828 0.664,-0.5828 0.1418,0 0.2871,0.0641 0.4371,0.1899 0.1528,0.1261 0.2668,0.3383 0.345,0.634 0.1191,0.448 0.18,1.08 0.18,1.8953 0,0.6039 -0.0632,1.1074 -0.189,1.5117 -0.0922,0.3 -0.2129,0.5117 -0.3621,0.6367 -0.1059,0.0852 -0.2352,0.1281 -0.3871,0.1281 -0.1758,0 -0.3348,-0.0789 -0.4719,-0.2371 -0.1879,-0.216 -0.316,-0.5558 -0.384,-1.0195 -0.068,-0.4641 -0.1012,-0.9199 -0.1012,-1.3711"
       style="fill:#231f20;fill-opacity:1;fill-rule:evenodd;stroke:none;stroke-width:0.1"
       id="path67" /><path
       d="m 99.0027,28.0531 1.1013,0.4449 h 0.151 v -0.8359 c 0.183,0.3149 0.368,0.5359 0.555,0.6629 0.186,0.125 0.382,0.1891 0.588,0.1891 0.361,0 0.659,-0.1411 0.899,-0.4219 0.295,-0.3442 0.441,-0.791 0.441,-1.3442 0,-0.616 -0.178,-1.1269 -0.532,-1.5308 -0.291,-0.3313 -0.658,-0.4961 -1.102,-0.4961 -0.192,0 -0.358,0.0269 -0.5,0.0828 -0.104,0.0383 -0.22,0.116 -0.349,0.2332 V 23.948 c 0,-0.246 0.014,-0.4 0.044,-0.4671 0.029,-0.0668 0.083,-0.12 0.156,-0.159 0.073,-0.0379 0.208,-0.0578 0.404,-0.0578 v -0.1442 h -1.875 v 0.1442 h 0.0976 c 0.1442,-0.0032 0.2661,0.025 0.3661,0.082 0.05,0.0289 0.0882,0.075 0.116,0.1391 0.0281,0.0636 0.0402,0.225 0.0402,0.4847 v 3.384 c 0,0.2313 -0.0082,0.3793 -0.0301,0.4422 -0.0199,0.0621 -0.055,0.109 -0.1,0.1398 -0.0449,0.0321 -0.107,0.0461 -0.1859,0.0461 -0.0621,0 -0.141,-0.0172 -0.2371,-0.0539 z m 1.2523,-0.6211 v -1.3359 c 0,-0.2902 0.01,-0.4789 0.033,-0.5711 0.036,-0.1512 0.126,-0.2828 0.27,-0.3969 0.14,-0.1152 0.318,-0.1722 0.537,-0.1722 0.259,0 0.47,0.1011 0.631,0.3043 0.21,0.2648 0.316,0.6398 0.316,1.1207 0,0.5472 -0.118,0.9679 -0.358,1.2613 -0.167,0.2039 -0.366,0.3058 -0.593,0.3058 -0.126,0 -0.25,-0.032 -0.372,-0.0941 -0.095,-0.048 -0.248,-0.1879 -0.464,-0.4219"
       style="fill:#231f20;fill-opacity:1;fill-rule:evenodd;stroke:none;stroke-width:0.1"
       id="path69" /><path
       d="m 104.491,30.3848 v -4.7469 c 0,-0.2238 0.018,-0.3719 0.049,-0.4449 0.032,-0.0719 0.083,-0.1282 0.151,-0.1649 0.069,-0.0383 0.194,-0.0582 0.379,-0.0582 v -0.1398 h -1.754 v 0.1398 c 0.164,0 0.277,0.018 0.335,0.052 0.06,0.034 0.109,0.0902 0.141,0.1679 0.034,0.0782 0.052,0.2274 0.052,0.4481 v 3.2508 c 0,0.4039 -0.01,0.6519 -0.028,0.7441 -0.017,0.0918 -0.048,0.1559 -0.088,0.1891 -0.041,0.0347 -0.091,0.0508 -0.154,0.0508 -0.067,0 -0.153,-0.02 -0.258,-0.0629 l -0.066,0.1379 1.066,0.4371 h 0.175"
       style="fill:#231f20;fill-opacity:1;fill-rule:evenodd;stroke:none;stroke-width:0.1"
       id="path71" /><path
       d="m 107.512,25.3461 c -0.368,-0.284 -0.598,-0.4481 -0.693,-0.4922 -0.139,-0.0648 -0.289,-0.098 -0.448,-0.098 -0.248,0 -0.452,0.0851 -0.611,0.2543 -0.161,0.1699 -0.241,0.3918 -0.241,0.6679 0,0.175 0.04,0.3258 0.118,0.4539 0.106,0.1762 0.292,0.3418 0.555,0.5 0.264,0.1559 0.704,0.345 1.32,0.5692 v 0.141 c 0,0.3558 -0.057,0.6019 -0.17,0.7348 -0.114,0.132 -0.279,0.1992 -0.494,0.1992 -0.164,0 -0.295,-0.0442 -0.392,-0.134 -0.098,-0.0883 -0.147,-0.1891 -0.147,-0.3043 l 0.007,-0.2258 c 0,-0.1199 -0.03,-0.2121 -0.092,-0.2781 -0.061,-0.0649 -0.141,-0.0969 -0.24,-0.0969 -0.096,0 -0.175,0.0328 -0.237,0.1008 -0.061,0.068 -0.092,0.1601 -0.092,0.2781 0,0.2238 0.115,0.4289 0.344,0.6172 0.229,0.1867 0.552,0.2809 0.966,0.2809 0.317,0 0.577,-0.0532 0.781,-0.1602 0.153,-0.0809 0.267,-0.2078 0.34,-0.3801 0.047,-0.1117 0.069,-0.3398 0.069,-0.6859 V 26.073 c 0,-0.341 0.006,-0.5511 0.021,-0.6281 0.012,-0.0758 0.034,-0.1277 0.063,-0.1527 0.03,-0.0274 0.066,-0.0402 0.105,-0.0402 0.041,0 0.078,0.0089 0.108,0.0281 0.056,0.0328 0.16,0.1289 0.316,0.2847 v -0.2187 c -0.29,-0.3902 -0.569,-0.5859 -0.835,-0.5859 -0.127,0 -0.229,0.0437 -0.305,0.1328 -0.075,0.0879 -0.113,0.2402 -0.116,0.4531 z m 0,0.2539 v 1.3641 c -0.394,-0.1582 -0.648,-0.268 -0.762,-0.3321 -0.207,-0.1148 -0.354,-0.2351 -0.441,-0.3601 -0.089,-0.1258 -0.133,-0.2617 -0.133,-0.411 0,-0.1871 0.055,-0.3429 0.168,-0.4668 0.111,-0.1222 0.24,-0.1851 0.386,-0.1851 0.199,0 0.458,0.1308 0.782,0.391"
       style="fill:#231f20;fill-opacity:1;fill-rule:evenodd;stroke:none;stroke-width:0.1"
       id="path73" /><path
       d="m 110.078,27.7559 c 0.418,0.505 0.818,0.7582 1.198,0.7582 0.197,0 0.365,-0.0493 0.504,-0.1461 0.143,-0.0981 0.254,-0.259 0.336,-0.4828 0.059,-0.1563 0.085,-0.3961 0.085,-0.7192 v -1.5281 c 0,-0.225 0.02,-0.3797 0.057,-0.4598 0.028,-0.0652 0.074,-0.116 0.138,-0.1531 0.063,-0.0359 0.182,-0.0551 0.354,-0.0551 v -0.1398 h -1.771 v 0.1398 h 0.076 c 0.166,0 0.284,0.027 0.348,0.0781 0.067,0.05 0.114,0.125 0.138,0.2239 0.012,0.0383 0.018,0.1613 0.018,0.366 v 1.466 c 0,0.325 -0.043,0.5609 -0.127,0.709 -0.085,0.1473 -0.229,0.2203 -0.429,0.2203 -0.309,0 -0.618,-0.1691 -0.925,-0.5082 v -1.8871 c 0,-0.241 0.014,-0.3899 0.042,-0.4481 0.036,-0.0757 0.087,-0.1316 0.151,-0.166 0.064,-0.0347 0.194,-0.0539 0.388,-0.0539 v -0.1398 h -1.768 v 0.1398 h 0.078 c 0.181,0 0.304,0.0473 0.37,0.1391 0.061,0.093 0.094,0.2691 0.094,0.5289 v 1.3301 c 0,0.4289 -0.009,0.6902 -0.03,0.784 -0.018,0.0941 -0.05,0.1582 -0.09,0.1921 -0.04,0.0329 -0.093,0.05 -0.162,0.05 -0.072,0 -0.16,-0.0203 -0.26,-0.0582 l -0.06,0.1411 1.079,0.4371 h 0.168 v -0.7582"
       style="fill:#231f20;fill-opacity:1;fill-rule:evenodd;stroke:none;stroke-width:0.1"
       id="path75" /><path
       d="m 113.637,27.0609 c -0.003,-0.532 0.126,-0.948 0.386,-1.2507 0.26,-0.3012 0.568,-0.452 0.917,-0.452 0.236,0 0.44,0.0637 0.613,0.1938 0.173,0.1281 0.316,0.3492 0.434,0.6609 l 0.121,-0.077 c -0.054,-0.3578 -0.213,-0.6828 -0.475,-0.975 -0.265,-0.2929 -0.594,-0.4398 -0.989,-0.4398 -0.43,0 -0.798,0.1668 -1.104,0.5008 -0.307,0.3351 -0.459,0.7863 -0.459,1.3511 0,0.6122 0.156,1.0891 0.472,1.4309 0.313,0.3422 0.707,0.5141 1.181,0.5141 0.402,0 0.731,-0.1321 0.988,-0.3969 0.257,-0.2641 0.386,-0.6172 0.386,-1.0602 z m 0,0.227 h 1.655 c -0.013,0.2293 -0.04,0.3902 -0.083,0.484 -0.064,0.1453 -0.16,0.2601 -0.29,0.3441 -0.13,0.082 -0.264,0.125 -0.403,0.125 -0.216,0 -0.411,-0.084 -0.581,-0.2519 -0.17,-0.168 -0.271,-0.4032 -0.298,-0.7012"
       style="fill:#231f20;fill-opacity:1;fill-rule:evenodd;stroke:none;stroke-width:0.1"
       id="path77" /><path
       d="m 19.1047,62.4336 c 0.0883,-0.15 0.1492,-0.2918 0.184,-0.4219 0.0332,-0.132 0.066,-0.391 0.1019,-0.7762 l 0.1711,-1.9207 c 0.1563,0.186 0.3832,0.4829 0.6801,0.8899 0.143,0.198 0.3199,0.4672 0.5309,0.8082 0.1281,0.2078 0.205,0.3547 0.2339,0.4367 0.0153,0.0422 0.0231,0.0859 0.0231,0.1301 0,0.0281 -0.0078,0.0519 -0.027,0.0711 -0.0179,0.0168 -0.0648,0.0379 -0.1418,0.0629 -0.0781,0.0242 -0.1421,0.0711 -0.1921,0.1359 -0.0508,0.0672 -0.0758,0.143 -0.0758,0.2301 0,0.107 0.0316,0.1922 0.0937,0.257 0.0621,0.066 0.141,0.0969 0.234,0.0969 0.1152,0 0.2121,-0.0457 0.293,-0.1418 0.0812,-0.0949 0.1211,-0.2262 0.1211,-0.3922 0,-0.2051 -0.0692,-0.4418 -0.2102,-0.7051 -0.1418,-0.2636 -0.4117,-0.6699 -0.8137,-1.2168 -0.3992,-0.5468 -0.8863,-1.1429 -1.455,-1.789 -0.3942,-0.4449 -0.686,-0.727 -0.877,-0.8418 -0.1891,-0.1153 -0.3519,-0.1742 -0.4871,-0.1742 -0.0801,0 -0.1531,0.0312 -0.2141,0.0921 -0.0609,0.0618 -0.091,0.1321 -0.091,0.2141 0,0.1008 0.0422,0.193 0.127,0.277 0.084,0.0828 0.1761,0.1238 0.275,0.1238 0.0531,0 0.0961,-0.0109 0.1293,-0.0352 0.0218,-0.0129 0.0437,-0.05 0.0687,-0.1117 0.025,-0.0601 0.0473,-0.1012 0.068,-0.1223 0.0121,-0.0136 0.0293,-0.0187 0.0473,-0.0187 0.0148,0 0.0429,0.0121 0.0808,0.0391 0.1442,0.0879 0.311,0.2289 0.5,0.4207 0.2512,0.2562 0.4352,0.464 0.5559,0.625 l -0.2188,2.4761 c -0.0359,0.409 -0.091,0.659 -0.1652,0.7469 -0.0731,0.0883 -0.1938,0.1332 -0.366,0.1332 -0.0547,0 -0.1528,-0.0082 -0.2918,-0.0242 l -0.036,0.1441 1.1438,0.2809"
       style="fill:#231f20;fill-opacity:1;fill-rule:evenodd;stroke:none;stroke-width:0.1"
       id="path79" /><path
       d="m 23.5219,62.3488 h 4.21602 V 62.028878 H 23.5219 Z m 0,-1.273 h 4.21602 V 60.755878 H 23.5219 Z"
       style="fill:#231f20;fill-opacity:1;fill-rule:evenodd;stroke:none;stroke-width:0.1"
       id="path81" /><path
       d="m 30.1789,61.5168 c 0,0.6039 0.091,1.1238 0.2738,1.5598 0.1821,0.4363 0.4243,0.7613 0.7262,0.975 0.2348,0.1691 0.4758,0.2543 0.727,0.2543 0.405,0 0.7711,-0.2071 1.0929,-0.6211 0.4039,-0.5129 0.6059,-1.2082 0.6059,-2.0871 0,-0.6141 -0.0879,-1.1348 -0.266,-1.5649 -0.1758,-0.4301 -0.402,-0.7422 -0.6758,-0.9359 -0.2762,-0.1953 -0.541,-0.2903 -0.7973,-0.2903 -0.5039,0 -0.925,0.2973 -1.2609,0.8942 -0.284,0.5031 -0.4258,1.1078 -0.4258,1.816 z m 0.766,-0.0973 c 0,-0.7289 0.0891,-1.3257 0.2688,-1.7847 0.148,-0.3879 0.3711,-0.5832 0.664,-0.5832 0.1411,0 0.2871,0.064 0.4371,0.189 0.152,0.127 0.2668,0.3391 0.3442,0.6352 0.1199,0.448 0.1797,1.0801 0.1797,1.8949 0,0.6039 -0.0617,1.1078 -0.1879,1.5109 -0.0918,0.3 -0.2141,0.5122 -0.3621,0.6379 -0.1059,0.0852 -0.236,0.1282 -0.3867,0.1282 -0.1762,0 -0.3352,-0.0789 -0.4731,-0.2372 -0.1871,-0.216 -0.3152,-0.557 -0.3832,-1.0207 -0.068,-0.464 -0.1008,-0.9191 -0.1008,-1.3703"
       style="fill:#231f20;fill-opacity:1;fill-rule:evenodd;stroke:none;stroke-width:0.1"
       id="path83" /><path
       d="m 35.8816,62.1227 1.1012,0.4449 h 0.15 v -0.836 c 0.184,0.3153 0.3692,0.536 0.5559,0.6622 0.1859,0.1257 0.382,0.1898 0.5883,0.1898 0.3597,0 0.6578,-0.141 0.8976,-0.4231 0.2953,-0.3437 0.4422,-0.7898 0.4422,-1.3437 0,-0.616 -0.1781,-1.127 -0.532,-1.5301 -0.291,-0.3308 -0.659,-0.4961 -1.102,-0.4961 -0.1922,0 -0.3582,0.0262 -0.5,0.0821 -0.1039,0.039 -0.2211,0.116 -0.35,0.2339 v -1.0898 c 0,-0.2449 0.0141,-0.4 0.0442,-0.466 0.0296,-0.0672 0.082,-0.1199 0.157,-0.159 0.0726,-0.0391 0.2078,-0.059 0.4039,-0.059 v -0.1441 h -1.875 v 0.1441 h 0.098 c 0.143,-0.0019 0.2649,0.0258 0.3668,0.0828 0.0493,0.0282 0.0871,0.075 0.1153,0.1391 0.0269,0.0641 0.0398,0.225 0.0398,0.4851 v 3.384 c 0,0.2309 -0.0082,0.3789 -0.0301,0.441 -0.0218,0.0629 -0.055,0.1098 -0.1,0.1399 -0.0449,0.032 -0.107,0.0469 -0.1859,0.0469 -0.0621,0 -0.141,-0.018 -0.2379,-0.0547 z m 1.2512,-0.6219 v -1.336 c 0,-0.289 0.0102,-0.4781 0.034,-0.5703 0.0359,-0.1507 0.1262,-0.2828 0.268,-0.3976 0.1429,-0.1153 0.3199,-0.1723 0.539,-0.1723 0.259,0 0.4692,0.102 0.6309,0.3043 0.2101,0.2656 0.316,0.6399 0.316,1.1207 0,0.5473 -0.1187,0.968 -0.359,1.2621 -0.1668,0.2039 -0.3648,0.3051 -0.5929,0.3051 -0.1258,0 -0.25,-0.032 -0.3711,-0.093 -0.095,-0.048 -0.2481,-0.1883 -0.4649,-0.423"
       style="fill:#231f20;fill-opacity:1;fill-rule:evenodd;stroke:none;stroke-width:0.1"
       id="path85" /><path
       d="m 41.3707,64.4539 v -4.7461 c 0,-0.2242 0.016,-0.3723 0.0481,-0.4461 0.032,-0.0719 0.0832,-0.1269 0.1511,-0.1648 0.068,-0.0371 0.193,-0.0571 0.3778,-0.0571 v -0.1402 h -1.7528 v 0.1402 c 0.1641,0 0.2758,0.0168 0.3348,0.052 0.0601,0.0328 0.1082,0.0891 0.141,0.168 0.0352,0.0769 0.052,0.2269 0.052,0.448 v 3.25 c 0,0.4039 -0.0098,0.652 -0.0278,0.7449 -0.0179,0.0911 -0.048,0.1551 -0.0883,0.1891 -0.041,0.0348 -0.091,0.05 -0.1527,0.05 -0.0691,0 -0.1551,-0.0191 -0.259,-0.0621 l -0.066,0.1371 1.066,0.4371 h 0.1758"
       style="fill:#231f20;fill-opacity:1;fill-rule:evenodd;stroke:none;stroke-width:0.1"
       id="path87" /><path
       d="m 44.3906,59.4156 c -0.3679,-0.284 -0.5976,-0.448 -0.6929,-0.4918 -0.1387,-0.0652 -0.2887,-0.0992 -0.4481,-0.0992 -0.2476,0 -0.4519,0.0859 -0.6117,0.2551 -0.1602,0.1691 -0.2402,0.3922 -0.2402,0.668 0,0.175 0.039,0.325 0.1179,0.4531 0.1063,0.1758 0.2922,0.343 0.5551,0.5 0.2641,0.1558 0.7039,0.3461 1.3199,0.5687 v 0.1422 c 0,0.3559 -0.0566,0.6012 -0.1707,0.734 -0.1133,0.132 -0.2781,0.1988 -0.4941,0.1988 -0.1641,0 -0.2942,-0.0437 -0.391,-0.1328 -0.0989,-0.0879 -0.1481,-0.189 -0.1481,-0.3039 l 0.0082,-0.2269 c 0,-0.1204 -0.0301,-0.2121 -0.0922,-0.277 -0.0609,-0.0652 -0.141,-0.098 -0.2398,-0.098 -0.0961,0 -0.1762,0.0339 -0.2371,0.1019 -0.061,0.068 -0.0918,0.1598 -0.0918,0.277 0,0.2238 0.1148,0.43 0.3437,0.6179 0.2289,0.186 0.5512,0.2809 0.9653,0.2809 0.3187,0 0.5777,-0.0539 0.7816,-0.1598 0.1531,-0.0812 0.2672,-0.2082 0.3391,-0.38 0.0472,-0.1122 0.0703,-0.3399 0.0703,-0.6872 v -1.214 c 0,-0.3418 0.0058,-0.5508 0.0199,-0.6289 0.0129,-0.0758 0.0348,-0.127 0.0641,-0.1532 0.0297,-0.0269 0.066,-0.0398 0.1047,-0.0398 0.0402,0 0.0769,0.009 0.1082,0.0281 0.055,0.034 0.1597,0.1289 0.316,0.286 v -0.2192 c -0.291,-0.391 -0.5692,-0.5867 -0.836,-0.5867 -0.1261,0 -0.2281,0.0438 -0.3043,0.134 -0.075,0.0879 -0.1136,0.2398 -0.116,0.4527 z m 0,0.2532 v 1.364 c -0.3937,-0.157 -0.6476,-0.268 -0.7617,-0.332 -0.207,-0.1141 -0.3543,-0.234 -0.4422,-0.3602 -0.0879,-0.125 -0.1328,-0.2609 -0.1328,-0.4097 0,-0.1871 0.0559,-0.343 0.1688,-0.4672 0.1113,-0.1231 0.2402,-0.1848 0.3863,-0.1848 0.1988,0 0.4578,0.1297 0.7816,0.3899"
       style="fill:#231f20;fill-opacity:1;fill-rule:evenodd;stroke:none;stroke-width:0.1"
       id="path89" /><path
       d="m 46.9566,61.8246 c 0.418,0.5063 0.818,0.759 1.1981,0.759 0.1961,0 0.3641,-0.05 0.5043,-0.1469 0.1418,-0.0969 0.2547,-0.259 0.3367,-0.4828 0.057,-0.1551 0.0852,-0.3961 0.0852,-0.7184 v -1.5277 c 0,-0.225 0.0179,-0.3801 0.055,-0.4601 0.0289,-0.0649 0.075,-0.1161 0.1387,-0.1532 0.0633,-0.0359 0.1813,-0.0547 0.3543,-0.0547 v -0.1402 h -1.7711 v 0.1402 h 0.0762 c 0.1656,0 0.2828,0.027 0.3476,0.077 0.0672,0.0508 0.1133,0.1258 0.1383,0.2238 0.011,0.0391 0.0168,0.1621 0.0168,0.3672 v 1.4649 c 0,0.325 -0.0429,0.5621 -0.1269,0.7089 -0.084,0.1473 -0.2282,0.22 -0.4282,0.22 -0.3089,0 -0.6187,-0.1688 -0.925,-0.5078 v -1.886 c 0,-0.241 0.0133,-0.391 0.0422,-0.448 0.0371,-0.0762 0.0871,-0.1321 0.1508,-0.1672 0.0641,-0.034 0.1934,-0.0528 0.3891,-0.0528 v -0.1402 h -1.7699 v 0.1402 h 0.0789 c 0.1812,0 0.3043,0.0469 0.3691,0.1391 0.0621,0.093 0.0941,0.2688 0.0941,0.5289 v 1.3289 c 0,0.4301 -0.0089,0.691 -0.0293,0.784 -0.0187,0.0949 -0.05,0.159 -0.0898,0.1922 -0.0398,0.034 -0.093,0.0508 -0.1621,0.0508 -0.0719,0 -0.159,-0.0199 -0.2609,-0.059 l -0.059,0.141 1.0789,0.4379 h 0.1679 v -0.759"
       style="fill:#231f20;fill-opacity:1;fill-rule:evenodd;stroke:none;stroke-width:0.1"
       id="path91" /><path
       d="m 50.5156,61.1297 c -0.0039,-0.532 0.125,-0.9469 0.3864,-1.25 0.2609,-0.3008 0.566,-0.452 0.9168,-0.452 0.2351,0 0.439,0.0641 0.6128,0.193 0.1723,0.1281 0.3161,0.35 0.434,0.6621 l 0.1211,-0.0781 c -0.0539,-0.357 -0.2129,-0.682 -0.4758,-0.9738 -0.264,-0.2942 -0.5929,-0.4403 -0.9882,-0.4403 -0.4309,0 -0.7981,0.166 -1.1039,0.5012 -0.3071,0.334 -0.459,0.7848 -0.459,1.3508 0,0.6121 0.1558,1.089 0.4718,1.4301 0.3141,0.3429 0.7063,0.5152 1.1801,0.5152 0.4031,0 0.7313,-0.132 0.9891,-0.3973 0.257,-0.2648 0.3859,-0.6179 0.3859,-1.0609 z m 0,0.2269 h 1.6551 c -0.0129,0.2301 -0.0398,0.3911 -0.0828,0.484 -0.0641,0.1461 -0.1609,0.2602 -0.2902,0.3442 -0.1297,0.0828 -0.2637,0.1257 -0.4039,0.1257 -0.2161,0 -0.4098,-0.0839 -0.5801,-0.2519 -0.1707,-0.1688 -0.2707,-0.4027 -0.2981,-0.702"
       style="fill:#231f20;fill-opacity:1;fill-rule:evenodd;stroke:none;stroke-width:0.1"
       id="path93" /><path
       d="m 85.052317,41.262872 c 0.6891,0 1.2852,-0.2601 1.7883,-0.7832 0.5039,-0.5218 0.7559,-1.173 0.7559,-1.9539 0,-0.8058 -0.2539,-1.4738 -0.761,-2.0039 -0.5082,-0.532 -1.123,-0.798 -1.8441,-0.798 -0.7289,0 -1.343,0.2597 -1.8391,0.7781 -0.4957,0.518 -0.7429,1.1887 -0.7429,2.0117 0,0.841 0.2863,1.5262 0.8582,2.0582 0.4988,0.4617 1.0929,0.691 1.7847,0.691 z m -0.0726,-0.284 c -0.4742,0 -0.8543,-0.1761 -1.141,-0.5281 -0.3563,-0.4371 -0.5352,-1.0769 -0.5352,-1.9219 0,-0.8652 0.1852,-1.53 0.5551,-1.9953 0.284,-0.3547 0.6578,-0.5316 1.125,-0.5316 0.4969,0 0.9078,0.1937 1.232,0.5816 0.325,0.3883 0.4879,1 0.4879,1.8364 0,0.9058 -0.1801,1.5808 -0.5359,2.0269 -0.2871,0.3551 -0.6832,0.532 -1.1879,0.532"
       style="fill:#00adef;fill-opacity:1;fill-rule:evenodd;stroke:none;stroke-width:0.1"
       id="path95" /><path
       d="m 89.203517,39.529672 v -0.8058 c 0.2981,0.5379 0.6051,0.8058 0.9211,0.8058 0.141,0 0.2598,-0.0437 0.3551,-0.1308 0.093,-0.0879 0.1406,-0.1891 0.1406,-0.3032 0,-0.1019 -0.0328,-0.1878 -0.1027,-0.2578 -0.0672,-0.0711 -0.1473,-0.1062 -0.2422,-0.1062 -0.091,0 -0.1918,0.0461 -0.307,0.1351 -0.1129,0.0891 -0.1969,0.1352 -0.252,0.1352 -0.0449,0 -0.0961,-0.0262 -0.1519,-0.0781 -0.1168,-0.1071 -0.2372,-0.2821 -0.361,-0.5282 v -1.714 c 0,-0.1981 0.0219,-0.3481 0.0719,-0.45 0.0351,-0.0699 0.0949,-0.1289 0.1812,-0.1758 0.0868,-0.0461 0.209,-0.0699 0.3707,-0.0699 v -0.1403 h -1.832 v 0.1403 c 0.1813,0 0.3172,0.0289 0.4051,0.0859 0.066,0.0418 0.1109,0.1078 0.1383,0.1988 0.0117,0.045 0.0179,0.1711 0.0179,0.3801 v 1.3871 c 0,0.416 -0.0082,0.6641 -0.025,0.743 -0.016,0.0789 -0.048,0.1379 -0.0941,0.1738 -0.0449,0.036 -0.1012,0.0551 -0.1699,0.0551 -0.0801,0 -0.1711,-0.0199 -0.2723,-0.059 l -0.0387,0.141 1.0829,0.4379 h 0.164"
       style="fill:#00adef;fill-opacity:1;fill-rule:evenodd;stroke:none;stroke-width:0.1"
       id="path97" /><path
       d="m 91.728517,41.399572 c 0.1102,0 0.2031,-0.0378 0.2801,-0.1136 0.0769,-0.0781 0.116,-0.1711 0.116,-0.2801 0,-0.1102 -0.0391,-0.2031 -0.116,-0.282 -0.077,-0.077 -0.1699,-0.1172 -0.2801,-0.1172 -0.1082,0 -0.2031,0.0402 -0.2808,0.1172 -0.0762,0.0789 -0.1161,0.1718 -0.1161,0.282 0,0.109 0.0379,0.202 0.1149,0.2801 0.075,0.0758 0.1711,0.1136 0.282,0.1136 z m 0.3238,-1.8699 v -2.8758 c 0,-0.2242 0.0161,-0.3722 0.0493,-0.4472 0.032,-0.075 0.08,-0.1289 0.1449,-0.1668 0.0629,-0.036 0.1808,-0.0539 0.35,-0.0539 v -0.1403 h -1.7379 v 0.1403 c 0.175,0 0.2918,0.0168 0.3508,0.0519 0.059,0.0328 0.107,0.0891 0.1422,0.168 0.0359,0.077 0.0531,0.2258 0.0531,0.448 v 1.3797 c 0,0.3871 -0.0121,0.6383 -0.0332,0.7532 -0.0199,0.0839 -0.0488,0.141 -0.0871,0.173 -0.0391,0.034 -0.093,0.05 -0.1598,0.05 -0.0742,0 -0.1609,-0.0199 -0.266,-0.059 l -0.0551,0.141 1.077,0.4379 h 0.1718"
       style="fill:#00adef;fill-opacity:1;fill-rule:evenodd;stroke:none;stroke-width:0.1"
       id="path99" /><path
       d="m 93.999617,37.150772 c -0.2199,0.1071 -0.3883,0.2551 -0.5043,0.4469 -0.1187,0.1922 -0.1758,0.4019 -0.1758,0.634 0,0.3551 0.134,0.659 0.4,0.9152 0.266,0.2551 0.609,0.3828 1.0258,0.3828 0.341,0 0.6352,-0.084 0.8863,-0.2508 h 0.7571 c 0.1129,0 0.1769,-0.0031 0.1968,-0.0089 0.0161,-0.0071 0.0309,-0.018 0.0391,-0.034 0.0149,-0.0242 0.0231,-0.0653 0.0231,-0.125 0,-0.068 -0.0071,-0.1153 -0.0192,-0.1403 -0.0082,-0.0128 -0.023,-0.0238 -0.041,-0.032 -0.0199,-0.0078 -0.0859,-0.0109 -0.1988,-0.0109 h -0.4641 c 0.1449,-0.1879 0.2188,-0.4282 0.2188,-0.7199 0,-0.3333 -0.1278,-0.6172 -0.3829,-0.854 -0.255,-0.2382 -0.598,-0.3562 -1.0281,-0.3562 -0.1769,0 -0.3558,0.0262 -0.5429,0.0781 -0.1129,-0.098 -0.1899,-0.1851 -0.2301,-0.2601 -0.0418,-0.0739 -0.0629,-0.1368 -0.0629,-0.1887 0,-0.0441 0.023,-0.0871 0.0648,-0.1293 0.0442,-0.0418 0.1274,-0.0707 0.2512,-0.0898 0.0738,-0.0102 0.2559,-0.02 0.548,-0.0282 0.536,-0.0117 0.884,-0.0301 1.043,-0.0539 0.2418,-0.034 0.434,-0.123 0.5801,-0.2699 0.1437,-0.1449 0.216,-0.325 0.216,-0.5379 0,-0.2953 -0.1371,-0.5711 -0.4133,-0.8281 -0.4066,-0.3801 -0.9347,-0.5711 -1.5898,-0.5711 -0.5031,0 -0.927,0.1141 -1.275,0.3398 -0.193,0.1313 -0.2918,0.2653 -0.2918,0.4071 0,0.0621 0.0148,0.1242 0.043,0.1863 0.0449,0.0976 0.1367,0.2309 0.2738,0.4027 0.018,0.0242 0.1512,0.1641 0.3988,0.4211 -0.1367,0.0821 -0.2316,0.1539 -0.2859,0.218 -0.0578,0.0641 -0.084,0.1359 -0.084,0.2172 0,0.091 0.0359,0.1969 0.109,0.3199 0.075,0.123 0.2453,0.2961 0.5152,0.5199 z m 0.6789,2.191 c -0.193,0 -0.3551,-0.0781 -0.4851,-0.2308 -0.1297,-0.1531 -0.1938,-0.3891 -0.1938,-0.7071 0,-0.4121 0.0891,-0.73 0.2649,-0.957 0.1351,-0.1723 0.307,-0.257 0.5152,-0.257 0.1976,0 0.3609,0.073 0.4879,0.2219 0.1277,0.148 0.1929,0.382 0.1929,0.6992 0,0.4148 -0.0902,0.7386 -0.271,0.9726 -0.1329,0.1723 -0.304,0.2582 -0.511,0.2582 z m -0.718,-3.4961 c -0.123,-0.1339 -0.2152,-0.2558 -0.2789,-0.3711 -0.0613,-0.1148 -0.0929,-0.2199 -0.0929,-0.3167 0,-0.1243 0.0758,-0.234 0.2269,-0.3282 0.261,-0.1617 0.6367,-0.2418 1.1278,-0.2418 0.4703,0 0.8152,0.0828 1.0371,0.2481 0.2242,0.166 0.3351,0.3418 0.3351,0.5297 0,0.1339 -0.066,0.23 -0.1992,0.2882 -0.1359,0.0571 -0.4039,0.0918 -0.8051,0.102 -0.5867,0.0148 -1.0379,0.0461 -1.3508,0.0898"
       style="fill:#00adef;fill-opacity:1;fill-rule:evenodd;stroke:none;stroke-width:0.1"
       id="path101" /><path
       d="m 97.952317,41.399572 c 0.1082,0 0.2012,-0.0378 0.2793,-0.1136 0.0758,-0.0781 0.1141,-0.1711 0.1141,-0.2801 0,-0.1102 -0.0383,-0.2031 -0.1141,-0.282 -0.0781,-0.077 -0.1711,-0.1172 -0.2793,-0.1172 -0.1109,0 -0.2027,0.0402 -0.2828,0.1172 -0.0769,0.0789 -0.1172,0.1718 -0.1172,0.282 0,0.109 0.0391,0.202 0.1172,0.2801 0.0758,0.0758 0.17,0.1136 0.2828,0.1136 z m 0.3231,-1.8699 v -2.8758 c 0,-0.2242 0.0172,-0.3722 0.05,-0.4472 0.0312,-0.075 0.0793,-0.1289 0.143,-0.1668 0.0652,-0.036 0.1812,-0.0539 0.3511,-0.0539 v -0.1403 h -1.7379 v 0.1403 c 0.1739,0 0.2918,0.0168 0.35,0.0519 0.061,0.0328 0.109,0.0891 0.1418,0.168 0.036,0.077 0.0551,0.2258 0.0551,0.448 v 1.3797 c 0,0.3871 -0.0121,0.6383 -0.0359,0.7532 -0.0192,0.0839 -0.0473,0.141 -0.0871,0.173 -0.0379,0.034 -0.091,0.05 -0.1598,0.05 -0.073,0 -0.1613,-0.0199 -0.2641,-0.059 l -0.0562,0.141 1.0781,0.4379 h 0.1719"
       style="fill:#00adef;fill-opacity:1;fill-rule:evenodd;stroke:none;stroke-width:0.1"
       id="path103" /><path
       d="m 100.30742,38.770672 c 0.418,0.5051 0.8192,0.759 1.1981,0.759 0.1968,0 0.3648,-0.05 0.5039,-0.1468 0.1422,-0.0981 0.2543,-0.259 0.3363,-0.4833 0.0578,-0.1558 0.0848,-0.3957 0.0848,-0.7179 v -1.5278 c 0,-0.2261 0.0199,-0.38 0.057,-0.4601 0.0281,-0.066 0.0738,-0.116 0.1391,-0.1539 0.0621,-0.036 0.1808,-0.0539 0.3531,-0.0539 v -0.1403 h -1.7703 v 0.1403 h 0.075 c 0.166,0 0.2832,0.0258 0.348,0.0769 0.068,0.0508 0.1141,0.125 0.1391,0.2239 0.0101,0.039 0.0172,0.1609 0.0172,0.3671 v 1.4649 c 0,0.325 -0.0434,0.5609 -0.1274,0.709 -0.0847,0.1468 -0.2289,0.2199 -0.4289,0.2199 -0.309,0 -0.6187,-0.1688 -0.925,-0.5078 v -1.886 c 0,-0.2421 0.0133,-0.391 0.0422,-0.448 0.0359,-0.0762 0.0867,-0.132 0.152,-0.1672 0.0629,-0.0348 0.1918,-0.0527 0.3871,-0.0527 v -0.1403 h -1.768403 v 0.1403 h 0.0774 c 0.1828,0 0.307,0.0457 0.3699,0.1379 0.0629,0.0937 0.0949,0.2699 0.0949,0.53 v 1.329 c 0,0.4289 -0.0102,0.6898 -0.0301,0.7839 -0.0187,0.095 -0.048,0.1578 -0.0879,0.1918 -0.0398,0.0332 -0.0961,0.0512 -0.164,0.0512 -0.0719,0 -0.1598,-0.0199 -0.2602,-0.059 l -0.0598,0.141 1.079003,0.4379 h 0.1679 v -0.759"
       style="fill:#00adef;fill-opacity:1;fill-rule:evenodd;stroke:none;stroke-width:0.1"
       id="path105" /><g
       id="g239"
       transform="matrix(0,-0.45784523,2.0519191,0,-27.739797,73.101222)"><path
         d="M 76.834,52.7379 69.1547,47.7027"
         style="fill:none;stroke:#00adef;stroke-width:0.283;stroke-linecap:butt;stroke-linejoin:miter;stroke-miterlimit:2.613;stroke-dasharray:none;stroke-opacity:1"
         id="path107" /><path
         d="m 66.109,45.7059 4.1277,1.223 c -0.9461,0.3688 -1.4,1.0609 -1.3609,2.0746 L 66.109,45.7059"
         style="fill:#00adef;fill-opacity:1;fill-rule:evenodd;stroke:none;stroke-width:0.1"
         id="path109" /></g></g></svg>
