%YAML 1.1
%TAG !u! tag:unity3d.com,2011:
--- !u!74 &7400000
AnimationClip:
  m_ObjectHideFlags: 0
  m_CorrespondingSourceObject: {fileID: 0}
  m_PrefabInstance: {fileID: 0}
  m_PrefabAsset: {fileID: 0}
  m_Name: New Animation
  serializedVersion: 6
  m_Legacy: 0
  m_Compressed: 0
  m_UseHighQualityCurve: 1
  m_RotationCurves: []
  m_CompressedRotationCurves: []
  m_EulerCurves: []
  m_PositionCurves: []
  m_ScaleCurves: []
  m_FloatCurves: []
  m_PPtrCurves:
  - curve:
    - time: 0
      value: {fileID: 736105051, guid: 821d514fbb07d1b4d9e838e820bd0d97, type: 3}
    - time: 0.083333336
      value: {fileID: -758256388, guid: 821d514fbb07d1b4d9e838e820bd0d97, type: 3}
    - time: 0.16666667
      value: {fileID: 1474623604, guid: 821d514fbb07d1b4d9e838e820bd0d97, type: 3}
    - time: 0.25
      value: {fileID: -1179708909, guid: 821d514fbb07d1b4d9e838e820bd0d97, type: 3}
    - time: 0.33333334
      value: {fileID: -1561449363, guid: 821d514fbb07d1b4d9e838e820bd0d97, type: 3}
    - time: 0.41666666
      value: {fileID: -1084558855, guid: 821d514fbb07d1b4d9e838e820bd0d97, type: 3}
    - time: 0.45
      value: {fileID: 1250534938, guid: 821d514fbb07d1b4d9e838e820bd0d97, type: 3}
    - time: 0.5
      value: {fileID: -1866612870, guid: 821d514fbb07d1b4d9e838e820bd0d97, type: 3}
    - time: 0.5833333
      value: {fileID: 25243207, guid: 821d514fbb07d1b4d9e838e820bd0d97, type: 3}
    - time: 0.6666667
      value: {fileID: -1620849778, guid: 821d514fbb07d1b4d9e838e820bd0d97, type: 3}
    - time: 0.75
      value: {fileID: 196240973, guid: 821d514fbb07d1b4d9e838e820bd0d97, type: 3}
    - time: 0.8333333
      value: {fileID: 1569518468, guid: 821d514fbb07d1b4d9e838e820bd0d97, type: 3}
    - time: 0.85
      value: {fileID: 1250534938, guid: 821d514fbb07d1b4d9e838e820bd0d97, type: 3}
    - time: 0.8833333
      value: {fileID: -1609751080, guid: 821d514fbb07d1b4d9e838e820bd0d97, type: 3}
    - time: 0.9166667
      value: {fileID: -1013328397, guid: 821d514fbb07d1b4d9e838e820bd0d97, type: 3}
    - time: 1
      value: {fileID: 490660506, guid: 821d514fbb07d1b4d9e838e820bd0d97, type: 3}
    - time: 1.0833334
      value: {fileID: -1031034339, guid: 821d514fbb07d1b4d9e838e820bd0d97, type: 3}
    - time: 1.1666666
      value: {fileID: -324482973, guid: 821d514fbb07d1b4d9e838e820bd0d97, type: 3}
    - time: 1.25
      value: {fileID: 447324630, guid: 821d514fbb07d1b4d9e838e820bd0d97, type: 3}
    - time: 1.2833333
      value: {fileID: -703135517, guid: 821d514fbb07d1b4d9e838e820bd0d97, type: 3}
    - time: 1.3333334
      value: {fileID: -1609751080, guid: 821d514fbb07d1b4d9e838e820bd0d97, type: 3}
    attribute: m_Sprite
    path: 
    classID: 212
    script: {fileID: 0}
  m_SampleRate: 60
  m_WrapMode: 0
  m_Bounds:
    m_Center: {x: 0, y: 0, z: 0}
    m_Extent: {x: 0, y: 0, z: 0}
  m_ClipBindingConstant:
    genericBindings:
    - serializedVersion: 2
      path: 0
      attribute: 0
      script: {fileID: 0}
      typeID: 212
      customType: 23
      isPPtrCurve: 1
    pptrCurveMapping:
    - {fileID: 736105051, guid: 821d514fbb07d1b4d9e838e820bd0d97, type: 3}
    - {fileID: -758256388, guid: 821d514fbb07d1b4d9e838e820bd0d97, type: 3}
    - {fileID: 1474623604, guid: 821d514fbb07d1b4d9e838e820bd0d97, type: 3}
    - {fileID: -1179708909, guid: 821d514fbb07d1b4d9e838e820bd0d97, type: 3}
    - {fileID: -1561449363, guid: 821d514fbb07d1b4d9e838e820bd0d97, type: 3}
    - {fileID: -1084558855, guid: 821d514fbb07d1b4d9e838e820bd0d97, type: 3}
    - {fileID: 1250534938, guid: 821d514fbb07d1b4d9e838e820bd0d97, type: 3}
    - {fileID: -1866612870, guid: 821d514fbb07d1b4d9e838e820bd0d97, type: 3}
    - {fileID: 25243207, guid: 821d514fbb07d1b4d9e838e820bd0d97, type: 3}
    - {fileID: -1620849778, guid: 821d514fbb07d1b4d9e838e820bd0d97, type: 3}
    - {fileID: 196240973, guid: 821d514fbb07d1b4d9e838e820bd0d97, type: 3}
    - {fileID: 1569518468, guid: 821d514fbb07d1b4d9e838e820bd0d97, type: 3}
    - {fileID: 1250534938, guid: 821d514fbb07d1b4d9e838e820bd0d97, type: 3}
    - {fileID: -1609751080, guid: 821d514fbb07d1b4d9e838e820bd0d97, type: 3}
    - {fileID: -1013328397, guid: 821d514fbb07d1b4d9e838e820bd0d97, type: 3}
    - {fileID: 490660506, guid: 821d514fbb07d1b4d9e838e820bd0d97, type: 3}
    - {fileID: -1031034339, guid: 821d514fbb07d1b4d9e838e820bd0d97, type: 3}
    - {fileID: -324482973, guid: 821d514fbb07d1b4d9e838e820bd0d97, type: 3}
    - {fileID: 447324630, guid: 821d514fbb07d1b4d9e838e820bd0d97, type: 3}
    - {fileID: -703135517, guid: 821d514fbb07d1b4d9e838e820bd0d97, type: 3}
    - {fileID: -1609751080, guid: 821d514fbb07d1b4d9e838e820bd0d97, type: 3}
  m_AnimationClipSettings:
    serializedVersion: 2
    m_AdditiveReferencePoseClip: {fileID: 0}
    m_AdditiveReferencePoseTime: 0
    m_StartTime: 0
    m_StopTime: 1.35
    m_OrientationOffsetY: 0
    m_Level: 0
    m_CycleOffset: 0
    m_HasAdditiveReferencePose: 0
    m_LoopTime: 1
    m_LoopBlend: 0
    m_LoopBlendOrientation: 0
    m_LoopBlendPositionY: 0
    m_LoopBlendPositionXZ: 0
    m_KeepOriginalOrientation: 0
    m_KeepOriginalPositionY: 1
    m_KeepOriginalPositionXZ: 0
    m_HeightFromFeet: 0
    m_Mirror: 0
  m_EditorCurves: []
  m_EulerEditorCurves: []
  m_HasGenericRootTransform: 0
  m_HasMotionFloatCurves: 0
  m_Events: []
