%YAML 1.1
%TAG !u! tag:unity3d.com,2011:
--- !u!74 &7400000
AnimationClip:
  m_ObjectHideFlags: 0
  m_CorrespondingSourceObject: {fileID: 0}
  m_PrefabInstance: {fileID: 0}
  m_PrefabAsset: {fileID: 0}
  m_Name: Idle
  serializedVersion: 7
  m_Legacy: 0
  m_Compressed: 0
  m_UseHighQualityCurve: 1
  m_RotationCurves: []
  m_CompressedRotationCurves: []
  m_EulerCurves: []
  m_PositionCurves: []
  m_ScaleCurves: []
  m_FloatCurves: []
  m_PPtrCurves:
  - curve:
    - time: 0
      value: {fileID: 21300000, guid: a3a074749d66ea247864db994f23a149, type: 3}
    - time: 0.16666667
      value: {fileID: 21300000, guid: cbfcf4861c18c6f4bb5c2e1d52cca5be, type: 3}
    - time: 0.31666666
      value: {fileID: 21300000, guid: d0a71e0fd35a60a4380f7544acba556c, type: 3}
    - time: 0.5
      value: {fileID: 21300000, guid: e5fb3be8c6a37d649bf24d52c489f8cc, type: 3}
    - time: 0.65
      value: {fileID: 21300000, guid: 6f1baf8a504b9a947a3b79eb63457d9f, type: 3}
    - time: 0.8333333
      value: {fileID: 21300000, guid: 542dbc31d35d1364f85005abd53ede73, type: 3}
    - time: 1
      value: {fileID: 21300000, guid: 66811dd59612a7b4283b72ae2a8fec91, type: 3}
    - time: 1.1666666
      value: {fileID: 21300000, guid: 14b4780509e20174b8b33f1705347c03, type: 3}
    - time: 1.3333334
      value: {fileID: 21300000, guid: 14b4780509e20174b8b33f1705347c03, type: 3}
    attribute: m_Sprite
    path: 
    classID: 212
    script: {fileID: 0}
  m_SampleRate: 60
  m_WrapMode: 0
  m_Bounds:
    m_Center: {x: 0, y: 0, z: 0}
    m_Extent: {x: 0, y: 0, z: 0}
  m_ClipBindingConstant:
    genericBindings:
    - serializedVersion: 2
      path: 0
      attribute: 0
      script: {fileID: 0}
      typeID: 212
      customType: 23
      isPPtrCurve: 1
      isIntCurve: 0
    pptrCurveMapping:
    - {fileID: 21300000, guid: a3a074749d66ea247864db994f23a149, type: 3}
    - {fileID: 21300000, guid: cbfcf4861c18c6f4bb5c2e1d52cca5be, type: 3}
    - {fileID: 21300000, guid: d0a71e0fd35a60a4380f7544acba556c, type: 3}
    - {fileID: 21300000, guid: e5fb3be8c6a37d649bf24d52c489f8cc, type: 3}
    - {fileID: 21300000, guid: 6f1baf8a504b9a947a3b79eb63457d9f, type: 3}
    - {fileID: 21300000, guid: 542dbc31d35d1364f85005abd53ede73, type: 3}
    - {fileID: 21300000, guid: 66811dd59612a7b4283b72ae2a8fec91, type: 3}
    - {fileID: 21300000, guid: 14b4780509e20174b8b33f1705347c03, type: 3}
    - {fileID: 21300000, guid: 14b4780509e20174b8b33f1705347c03, type: 3}
  m_AnimationClipSettings:
    serializedVersion: 2
    m_AdditiveReferencePoseClip: {fileID: 0}
    m_AdditiveReferencePoseTime: 0
    m_StartTime: 0
    m_StopTime: 1.35
    m_OrientationOffsetY: 0
    m_Level: 0
    m_CycleOffset: 0
    m_HasAdditiveReferencePose: 0
    m_LoopTime: 1
    m_LoopBlend: 0
    m_LoopBlendOrientation: 0
    m_LoopBlendPositionY: 0
    m_LoopBlendPositionXZ: 0
    m_KeepOriginalOrientation: 0
    m_KeepOriginalPositionY: 1
    m_KeepOriginalPositionXZ: 0
    m_HeightFromFeet: 0
    m_Mirror: 0
  m_EditorCurves: []
  m_EulerEditorCurves: []
  m_HasGenericRootTransform: 0
  m_HasMotionFloatCurves: 0
  m_Events: []
