%YAML 1.1
%TAG !u! tag:unity3d.com,2011:
--- !u!74 &7400000
AnimationClip:
  m_ObjectHideFlags: 0
  m_CorrespondingSourceObject: {fileID: 0}
  m_PrefabInstance: {fileID: 0}
  m_PrefabAsset: {fileID: 0}
  m_Name: Dying
  serializedVersion: 7
  m_Legacy: 0
  m_Compressed: 0
  m_UseHighQualityCurve: 1
  m_RotationCurves: []
  m_CompressedRotationCurves: []
  m_EulerCurves: []
  m_PositionCurves: []
  m_ScaleCurves: []
  m_FloatCurves: []
  m_PPtrCurves:
  - curve:
    - time: 0
      value: {fileID: 21300000, guid: d7f5d25b12d84b3469ac7ac51bd30393, type: 3}
    - time: 0.016666668
      value: {fileID: 21300000, guid: 06be672b25ee3ce458f83a309985b424, type: 3}
    - time: 0.033333335
      value: {fileID: 21300000, guid: 57976cf20f711b642bfcb44be3b165bb, type: 3}
    - time: 0.05
      value: {fileID: 21300000, guid: 60e361b6d5af0ab4fb87974fa4cf6bbe, type: 3}
    - time: 0.06666667
      value: {fileID: 21300000, guid: 8535a00f1e08d9e46a8b9309db40734f, type: 3}
    - time: 0.083333336
      value: {fileID: 21300000, guid: 51eb92eed43f08d47bc2c314863b9f9a, type: 3}
    - time: 0.1
      value: {fileID: 21300000, guid: 3180e546e6abd1e45bb2673dee017843, type: 3}
    - time: 0.11666667
      value: {fileID: 21300000, guid: 9e33c2d080811dd44bc828be59766448, type: 3}
    - time: 0.13333334
      value: {fileID: 21300000, guid: 2a14b62a582ba7a41a5cf90e61da7e88, type: 3}
    - time: 0.15
      value: {fileID: 21300000, guid: e446648abc4fc7a4e8e07f924968b14f, type: 3}
    - time: 0.16666667
      value: {fileID: 21300000, guid: 5c3439df861a8d5479b4db5122b1e3de, type: 3}
    - time: 0.18333334
      value: {fileID: 21300000, guid: c025573688c4f484dbb669724062a76a, type: 3}
    - time: 0.2
      value: {fileID: 21300000, guid: 39098065bc230d4449873802ba5be13f, type: 3}
    - time: 0.21666667
      value: {fileID: 21300000, guid: 618022eda3622f242bc780a37f9ea07f, type: 3}
    - time: 0.23333333
      value: {fileID: 21300000, guid: e0a31beceafd43546821d8385e546bbf, type: 3}
    - time: 0.25
      value: {fileID: 21300000, guid: 8f47e89e6ecf704478afdfbb00249bc9, type: 3}
    - time: 0.26666668
      value: {fileID: 21300000, guid: 0f3b72710c6d207438ab263b7534243f, type: 3}
    - time: 0.28333333
      value: {fileID: 21300000, guid: 92d1da80133089f4fbc09612a86effe4, type: 3}
    - time: 0.3
      value: {fileID: 21300000, guid: d8cd2f118e084ee45b20ac58d48f8189, type: 3}
    - time: 0.31666666
      value: {fileID: 21300000, guid: 8a66e9ff833bb4d41a866c7c08caff3a, type: 3}
    - time: 0.33333334
      value: {fileID: 21300000, guid: bdda2a7f2391fe343a3865deefbf2cfb, type: 3}
    - time: 0.35
      value: {fileID: 21300000, guid: d67bd759d36722a4ab60c99397318624, type: 3}
    - time: 0.36666667
      value: {fileID: 21300000, guid: 3f86be6a3704d1d47b4d32bb67bd239d, type: 3}
    - time: 0.38333333
      value: {fileID: 21300000, guid: fa131b5e2dd19a649ac8fe7618b31bf0, type: 3}
    - time: 0.4
      value: {fileID: 21300000, guid: 731253865d8793a4ca27c88ff8208f93, type: 3}
    - time: 0.41666666
      value: {fileID: 21300000, guid: 024ba4085a181414293a77a060a05f66, type: 3}
    - time: 0.43333334
      value: {fileID: 21300000, guid: 3d432045fc75b9440b47ef8faac0bc98, type: 3}
    - time: 0.45
      value: {fileID: 21300000, guid: 6d13f75a67a85a8489f475eae64b7f4f, type: 3}
    - time: 0.46666667
      value: {fileID: 21300000, guid: 6d3e35cb1941e7747b0c3b29b69b426e, type: 3}
    - time: 0.48333332
      value: {fileID: 21300000, guid: b9ba0d8e1f999754ca74c22fd743ebc1, type: 3}
    - time: 0.5
      value: {fileID: 21300000, guid: 5baa324bc465fb0469c163b98a4cb576, type: 3}
    - time: 0.51666665
      value: {fileID: 21300000, guid: 8569b5ba443ec2d4aadc66adde464bae, type: 3}
    - time: 0.53333336
      value: {fileID: 21300000, guid: 24b23f49fc653b144a3db6e7910543c9, type: 3}
    - time: 0.55
      value: {fileID: 21300000, guid: 7342c3c2f83225447bb351fc68021940, type: 3}
    - time: 0.56666666
      value: {fileID: 21300000, guid: a678af231fc3fc84abf727a6736f9a81, type: 3}
    - time: 0.5833333
      value: {fileID: 21300000, guid: 7af0ed8adb342ec4eaa28bc85786fe44, type: 3}
    - time: 0.6
      value: {fileID: 21300000, guid: b2c118daab5f4514d83d1b84c6d9f916, type: 3}
    - time: 0.6166667
      value: {fileID: 21300000, guid: acef81bfda3f8904892d85afc1d160b7, type: 3}
    - time: 0.6333333
      value: {fileID: 21300000, guid: 4155b186e17252d4dab81bb6724fb293, type: 3}
    - time: 0.65
      value: {fileID: 21300000, guid: d879651bd44bd1649823462ee79df602, type: 3}
    - time: 0.6666667
      value: {fileID: 21300000, guid: 09767a7a44e6ef643b057c446bee0018, type: 3}
    - time: 0.68333334
      value: {fileID: 21300000, guid: f9a3ea9180335254a83639b4ac7bc3e1, type: 3}
    - time: 0.7
      value: {fileID: 21300000, guid: 247f257358be3ab489a9da727f59c917, type: 3}
    - time: 0.71666664
      value: {fileID: 21300000, guid: 43e94c793cfbcd248ad6e59b0958e290, type: 3}
    - time: 0.73333335
      value: {fileID: 21300000, guid: 2937cc997fdf9014ca7c6d04315cbf24, type: 3}
    attribute: m_Sprite
    path: 
    classID: 212
    script: {fileID: 0}
  m_SampleRate: 60
  m_WrapMode: 0
  m_Bounds:
    m_Center: {x: 0, y: 0, z: 0}
    m_Extent: {x: 0, y: 0, z: 0}
  m_ClipBindingConstant:
    genericBindings:
    - serializedVersion: 2
      path: 0
      attribute: 0
      script: {fileID: 0}
      typeID: 212
      customType: 23
      isPPtrCurve: 1
      isIntCurve: 0
    pptrCurveMapping:
    - {fileID: 21300000, guid: d7f5d25b12d84b3469ac7ac51bd30393, type: 3}
    - {fileID: 21300000, guid: 06be672b25ee3ce458f83a309985b424, type: 3}
    - {fileID: 21300000, guid: 57976cf20f711b642bfcb44be3b165bb, type: 3}
    - {fileID: 21300000, guid: 60e361b6d5af0ab4fb87974fa4cf6bbe, type: 3}
    - {fileID: 21300000, guid: 8535a00f1e08d9e46a8b9309db40734f, type: 3}
    - {fileID: 21300000, guid: 51eb92eed43f08d47bc2c314863b9f9a, type: 3}
    - {fileID: 21300000, guid: 3180e546e6abd1e45bb2673dee017843, type: 3}
    - {fileID: 21300000, guid: 9e33c2d080811dd44bc828be59766448, type: 3}
    - {fileID: 21300000, guid: 2a14b62a582ba7a41a5cf90e61da7e88, type: 3}
    - {fileID: 21300000, guid: e446648abc4fc7a4e8e07f924968b14f, type: 3}
    - {fileID: 21300000, guid: 5c3439df861a8d5479b4db5122b1e3de, type: 3}
    - {fileID: 21300000, guid: c025573688c4f484dbb669724062a76a, type: 3}
    - {fileID: 21300000, guid: 39098065bc230d4449873802ba5be13f, type: 3}
    - {fileID: 21300000, guid: 618022eda3622f242bc780a37f9ea07f, type: 3}
    - {fileID: 21300000, guid: e0a31beceafd43546821d8385e546bbf, type: 3}
    - {fileID: 21300000, guid: 8f47e89e6ecf704478afdfbb00249bc9, type: 3}
    - {fileID: 21300000, guid: 0f3b72710c6d207438ab263b7534243f, type: 3}
    - {fileID: 21300000, guid: 92d1da80133089f4fbc09612a86effe4, type: 3}
    - {fileID: 21300000, guid: d8cd2f118e084ee45b20ac58d48f8189, type: 3}
    - {fileID: 21300000, guid: 8a66e9ff833bb4d41a866c7c08caff3a, type: 3}
    - {fileID: 21300000, guid: bdda2a7f2391fe343a3865deefbf2cfb, type: 3}
    - {fileID: 21300000, guid: d67bd759d36722a4ab60c99397318624, type: 3}
    - {fileID: 21300000, guid: 3f86be6a3704d1d47b4d32bb67bd239d, type: 3}
    - {fileID: 21300000, guid: fa131b5e2dd19a649ac8fe7618b31bf0, type: 3}
    - {fileID: 21300000, guid: 731253865d8793a4ca27c88ff8208f93, type: 3}
    - {fileID: 21300000, guid: 024ba4085a181414293a77a060a05f66, type: 3}
    - {fileID: 21300000, guid: 3d432045fc75b9440b47ef8faac0bc98, type: 3}
    - {fileID: 21300000, guid: 6d13f75a67a85a8489f475eae64b7f4f, type: 3}
    - {fileID: 21300000, guid: 6d3e35cb1941e7747b0c3b29b69b426e, type: 3}
    - {fileID: 21300000, guid: b9ba0d8e1f999754ca74c22fd743ebc1, type: 3}
    - {fileID: 21300000, guid: 5baa324bc465fb0469c163b98a4cb576, type: 3}
    - {fileID: 21300000, guid: 8569b5ba443ec2d4aadc66adde464bae, type: 3}
    - {fileID: 21300000, guid: 24b23f49fc653b144a3db6e7910543c9, type: 3}
    - {fileID: 21300000, guid: 7342c3c2f83225447bb351fc68021940, type: 3}
    - {fileID: 21300000, guid: a678af231fc3fc84abf727a6736f9a81, type: 3}
    - {fileID: 21300000, guid: 7af0ed8adb342ec4eaa28bc85786fe44, type: 3}
    - {fileID: 21300000, guid: b2c118daab5f4514d83d1b84c6d9f916, type: 3}
    - {fileID: 21300000, guid: acef81bfda3f8904892d85afc1d160b7, type: 3}
    - {fileID: 21300000, guid: 4155b186e17252d4dab81bb6724fb293, type: 3}
    - {fileID: 21300000, guid: d879651bd44bd1649823462ee79df602, type: 3}
    - {fileID: 21300000, guid: 09767a7a44e6ef643b057c446bee0018, type: 3}
    - {fileID: 21300000, guid: f9a3ea9180335254a83639b4ac7bc3e1, type: 3}
    - {fileID: 21300000, guid: 247f257358be3ab489a9da727f59c917, type: 3}
    - {fileID: 21300000, guid: 43e94c793cfbcd248ad6e59b0958e290, type: 3}
    - {fileID: 21300000, guid: 2937cc997fdf9014ca7c6d04315cbf24, type: 3}
  m_AnimationClipSettings:
    serializedVersion: 2
    m_AdditiveReferencePoseClip: {fileID: 0}
    m_AdditiveReferencePoseTime: 0
    m_StartTime: 0
    m_StopTime: 0.75
    m_OrientationOffsetY: 0
    m_Level: 0
    m_CycleOffset: 0
    m_HasAdditiveReferencePose: 0
    m_LoopTime: 1
    m_LoopBlend: 0
    m_LoopBlendOrientation: 0
    m_LoopBlendPositionY: 0
    m_LoopBlendPositionXZ: 0
    m_KeepOriginalOrientation: 0
    m_KeepOriginalPositionY: 1
    m_KeepOriginalPositionXZ: 0
    m_HeightFromFeet: 0
    m_Mirror: 0
  m_EditorCurves: []
  m_EulerEditorCurves: []
  m_HasGenericRootTransform: 0
  m_HasMotionFloatCurves: 0
  m_Events: []
