%YAML 1.1
%TAG !u! tag:unity3d.com,2011:
--- !u!29 &1
OcclusionCullingSettings:
  m_ObjectHideFlags: 0
  serializedVersion: 2
  m_OcclusionBakeSettings:
    smallestOccluder: 5
    smallestHole: 0.25
    backfaceThreshold: 100
  m_SceneGUID: 00000000000000000000000000000000
  m_OcclusionCullingData: {fileID: 0}
--- !u!104 &2
RenderSettings:
  m_ObjectHideFlags: 0
  serializedVersion: 9
  m_Fog: 0
  m_FogColor: {r: 0.5, g: 0.5, b: 0.5, a: 1}
  m_FogMode: 3
  m_FogDensity: 0.01
  m_LinearFogStart: 0
  m_LinearFogEnd: 300
  m_AmbientSkyColor: {r: 0.212, g: 0.227, b: 0.259, a: 1}
  m_AmbientEquatorColor: {r: 0.114, g: 0.125, b: 0.133, a: 1}
  m_AmbientGroundColor: {r: 0.047, g: 0.043, b: 0.035, a: 1}
  m_AmbientIntensity: 1
  m_AmbientMode: 3
  m_SubtractiveShadowColor: {r: 0.42, g: 0.478, b: 0.627, a: 1}
  m_SkyboxMaterial: {fileID: 0}
  m_HaloStrength: 0.5
  m_FlareStrength: 1
  m_FlareFadeSpeed: 3
  m_HaloTexture: {fileID: 0}
  m_SpotCookie: {fileID: 10001, guid: 0000000000000000e000000000000000, type: 0}
  m_DefaultReflectionMode: 0
  m_DefaultReflectionResolution: 128
  m_ReflectionBounces: 1
  m_ReflectionIntensity: 1
  m_CustomReflection: {fileID: 0}
  m_Sun: {fileID: 0}
  m_IndirectSpecularColor: {r: 0, g: 0, b: 0, a: 1}
  m_UseRadianceAmbientProbe: 0
--- !u!157 &3
LightmapSettings:
  m_ObjectHideFlags: 0
  serializedVersion: 12
  m_GIWorkflowMode: 1
  m_GISettings:
    serializedVersion: 2
    m_BounceScale: 1
    m_IndirectOutputScale: 1
    m_AlbedoBoost: 1
    m_EnvironmentLightingMode: 0
    m_EnableBakedLightmaps: 0
    m_EnableRealtimeLightmaps: 0
  m_LightmapEditorSettings:
    serializedVersion: 12
    m_Resolution: 2
    m_BakeResolution: 40
    m_AtlasSize: 1024
    m_AO: 0
    m_AOMaxDistance: 1
    m_CompAOExponent: 1
    m_CompAOExponentDirect: 0
    m_ExtractAmbientOcclusion: 0
    m_Padding: 2
    m_LightmapParameters: {fileID: 0}
    m_LightmapsBakeMode: 1
    m_TextureCompression: 1
    m_FinalGather: 0
    m_FinalGatherFiltering: 1
    m_FinalGatherRayCount: 256
    m_ReflectionCompression: 2
    m_MixedBakeMode: 2
    m_BakeBackend: 1
    m_PVRSampling: 1
    m_PVRDirectSampleCount: 32
    m_PVRSampleCount: 512
    m_PVRBounces: 2
    m_PVREnvironmentSampleCount: 256
    m_PVREnvironmentReferencePointCount: 2048
    m_PVRFilteringMode: 1
    m_PVRDenoiserTypeDirect: 1
    m_PVRDenoiserTypeIndirect: 1
    m_PVRDenoiserTypeAO: 1
    m_PVRFilterTypeDirect: 0
    m_PVRFilterTypeIndirect: 0
    m_PVRFilterTypeAO: 0
    m_PVREnvironmentMIS: 1
    m_PVRCulling: 1
    m_PVRFilteringGaussRadiusDirect: 1
    m_PVRFilteringGaussRadiusIndirect: 5
    m_PVRFilteringGaussRadiusAO: 2
    m_PVRFilteringAtrousPositionSigmaDirect: 0.5
    m_PVRFilteringAtrousPositionSigmaIndirect: 2
    m_PVRFilteringAtrousPositionSigmaAO: 1
    m_ExportTrainingData: 0
    m_TrainingDataDestination: TrainingData
    m_LightProbeSampleCountMultiplier: 4
  m_LightingDataAsset: {fileID: 0}
  m_LightingSettings: {fileID: 0}
--- !u!196 &4
NavMeshSettings:
  serializedVersion: 2
  m_ObjectHideFlags: 0
  m_BuildSettings:
    serializedVersion: 2
    agentTypeID: 0
    agentRadius: 0.5
    agentHeight: 2
    agentSlope: 45
    agentClimb: 0.4
    ledgeDropHeight: 0
    maxJumpAcrossDistance: 0
    minRegionArea: 2
    manualCellSize: 0
    cellSize: 0.16666667
    manualTileSize: 0
    tileSize: 256
    accuratePlacement: 0
    maxJobWorkers: 0
    preserveTilesOutsideBounds: 0
    debug:
      m_Flags: 0
  m_NavMeshData: {fileID: 0}
--- !u!1001 &684198563
PrefabInstance:
  m_ObjectHideFlags: 0
  serializedVersion: 2
  m_Modification:
    serializedVersion: 2
    m_TransformParent: {fileID: 0}
    m_Modifications:
    - target: {fileID: 6869664471649220880, guid: 2dce327896612a3438dad6950c1d30b7, type: 3}
      propertyPath: m_Name
      value: Cherry
      objectReference: {fileID: 0}
    - target: {fileID: 6869664471649220893, guid: 2dce327896612a3438dad6950c1d30b7, type: 3}
      propertyPath: m_RootOrder
      value: 1
      objectReference: {fileID: 0}
    - target: {fileID: 6869664471649220893, guid: 2dce327896612a3438dad6950c1d30b7, type: 3}
      propertyPath: m_LocalPosition.x
      value: 1.9456055
      objectReference: {fileID: 0}
    - target: {fileID: 6869664471649220893, guid: 2dce327896612a3438dad6950c1d30b7, type: 3}
      propertyPath: m_LocalPosition.y
      value: 3.4948668
      objectReference: {fileID: 0}
    - target: {fileID: 6869664471649220893, guid: 2dce327896612a3438dad6950c1d30b7, type: 3}
      propertyPath: m_LocalPosition.z
      value: 0
      objectReference: {fileID: 0}
    - target: {fileID: 6869664471649220893, guid: 2dce327896612a3438dad6950c1d30b7, type: 3}
      propertyPath: m_LocalRotation.w
      value: 1
      objectReference: {fileID: 0}
    - target: {fileID: 6869664471649220893, guid: 2dce327896612a3438dad6950c1d30b7, type: 3}
      propertyPath: m_LocalRotation.x
      value: 0
      objectReference: {fileID: 0}
    - target: {fileID: 6869664471649220893, guid: 2dce327896612a3438dad6950c1d30b7, type: 3}
      propertyPath: m_LocalRotation.y
      value: 0
      objectReference: {fileID: 0}
    - target: {fileID: 6869664471649220893, guid: 2dce327896612a3438dad6950c1d30b7, type: 3}
      propertyPath: m_LocalRotation.z
      value: 0
      objectReference: {fileID: 0}
    - target: {fileID: 6869664471649220893, guid: 2dce327896612a3438dad6950c1d30b7, type: 3}
      propertyPath: m_LocalEulerAnglesHint.x
      value: 0
      objectReference: {fileID: 0}
    - target: {fileID: 6869664471649220893, guid: 2dce327896612a3438dad6950c1d30b7, type: 3}
      propertyPath: m_LocalEulerAnglesHint.y
      value: 0
      objectReference: {fileID: 0}
    - target: {fileID: 6869664471649220893, guid: 2dce327896612a3438dad6950c1d30b7, type: 3}
      propertyPath: m_LocalEulerAnglesHint.z
      value: 0
      objectReference: {fileID: 0}
    m_RemovedComponents: []
    m_AddedGameObjects: []
  m_SourcePrefab: {fileID: 100100000, guid: 2dce327896612a3438dad6950c1d30b7, type: 3}
--- !u!1 &1170191700 stripped
GameObject:
  m_CorrespondingSourceObject: {fileID: 5116318602469016716, guid: a6443ce1907eecf4d997fcd87675cae4, type: 3}
  m_PrefabInstance: {fileID: 1863693275}
  m_PrefabAsset: {fileID: 0}
--- !u!82 &1170191702
AudioSource:
  m_ObjectHideFlags: 0
  m_CorrespondingSourceObject: {fileID: 0}
  m_PrefabInstance: {fileID: 0}
  m_PrefabAsset: {fileID: 0}
  m_GameObject: {fileID: 1170191700}
  m_Enabled: 1
  serializedVersion: 4
  OutputAudioMixerGroup: {fileID: 0}
  m_audioClip: {fileID: 8300000, guid: bfaf43c0dfe33994fa2ce257ba1e2df6, type: 3}
  m_PlayOnAwake: 1
  m_Volume: 0.3
  m_Pitch: 1
  Loop: 1
  Mute: 0
  Spatialize: 0
  SpatializePostEffects: 0
  Priority: 128
  DopplerLevel: 1
  MinDistance: 1
  MaxDistance: 500
  Pan2D: 0
  rolloffMode: 0
  BypassEffects: 0
  BypassListenerEffects: 0
  BypassReverbZones: 0
  rolloffCustomCurve:
    serializedVersion: 2
    m_Curve:
    - serializedVersion: 3
      time: 0
      value: 1
      inSlope: 0
      outSlope: 0
      tangentMode: 0
      weightedMode: 0
      inWeight: 0.33333334
      outWeight: 0.33333334
    - serializedVersion: 3
      time: 1
      value: 0
      inSlope: 0
      outSlope: 0
      tangentMode: 0
      weightedMode: 0
      inWeight: 0.33333334
      outWeight: 0.33333334
    m_PreInfinity: 2
    m_PostInfinity: 2
    m_RotationOrder: 4
  panLevelCustomCurve:
    serializedVersion: 2
    m_Curve:
    - serializedVersion: 3
      time: 0
      value: 0
      inSlope: 0
      outSlope: 0
      tangentMode: 0
      weightedMode: 0
      inWeight: 0.33333334
      outWeight: 0.33333334
    m_PreInfinity: 2
    m_PostInfinity: 2
    m_RotationOrder: 4
  spreadCustomCurve:
    serializedVersion: 2
    m_Curve:
    - serializedVersion: 3
      time: 0
      value: 0
      inSlope: 0
      outSlope: 0
      tangentMode: 0
      weightedMode: 0
      inWeight: 0.33333334
      outWeight: 0.33333334
    m_PreInfinity: 2
    m_PostInfinity: 2
    m_RotationOrder: 4
  reverbZoneMixCustomCurve:
    serializedVersion: 2
    m_Curve:
    - serializedVersion: 3
      time: 0
      value: 1
      inSlope: 0
      outSlope: 0
      tangentMode: 0
      weightedMode: 0
      inWeight: 0.33333334
      outWeight: 0.33333334
    m_PreInfinity: 2
    m_PostInfinity: 2
    m_RotationOrder: 4
--- !u!1001 &1863693275
PrefabInstance:
  m_ObjectHideFlags: 0
  serializedVersion: 2
  m_Modification:
    serializedVersion: 2
    m_TransformParent: {fileID: 0}
    m_Modifications:
    - target: {fileID: 411405423508285585, guid: a6443ce1907eecf4d997fcd87675cae4, type: 3}
      propertyPath: m_IsTrigger
      value: 0
      objectReference: {fileID: 0}
    - target: {fileID: 411405423508285585, guid: a6443ce1907eecf4d997fcd87675cae4, type: 3}
      propertyPath: m_UsedByEffector
      value: 0
      objectReference: {fileID: 0}
    - target: {fileID: 411405423508285585, guid: a6443ce1907eecf4d997fcd87675cae4, type: 3}
      propertyPath: m_ColliderPaths.Array.size
      value: 1
      objectReference: {fileID: 0}
    - target: {fileID: 411405423508285585, guid: a6443ce1907eecf4d997fcd87675cae4, type: 3}
      propertyPath: m_CompositePaths.m_Paths.Array.size
      value: 1
      objectReference: {fileID: 0}
    - target: {fileID: 411405423508285585, guid: a6443ce1907eecf4d997fcd87675cae4, type: 3}
      propertyPath: m_CompositePaths.m_Paths.Array.data[1].Array.data[0].x
      value: 41.999973
      objectReference: {fileID: 0}
    - target: {fileID: 411405423508285585, guid: a6443ce1907eecf4d997fcd87675cae4, type: 3}
      propertyPath: m_CompositePaths.m_Paths.Array.data[1].Array.data[0].y
      value: -5
      objectReference: {fileID: 0}
    - target: {fileID: 411405423508285585, guid: a6443ce1907eecf4d997fcd87675cae4, type: 3}
      propertyPath: m_CompositePaths.m_Paths.Array.data[1].Array.data[1].x
      value: 41.999973
      objectReference: {fileID: 0}
    - target: {fileID: 411405423508285585, guid: a6443ce1907eecf4d997fcd87675cae4, type: 3}
      propertyPath: m_CompositePaths.m_Paths.Array.data[1].Array.data[1].y
      value: -4
      objectReference: {fileID: 0}
    - target: {fileID: 411405423508285585, guid: a6443ce1907eecf4d997fcd87675cae4, type: 3}
      propertyPath: m_CompositePaths.m_Paths.Array.data[1].Array.data[2].x
      value: -15
      objectReference: {fileID: 0}
    - target: {fileID: 411405423508285585, guid: a6443ce1907eecf4d997fcd87675cae4, type: 3}
      propertyPath: m_CompositePaths.m_Paths.Array.data[1].Array.data[2].y
      value: -4.000029
      objectReference: {fileID: 0}
    - target: {fileID: 411405423508285585, guid: a6443ce1907eecf4d997fcd87675cae4, type: 3}
      propertyPath: m_CompositePaths.m_Paths.Array.data[1].Array.data[3].x
      value: -14.999971
      objectReference: {fileID: 0}
    - target: {fileID: 411405423508285585, guid: a6443ce1907eecf4d997fcd87675cae4, type: 3}
      propertyPath: m_CompositePaths.m_Paths.Array.data[1].Array.data[3].y
      value: -5
      objectReference: {fileID: 0}
    - target: {fileID: 411405423508285585, guid: a6443ce1907eecf4d997fcd87675cae4, type: 3}
      propertyPath: m_CompositePaths.m_Paths.Array.data[1].Array.data[4].x
      value: 22
      objectReference: {fileID: 0}
    - target: {fileID: 411405423508285585, guid: a6443ce1907eecf4d997fcd87675cae4, type: 3}
      propertyPath: m_CompositePaths.m_Paths.Array.data[1].Array.data[4].y
      value: -3.0000293
      objectReference: {fileID: 0}
    - target: {fileID: 411405423508285585, guid: a6443ce1907eecf4d997fcd87675cae4, type: 3}
      propertyPath: m_CompositePaths.m_Paths.Array.data[1].Array.data[5].x
      value: 21.999971
      objectReference: {fileID: 0}
    - target: {fileID: 411405423508285585, guid: a6443ce1907eecf4d997fcd87675cae4, type: 3}
      propertyPath: m_CompositePaths.m_Paths.Array.data[1].Array.data[5].y
      value: -4
      objectReference: {fileID: 0}
    - target: {fileID: 411405423508285585, guid: a6443ce1907eecf4d997fcd87675cae4, type: 3}
      propertyPath: m_CompositePaths.m_Paths.Array.data[1].Array.data[6].x
      value: -1
      objectReference: {fileID: 0}
    - target: {fileID: 411405423508285585, guid: a6443ce1907eecf4d997fcd87675cae4, type: 3}
      propertyPath: m_CompositePaths.m_Paths.Array.data[1].Array.data[6].y
      value: -4.000029
      objectReference: {fileID: 0}
    - target: {fileID: 411405423508285585, guid: a6443ce1907eecf4d997fcd87675cae4, type: 3}
      propertyPath: m_CompositePaths.m_Paths.Array.data[1].Array.data[7].x
      value: -0.99997073
      objectReference: {fileID: 0}
    - target: {fileID: 411405423508285585, guid: a6443ce1907eecf4d997fcd87675cae4, type: 3}
      propertyPath: m_CompositePaths.m_Paths.Array.data[1].Array.data[7].y
      value: -5
      objectReference: {fileID: 0}
    - target: {fileID: 411405423508285585, guid: a6443ce1907eecf4d997fcd87675cae4, type: 3}
      propertyPath: m_CompositePaths.m_Paths.Array.data[1].Array.data[8].x
      value: 20
      objectReference: {fileID: 0}
    - target: {fileID: 411405423508285585, guid: a6443ce1907eecf4d997fcd87675cae4, type: 3}
      propertyPath: m_CompositePaths.m_Paths.Array.data[1].Array.data[8].y
      value: -5.0000296
      objectReference: {fileID: 0}
    - target: {fileID: 411405423508285585, guid: a6443ce1907eecf4d997fcd87675cae4, type: 3}
      propertyPath: m_CompositePaths.m_Paths.Array.data[1].Array.data[9].x
      value: 20.000029
      objectReference: {fileID: 0}
    - target: {fileID: 411405423508285585, guid: a6443ce1907eecf4d997fcd87675cae4, type: 3}
      propertyPath: m_CompositePaths.m_Paths.Array.data[1].Array.data[9].y
      value: -6
      objectReference: {fileID: 0}
    - target: {fileID: 411405423508285585, guid: a6443ce1907eecf4d997fcd87675cae4, type: 3}
      propertyPath: m_CompositePaths.m_Paths.Array.data[1].Array.data[10].x
      value: 16
      objectReference: {fileID: 0}
    - target: {fileID: 411405423508285585, guid: a6443ce1907eecf4d997fcd87675cae4, type: 3}
      propertyPath: m_CompositePaths.m_Paths.Array.data[1].Array.data[10].y
      value: -5.0000296
      objectReference: {fileID: 0}
    - target: {fileID: 411405423508285585, guid: a6443ce1907eecf4d997fcd87675cae4, type: 3}
      propertyPath: m_CompositePaths.m_Paths.Array.data[1].Array.data[11].x
      value: 16.000029
      objectReference: {fileID: 0}
    - target: {fileID: 411405423508285585, guid: a6443ce1907eecf4d997fcd87675cae4, type: 3}
      propertyPath: m_CompositePaths.m_Paths.Array.data[1].Array.data[11].y
      value: -6
      objectReference: {fileID: 0}
    - target: {fileID: 411405423508285585, guid: a6443ce1907eecf4d997fcd87675cae4, type: 3}
      propertyPath: m_ColliderPaths.Array.data[0].m_ColliderPaths.Array.size
      value: 1
      objectReference: {fileID: 0}
    - target: {fileID: 411405423508285585, guid: a6443ce1907eecf4d997fcd87675cae4, type: 3}
      propertyPath: m_ColliderPaths.Array.data[0].m_ColliderPaths.Array.data[0].Array.size
      value: 4
      objectReference: {fileID: 0}
    - target: {fileID: 411405423508285585, guid: a6443ce1907eecf4d997fcd87675cae4, type: 3}
      propertyPath: m_ColliderPaths.Array.data[0].m_ColliderPaths.Array.data[1].Array.size
      value: 4
      objectReference: {fileID: 0}
    - target: {fileID: 411405423508285585, guid: a6443ce1907eecf4d997fcd87675cae4, type: 3}
      propertyPath: m_ColliderPaths.Array.data[0].m_ColliderPaths.Array.data[0].Array.data[0].X
      value: 230000000
      objectReference: {fileID: 0}
    - target: {fileID: 411405423508285585, guid: a6443ce1907eecf4d997fcd87675cae4, type: 3}
      propertyPath: m_ColliderPaths.Array.data[0].m_ColliderPaths.Array.data[0].Array.data[0].Y
      value: -100000000
      objectReference: {fileID: 0}
    - target: {fileID: 411405423508285585, guid: a6443ce1907eecf4d997fcd87675cae4, type: 3}
      propertyPath: m_ColliderPaths.Array.data[0].m_ColliderPaths.Array.data[0].Array.data[1].X
      value: 230000000
      objectReference: {fileID: 0}
    - target: {fileID: 411405423508285585, guid: a6443ce1907eecf4d997fcd87675cae4, type: 3}
      propertyPath: m_ColliderPaths.Array.data[0].m_ColliderPaths.Array.data[0].Array.data[1].Y
      value: -40000000
      objectReference: {fileID: 0}
    - target: {fileID: 411405423508285585, guid: a6443ce1907eecf4d997fcd87675cae4, type: 3}
      propertyPath: m_ColliderPaths.Array.data[0].m_ColliderPaths.Array.data[0].Array.data[2].X
      value: -150000000
      objectReference: {fileID: 0}
    - target: {fileID: 411405423508285585, guid: a6443ce1907eecf4d997fcd87675cae4, type: 3}
      propertyPath: m_ColliderPaths.Array.data[0].m_ColliderPaths.Array.data[0].Array.data[2].Y
      value: -40000000
      objectReference: {fileID: 0}
    - target: {fileID: 411405423508285585, guid: a6443ce1907eecf4d997fcd87675cae4, type: 3}
      propertyPath: m_ColliderPaths.Array.data[0].m_ColliderPaths.Array.data[0].Array.data[3].X
      value: -150000000
      objectReference: {fileID: 0}
    - target: {fileID: 411405423508285585, guid: a6443ce1907eecf4d997fcd87675cae4, type: 3}
      propertyPath: m_ColliderPaths.Array.data[0].m_ColliderPaths.Array.data[0].Array.data[3].Y
      value: -100000000
      objectReference: {fileID: 0}
    - target: {fileID: 411405423508285585, guid: a6443ce1907eecf4d997fcd87675cae4, type: 3}
      propertyPath: m_ColliderPaths.Array.data[0].m_ColliderPaths.Array.data[0].Array.data[4].X
      value: 420000000
      objectReference: {fileID: 0}
    - target: {fileID: 411405423508285585, guid: a6443ce1907eecf4d997fcd87675cae4, type: 3}
      propertyPath: m_ColliderPaths.Array.data[0].m_ColliderPaths.Array.data[0].Array.data[4].Y
      value: -40000000
      objectReference: {fileID: 0}
    - target: {fileID: 411405423508285585, guid: a6443ce1907eecf4d997fcd87675cae4, type: 3}
      propertyPath: m_ColliderPaths.Array.data[0].m_ColliderPaths.Array.data[0].Array.data[5].X
      value: 460000000
      objectReference: {fileID: 0}
    - target: {fileID: 411405423508285585, guid: a6443ce1907eecf4d997fcd87675cae4, type: 3}
      propertyPath: m_ColliderPaths.Array.data[0].m_ColliderPaths.Array.data[0].Array.data[5].Y
      value: -40000000
      objectReference: {fileID: 0}
    - target: {fileID: 411405423508285585, guid: a6443ce1907eecf4d997fcd87675cae4, type: 3}
      propertyPath: m_ColliderPaths.Array.data[0].m_ColliderPaths.Array.data[1].Array.data[0].X
      value: 420000000
      objectReference: {fileID: 0}
    - target: {fileID: 411405423508285585, guid: a6443ce1907eecf4d997fcd87675cae4, type: 3}
      propertyPath: m_ColliderPaths.Array.data[0].m_ColliderPaths.Array.data[1].Array.data[0].Y
      value: -40000000
      objectReference: {fileID: 0}
    - target: {fileID: 411405423508285585, guid: a6443ce1907eecf4d997fcd87675cae4, type: 3}
      propertyPath: m_ColliderPaths.Array.data[0].m_ColliderPaths.Array.data[1].Array.data[1].X
      value: -150000000
      objectReference: {fileID: 0}
    - target: {fileID: 411405423508285585, guid: a6443ce1907eecf4d997fcd87675cae4, type: 3}
      propertyPath: m_ColliderPaths.Array.data[0].m_ColliderPaths.Array.data[1].Array.data[1].Y
      value: -40000000
      objectReference: {fileID: 0}
    - target: {fileID: 411405423508285585, guid: a6443ce1907eecf4d997fcd87675cae4, type: 3}
      propertyPath: m_ColliderPaths.Array.data[0].m_ColliderPaths.Array.data[1].Array.data[2].X
      value: -150000000
      objectReference: {fileID: 0}
    - target: {fileID: 411405423508285585, guid: a6443ce1907eecf4d997fcd87675cae4, type: 3}
      propertyPath: m_ColliderPaths.Array.data[0].m_ColliderPaths.Array.data[1].Array.data[2].Y
      value: -50000000
      objectReference: {fileID: 0}
    - target: {fileID: 411405423508285585, guid: a6443ce1907eecf4d997fcd87675cae4, type: 3}
      propertyPath: m_ColliderPaths.Array.data[0].m_ColliderPaths.Array.data[1].Array.data[3].X
      value: 420000000
      objectReference: {fileID: 0}
    - target: {fileID: 411405423508285585, guid: a6443ce1907eecf4d997fcd87675cae4, type: 3}
      propertyPath: m_ColliderPaths.Array.data[0].m_ColliderPaths.Array.data[1].Array.data[3].Y
      value: -50000000
      objectReference: {fileID: 0}
    - target: {fileID: 411405423508285585, guid: a6443ce1907eecf4d997fcd87675cae4, type: 3}
      propertyPath: m_ColliderPaths.Array.data[0].m_ColliderPaths.Array.data[1].Array.data[4].X
      value: 220000000
      objectReference: {fileID: 0}
    - target: {fileID: 411405423508285585, guid: a6443ce1907eecf4d997fcd87675cae4, type: 3}
      propertyPath: m_ColliderPaths.Array.data[0].m_ColliderPaths.Array.data[1].Array.data[4].Y
      value: -40000000
      objectReference: {fileID: 0}
    - target: {fileID: 411405423508285585, guid: a6443ce1907eecf4d997fcd87675cae4, type: 3}
      propertyPath: m_ColliderPaths.Array.data[0].m_ColliderPaths.Array.data[1].Array.data[5].X
      value: -10000000
      objectReference: {fileID: 0}
    - target: {fileID: 411405423508285585, guid: a6443ce1907eecf4d997fcd87675cae4, type: 3}
      propertyPath: m_ColliderPaths.Array.data[0].m_ColliderPaths.Array.data[1].Array.data[5].Y
      value: -40000000
      objectReference: {fileID: 0}
    - target: {fileID: 411405423508285585, guid: a6443ce1907eecf4d997fcd87675cae4, type: 3}
      propertyPath: m_ColliderPaths.Array.data[0].m_ColliderPaths.Array.data[1].Array.data[6].X
      value: -10000000
      objectReference: {fileID: 0}
    - target: {fileID: 411405423508285585, guid: a6443ce1907eecf4d997fcd87675cae4, type: 3}
      propertyPath: m_ColliderPaths.Array.data[0].m_ColliderPaths.Array.data[1].Array.data[6].Y
      value: -50000000
      objectReference: {fileID: 0}
    - target: {fileID: 411405423508285585, guid: a6443ce1907eecf4d997fcd87675cae4, type: 3}
      propertyPath: m_ColliderPaths.Array.data[0].m_ColliderPaths.Array.data[1].Array.data[7].X
      value: 230000000
      objectReference: {fileID: 0}
    - target: {fileID: 411405423508285585, guid: a6443ce1907eecf4d997fcd87675cae4, type: 3}
      propertyPath: m_ColliderPaths.Array.data[0].m_ColliderPaths.Array.data[1].Array.data[7].Y
      value: -50000000
      objectReference: {fileID: 0}
    - target: {fileID: 411405423508285585, guid: a6443ce1907eecf4d997fcd87675cae4, type: 3}
      propertyPath: m_ColliderPaths.Array.data[0].m_ColliderPaths.Array.data[1].Array.data[8].X
      value: 200000000
      objectReference: {fileID: 0}
    - target: {fileID: 411405423508285585, guid: a6443ce1907eecf4d997fcd87675cae4, type: 3}
      propertyPath: m_ColliderPaths.Array.data[0].m_ColliderPaths.Array.data[1].Array.data[8].Y
      value: -60000000
      objectReference: {fileID: 0}
    - target: {fileID: 411405423508285585, guid: a6443ce1907eecf4d997fcd87675cae4, type: 3}
      propertyPath: m_ColliderPaths.Array.data[0].m_ColliderPaths.Array.data[1].Array.data[9].X
      value: 260000000
      objectReference: {fileID: 0}
    - target: {fileID: 411405423508285585, guid: a6443ce1907eecf4d997fcd87675cae4, type: 3}
      propertyPath: m_ColliderPaths.Array.data[0].m_ColliderPaths.Array.data[1].Array.data[9].Y
      value: -60000000
      objectReference: {fileID: 0}
    - target: {fileID: 411405423508285585, guid: a6443ce1907eecf4d997fcd87675cae4, type: 3}
      propertyPath: m_ColliderPaths.Array.data[0].m_ColliderPaths.Array.data[1].Array.data[10].X
      value: 160000000
      objectReference: {fileID: 0}
    - target: {fileID: 411405423508285585, guid: a6443ce1907eecf4d997fcd87675cae4, type: 3}
      propertyPath: m_ColliderPaths.Array.data[0].m_ColliderPaths.Array.data[1].Array.data[10].Y
      value: -60000000
      objectReference: {fileID: 0}
    - target: {fileID: 411405423508285585, guid: a6443ce1907eecf4d997fcd87675cae4, type: 3}
      propertyPath: m_ColliderPaths.Array.data[0].m_ColliderPaths.Array.data[1].Array.data[11].X
      value: 200000000
      objectReference: {fileID: 0}
    - target: {fileID: 411405423508285585, guid: a6443ce1907eecf4d997fcd87675cae4, type: 3}
      propertyPath: m_ColliderPaths.Array.data[0].m_ColliderPaths.Array.data[1].Array.data[11].Y
      value: -60000000
      objectReference: {fileID: 0}
    - target: {fileID: 3590999133288487636, guid: a6443ce1907eecf4d997fcd87675cae4, type: 3}
      propertyPath: m_Name
      value: ___LEVEL PACK___
      objectReference: {fileID: 0}
    - target: {fileID: 5116318601403336135, guid: a6443ce1907eecf4d997fcd87675cae4, type: 3}
      propertyPath: m_ColliderPaths.Array.size
      value: 4
      objectReference: {fileID: 0}
    - target: {fileID: 5116318601685810934, guid: a6443ce1907eecf4d997fcd87675cae4, type: 3}
      propertyPath: m_IsTrigger
      value: 0
      objectReference: {fileID: 0}
    - target: {fileID: 5116318601685810934, guid: a6443ce1907eecf4d997fcd87675cae4, type: 3}
      propertyPath: m_UsedByComposite
      value: 1
      objectReference: {fileID: 0}
    - target: {fileID: 5116318602143062744, guid: a6443ce1907eecf4d997fcd87675cae4, type: 3}
      propertyPath: m_IsActive
      value: 1
      objectReference: {fileID: 0}
    - target: {fileID: 5116318602399506608, guid: a6443ce1907eecf4d997fcd87675cae4, type: 3}
      propertyPath: m_IsActive
      value: 1
      objectReference: {fileID: 0}
    - target: {fileID: 6176869877835001686, guid: a6443ce1907eecf4d997fcd87675cae4, type: 3}
      propertyPath: m_RootOrder
      value: 0
      objectReference: {fileID: 0}
    - target: {fileID: 6176869877835001686, guid: a6443ce1907eecf4d997fcd87675cae4, type: 3}
      propertyPath: m_LocalPosition.x
      value: 0
      objectReference: {fileID: 0}
    - target: {fileID: 6176869877835001686, guid: a6443ce1907eecf4d997fcd87675cae4, type: 3}
      propertyPath: m_LocalPosition.y
      value: 0
      objectReference: {fileID: 0}
    - target: {fileID: 6176869877835001686, guid: a6443ce1907eecf4d997fcd87675cae4, type: 3}
      propertyPath: m_LocalPosition.z
      value: 0
      objectReference: {fileID: 0}
    - target: {fileID: 6176869877835001686, guid: a6443ce1907eecf4d997fcd87675cae4, type: 3}
      propertyPath: m_LocalRotation.w
      value: 1
      objectReference: {fileID: 0}
    - target: {fileID: 6176869877835001686, guid: a6443ce1907eecf4d997fcd87675cae4, type: 3}
      propertyPath: m_LocalRotation.x
      value: 0
      objectReference: {fileID: 0}
    - target: {fileID: 6176869877835001686, guid: a6443ce1907eecf4d997fcd87675cae4, type: 3}
      propertyPath: m_LocalRotation.y
      value: 0
      objectReference: {fileID: 0}
    - target: {fileID: 6176869877835001686, guid: a6443ce1907eecf4d997fcd87675cae4, type: 3}
      propertyPath: m_LocalRotation.z
      value: 0
      objectReference: {fileID: 0}
    - target: {fileID: 6176869877835001686, guid: a6443ce1907eecf4d997fcd87675cae4, type: 3}
      propertyPath: m_LocalEulerAnglesHint.x
      value: 0
      objectReference: {fileID: 0}
    - target: {fileID: 6176869877835001686, guid: a6443ce1907eecf4d997fcd87675cae4, type: 3}
      propertyPath: m_LocalEulerAnglesHint.y
      value: 0
      objectReference: {fileID: 0}
    - target: {fileID: 6176869877835001686, guid: a6443ce1907eecf4d997fcd87675cae4, type: 3}
      propertyPath: m_LocalEulerAnglesHint.z
      value: 0
      objectReference: {fileID: 0}
    m_RemovedComponents: []
    m_AddedGameObjects: []
  m_SourcePrefab: {fileID: 100100000, guid: a6443ce1907eecf4d997fcd87675cae4, type: 3}
--- !u!1001 &7410424619610956219
PrefabInstance:
  m_ObjectHideFlags: 0
  serializedVersion: 2
  m_Modification:
    serializedVersion: 2
    m_TransformParent: {fileID: 0}
    m_Modifications:
    - target: {fileID: 7410424618150465203, guid: 3bcbdc7cd01d33a4cb785f610a29af1d, type: 3}
      propertyPath: m_Name
      value: Bouncer_0
      objectReference: {fileID: 0}
    - target: {fileID: 7410424618150465207, guid: 3bcbdc7cd01d33a4cb785f610a29af1d, type: 3}
      propertyPath: m_RootOrder
      value: 2
      objectReference: {fileID: 0}
    - target: {fileID: 7410424618150465207, guid: 3bcbdc7cd01d33a4cb785f610a29af1d, type: 3}
      propertyPath: m_LocalPosition.x
      value: 3.12
      objectReference: {fileID: 0}
    - target: {fileID: 7410424618150465207, guid: 3bcbdc7cd01d33a4cb785f610a29af1d, type: 3}
      propertyPath: m_LocalPosition.y
      value: -3.28
      objectReference: {fileID: 0}
    - target: {fileID: 7410424618150465207, guid: 3bcbdc7cd01d33a4cb785f610a29af1d, type: 3}
      propertyPath: m_LocalPosition.z
      value: 0
      objectReference: {fileID: 0}
    - target: {fileID: 7410424618150465207, guid: 3bcbdc7cd01d33a4cb785f610a29af1d, type: 3}
      propertyPath: m_LocalRotation.w
      value: 1
      objectReference: {fileID: 0}
    - target: {fileID: 7410424618150465207, guid: 3bcbdc7cd01d33a4cb785f610a29af1d, type: 3}
      propertyPath: m_LocalRotation.x
      value: 0
      objectReference: {fileID: 0}
    - target: {fileID: 7410424618150465207, guid: 3bcbdc7cd01d33a4cb785f610a29af1d, type: 3}
      propertyPath: m_LocalRotation.y
      value: 0
      objectReference: {fileID: 0}
    - target: {fileID: 7410424618150465207, guid: 3bcbdc7cd01d33a4cb785f610a29af1d, type: 3}
      propertyPath: m_LocalRotation.z
      value: 0
      objectReference: {fileID: 0}
    - target: {fileID: 7410424618150465207, guid: 3bcbdc7cd01d33a4cb785f610a29af1d, type: 3}
      propertyPath: m_LocalEulerAnglesHint.x
      value: 0
      objectReference: {fileID: 0}
    - target: {fileID: 7410424618150465207, guid: 3bcbdc7cd01d33a4cb785f610a29af1d, type: 3}
      propertyPath: m_LocalEulerAnglesHint.y
      value: 0
      objectReference: {fileID: 0}
    - target: {fileID: 7410424618150465207, guid: 3bcbdc7cd01d33a4cb785f610a29af1d, type: 3}
      propertyPath: m_LocalEulerAnglesHint.z
      value: 0
      objectReference: {fileID: 0}
    m_RemovedComponents: []
    m_AddedGameObjects: []
  m_SourcePrefab: {fileID: 100100000, guid: 3bcbdc7cd01d33a4cb785f610a29af1d, type: 3}
