%YAML 1.1
%TAG !u! tag:unity3d.com,2011:
--- !u!74 &7400000
AnimationClip:
  m_ObjectHideFlags: 0
  m_CorrespondingSourceObject: {fileID: 0}
  m_PrefabInstance: {fileID: 0}
  m_PrefabAsset: {fileID: 0}
  m_Name: Left to right
  serializedVersion: 7
  m_Legacy: 0
  m_Compressed: 0
  m_UseHighQualityCurve: 1
  m_RotationCurves: []
  m_CompressedRotationCurves: []
  m_EulerCurves: []
  m_PositionCurves: []
  m_ScaleCurves: []
  m_FloatCurves: []
  m_PPtrCurves:
  - curve:
    - time: 0
      value: {fileID: 21300000, guid: 2f254238cc1222d4ca797ead2f28d219, type: 3}
    - time: 0.016666668
      value: {fileID: 21300000, guid: 7279b79337e495940b163f7dbed594c6, type: 3}
    - time: 0.033333335
      value: {fileID: 21300000, guid: b5c6355be80bd7a46ae4d7c462630a63, type: 3}
    - time: 0.05
      value: {fileID: 21300000, guid: 4f1c510fd6ad345468b47972de4916f4, type: 3}
    - time: 0.06666667
      value: {fileID: 21300000, guid: b19ed4042af7d9d439cab46764b25846, type: 3}
    - time: 0.083333336
      value: {fileID: 21300000, guid: ea21caf01f8523d4db976ff8fa618aeb, type: 3}
    - time: 0.1
      value: {fileID: 21300000, guid: 8cf4a4f5696b1324fa9a61ece68ada91, type: 3}
    - time: 0.11666667
      value: {fileID: 21300000, guid: 0b3399bf3b32d284f97a60c3897431b5, type: 3}
    - time: 0.13333334
      value: {fileID: 21300000, guid: 8f27bd940ae13d44994bc109f33d1d88, type: 3}
    - time: 0.15
      value: {fileID: 21300000, guid: cd446714a8f0658468c4eef70f49177a, type: 3}
    - time: 0.16666667
      value: {fileID: 21300000, guid: 96882a6aac173bb4ca374429901b49f9, type: 3}
    - time: 0.18333334
      value: {fileID: 21300000, guid: ca1dc6c78e5ddd44fbfa7b39b4a985d4, type: 3}
    - time: 0.2
      value: {fileID: 21300000, guid: 41d0d330a842c174882ec52eb119b4c3, type: 3}
    - time: 0.21666667
      value: {fileID: 21300000, guid: 115b07a94da7f2f43aa028e748abcade, type: 3}
    - time: 0.23333333
      value: {fileID: 21300000, guid: 9a57fdecb87a9d1409241620313bed5a, type: 3}
    - time: 0.25
      value: {fileID: 21300000, guid: 092fc4cb232358e46b7346f0f1c232a1, type: 3}
    - time: 0.26666668
      value: {fileID: 21300000, guid: 233203ab85717ef4eb947e73ca2d701d, type: 3}
    - time: 0.28333333
      value: {fileID: 21300000, guid: 93198838260e47843b084de329dfedc0, type: 3}
    - time: 0.3
      value: {fileID: 21300000, guid: c32d08ff17b93b44d81959798eacad20, type: 3}
    - time: 0.31666666
      value: {fileID: 21300000, guid: 84eb8d8273ddfaa44a3698cc036b7d17, type: 3}
    - time: 0.33333334
      value: {fileID: 21300000, guid: 4d6e66c1a334bc247b5634406468b558, type: 3}
    - time: 0.35
      value: {fileID: 21300000, guid: d997f80513284534d839d3eb907dcc88, type: 3}
    - time: 0.36666667
      value: {fileID: 21300000, guid: 1b27ba21839a83f418c34271701b7896, type: 3}
    - time: 0.38333333
      value: {fileID: 21300000, guid: 942f9efb8fbec944785dd8a2d5bbcad1, type: 3}
    - time: 0.4
      value: {fileID: 21300000, guid: 4750a255d35fd9c46953d0cd0d6419ed, type: 3}
    - time: 0.41666666
      value: {fileID: 21300000, guid: 410e10f7fff115c408efd18486144a1a, type: 3}
    - time: 0.43333334
      value: {fileID: 21300000, guid: 893fe63599604a1429ae22950e6f4015, type: 3}
    - time: 0.45
      value: {fileID: 21300000, guid: 397798e0c17b54b4796b1435b26a3c37, type: 3}
    - time: 0.46666667
      value: {fileID: 21300000, guid: f01e0e985f49aed4aa9d040efe740f63, type: 3}
    - time: 0.48333332
      value: {fileID: 21300000, guid: 056627d610ef70e49b1d02f141f85d53, type: 3}
    - time: 0.5
      value: {fileID: 21300000, guid: 6a025582c66fcf94d89bd52304265421, type: 3}
    - time: 0.51666665
      value: {fileID: 21300000, guid: acdc34284eaeb5545ac36fba58fbc581, type: 3}
    - time: 0.53333336
      value: {fileID: 21300000, guid: f398ee3b0b3ccfc4e8c694ebc7fa4bc8, type: 3}
    - time: 0.55
      value: {fileID: 21300000, guid: 1a3d46469001dd24db7954f74a39226f, type: 3}
    - time: 0.56666666
      value: {fileID: 21300000, guid: 3f31b6d57598dce4695205abc566ad6a, type: 3}
    - time: 0.5833333
      value: {fileID: 21300000, guid: f4fe4a6ce08052646a2a535c4033e01e, type: 3}
    - time: 0.6
      value: {fileID: 21300000, guid: 9c5e4389b8dc17b459e534ffedb7c004, type: 3}
    - time: 0.6166667
      value: {fileID: 21300000, guid: 854e8a5f849d0434a870d9548f12e757, type: 3}
    - time: 0.6333333
      value: {fileID: 21300000, guid: a9fd331f4c54c6f4aaf16ad180cda5b1, type: 3}
    - time: 0.65
      value: {fileID: 21300000, guid: 34a833db49300774188be8b396528b93, type: 3}
    - time: 0.6666667
      value: {fileID: 21300000, guid: a99c8c127a6be384190ca7d5ec43b7a0, type: 3}
    - time: 0.68333334
      value: {fileID: 21300000, guid: 06e0076c06236ec45afbdb60973e30e4, type: 3}
    - time: 0.7
      value: {fileID: 21300000, guid: fc09e6a7a3e1c4c42a59b3d41750494a, type: 3}
    - time: 0.71666664
      value: {fileID: 21300000, guid: 457b64146ee4c3344bd3df9e1097a77b, type: 3}
    - time: 0.73333335
      value: {fileID: 21300000, guid: d8daf298c87586f45a30121c2a1fd12a, type: 3}
    - time: 0.75
      value: {fileID: 21300000, guid: 0b8ffc6edcdb8eb4bbcc2a5783907622, type: 3}
    - time: 0.76666665
      value: {fileID: 21300000, guid: 2cf2a6d204eb2f841acc7910a7a7cf74, type: 3}
    - time: 0.78333336
      value: {fileID: 21300000, guid: 3045bb3795b6ba942a81fb4c631ce906, type: 3}
    - time: 0.8
      value: {fileID: 21300000, guid: f5e9022747b4e7e44aa02036f5e98ffa, type: 3}
    - time: 0.81666666
      value: {fileID: 21300000, guid: acd79eb4ffbc761488cf6d16a0579508, type: 3}
    - time: 0.8333333
      value: {fileID: 21300000, guid: b0faa1d7daab447408eb4dd962e1c1ca, type: 3}
    - time: 0.85
      value: {fileID: 21300000, guid: 298daffdfe244e14e8c91e447f32b9e0, type: 3}
    - time: 0.8666667
      value: {fileID: 21300000, guid: e8955c21871508147a66b9917c3d4b32, type: 3}
    - time: 0.8833333
      value: {fileID: 21300000, guid: 567b1f645d20d624e9dbba4a3e745836, type: 3}
    - time: 0.9
      value: {fileID: 21300000, guid: eafec25d651086943a37031ea49ae409, type: 3}
    - time: 0.9166667
      value: {fileID: 21300000, guid: 963ca1f32a261b14d804c5a9fdaf0d4b, type: 3}
    - time: 0.93333334
      value: {fileID: 21300000, guid: 87a227b0b6efdb34aa61b609de850be9, type: 3}
    - time: 0.95
      value: {fileID: 21300000, guid: 55a6443d2f64fc449bc0d55b30f9a25c, type: 3}
    - time: 0.96666664
      value: {fileID: 21300000, guid: 07a335d04ccb79949ac800bef7698860, type: 3}
    - time: 0.98333335
      value: {fileID: 21300000, guid: 75ec439f80611aa479828fbfe1c2c4c8, type: 3}
    - time: 1
      value: {fileID: 21300000, guid: 9d80e04de9dbebe43873fc71a68adb9b, type: 3}
    - time: 1.0166667
      value: {fileID: 21300000, guid: f39827149633b804f9acce863b5125a6, type: 3}
    - time: 1.0333333
      value: {fileID: 21300000, guid: be0f8c4a1faf39d45a7a8b292c00084f, type: 3}
    - time: 1.05
      value: {fileID: 21300000, guid: e5a9bf73ff936904d808226a4f468625, type: 3}
    - time: 1.0666667
      value: {fileID: 21300000, guid: 5bf9e39895b629642a1271b98621e5fb, type: 3}
    - time: 1.0833334
      value: {fileID: 21300000, guid: a108e3d88f24df943aa77fb958b4e548, type: 3}
    - time: 1.1
      value: {fileID: 21300000, guid: 67179d761e556fd448a3ede03ad69f75, type: 3}
    - time: 1.1166667
      value: {fileID: 21300000, guid: ff5fde83cd4633344b938b63b3de3b8d, type: 3}
    - time: 1.1333333
      value: {fileID: 21300000, guid: 4234d84d762291c4ca7c3b66a6ee9b08, type: 3}
    - time: 1.15
      value: {fileID: 21300000, guid: e249014d8c5e47e42abbf75ad1088f8f, type: 3}
    - time: 1.1666666
      value: {fileID: 21300000, guid: 495d5ac57889eef4b8c789cdf10ee9a8, type: 3}
    - time: 1.1833333
      value: {fileID: 21300000, guid: ea9b9ce973059084484050e070254b74, type: 3}
    - time: 1.2
      value: {fileID: 21300000, guid: 424f21aab659c424d922e6dbf16b6b7a, type: 3}
    - time: 1.2166667
      value: {fileID: 21300000, guid: 0224f1896a0c60b429d86dd12d9405e5, type: 3}
    - time: 1.2333333
      value: {fileID: 21300000, guid: c0017584da3ad614ba8a895271fe8e52, type: 3}
    - time: 1.25
      value: {fileID: 21300000, guid: c1d2b4182e4a94c4ebb2b49912b9e397, type: 3}
    - time: 1.2666667
      value: {fileID: 21300000, guid: 15ba00451aefd144a9de05803758d63c, type: 3}
    - time: 1.2833333
      value: {fileID: 21300000, guid: 77c9c8196035b1743acebd610da54645, type: 3}
    - time: 1.3
      value: {fileID: 21300000, guid: ee1e4dc661ff26c42854e13c0a1578cb, type: 3}
    - time: 1.3166667
      value: {fileID: 21300000, guid: f1d43723702589948bb1f2ee3a567565, type: 3}
    - time: 1.3333334
      value: {fileID: 21300000, guid: 12f8a94e35dccdb42a7c1c390c45c521, type: 3}
    - time: 1.35
      value: {fileID: 21300000, guid: b0e1950564174ca4787828b5f00e6a9a, type: 3}
    - time: 1.3666667
      value: {fileID: 21300000, guid: 4ca3c21d4ba803247a20780d7d71fbf0, type: 3}
    - time: 1.3833333
      value: {fileID: 21300000, guid: cb805308b50d5984f8ac79d3b39c297a, type: 3}
    - time: 1.4
      value: {fileID: 21300000, guid: 05f84161f26899b408c5f404dc68f111, type: 3}
    - time: 1.4166666
      value: {fileID: 21300000, guid: f3a1aab52b1a6764da3148749c33fa97, type: 3}
    - time: 1.4333333
      value: {fileID: 21300000, guid: 71f1d09b650911743b83b2b8bf1e5462, type: 3}
    - time: 1.45
      value: {fileID: 21300000, guid: 78d9d9fbc332e0c4ba2a5405ff05235c, type: 3}
    - time: 1.4666667
      value: {fileID: 21300000, guid: ba7ea8b96efb8364facc0de7d9422395, type: 3}
    - time: 1.4833333
      value: {fileID: 21300000, guid: 173f999a5f0d6de4da133b07590f7b96, type: 3}
    - time: 1.5
      value: {fileID: 21300000, guid: c394d528a51573847a187956ff3eba28, type: 3}
    - time: 1.5166667
      value: {fileID: 21300000, guid: 0a72116ae7d8d67438e1c455e3587ec1, type: 3}
    - time: 1.5333333
      value: {fileID: 21300000, guid: bf88e046dd174fd46ab2ae73867b9206, type: 3}
    - time: 1.55
      value: {fileID: 21300000, guid: 1d84b7fad960a6a4184828890784e4d9, type: 3}
    - time: 1.5666667
      value: {fileID: 21300000, guid: 7c375366281bce04eb9d4875f5a216d9, type: 3}
    - time: 1.5833334
      value: {fileID: 21300000, guid: 8d6894b729b9d3645b459b87a4ce0711, type: 3}
    - time: 1.6
      value: {fileID: 21300000, guid: 2b64d96d36b013649ad0e5d0892fb000, type: 3}
    - time: 1.6166667
      value: {fileID: 21300000, guid: 0ec4da4e5f32d4e44821e99db221b43c, type: 3}
    - time: 1.6333333
      value: {fileID: 21300000, guid: ac047e96f9c7d34458f6461590d4e0b1, type: 3}
    - time: 1.65
      value: {fileID: 21300000, guid: e479a0dab7e08b149959844c12b7810e, type: 3}
    - time: 1.6666666
      value: {fileID: 21300000, guid: b491b2a616e417048bfbcd86bb901e39, type: 3}
    - time: 1.6833333
      value: {fileID: 21300000, guid: dfbcb59dbba58b84ba5db4fc1d952ff4, type: 3}
    - time: 1.7
      value: {fileID: 21300000, guid: ab3743f25cce20342af85f2437c3178c, type: 3}
    - time: 1.7166667
      value: {fileID: 21300000, guid: 049ce7da2fb89bd469f2fbfb799aaa4c, type: 3}
    - time: 1.7333333
      value: {fileID: 21300000, guid: 8a745f4a1b7b5ef47aab82a63d13b6eb, type: 3}
    - time: 1.75
      value: {fileID: 21300000, guid: f51637eda9266b54db01f366a09c085f, type: 3}
    attribute: m_Sprite
    path: 
    classID: 212
    script: {fileID: 0}
  m_SampleRate: 60
  m_WrapMode: 0
  m_Bounds:
    m_Center: {x: 0, y: 0, z: 0}
    m_Extent: {x: 0, y: 0, z: 0}
  m_ClipBindingConstant:
    genericBindings:
    - serializedVersion: 2
      path: 0
      attribute: 0
      script: {fileID: 0}
      typeID: 212
      customType: 23
      isPPtrCurve: 1
      isIntCurve: 0
    pptrCurveMapping:
    - {fileID: 21300000, guid: 2f254238cc1222d4ca797ead2f28d219, type: 3}
    - {fileID: 21300000, guid: 7279b79337e495940b163f7dbed594c6, type: 3}
    - {fileID: 21300000, guid: b5c6355be80bd7a46ae4d7c462630a63, type: 3}
    - {fileID: 21300000, guid: 4f1c510fd6ad345468b47972de4916f4, type: 3}
    - {fileID: 21300000, guid: b19ed4042af7d9d439cab46764b25846, type: 3}
    - {fileID: 21300000, guid: ea21caf01f8523d4db976ff8fa618aeb, type: 3}
    - {fileID: 21300000, guid: 8cf4a4f5696b1324fa9a61ece68ada91, type: 3}
    - {fileID: 21300000, guid: 0b3399bf3b32d284f97a60c3897431b5, type: 3}
    - {fileID: 21300000, guid: 8f27bd940ae13d44994bc109f33d1d88, type: 3}
    - {fileID: 21300000, guid: cd446714a8f0658468c4eef70f49177a, type: 3}
    - {fileID: 21300000, guid: 96882a6aac173bb4ca374429901b49f9, type: 3}
    - {fileID: 21300000, guid: ca1dc6c78e5ddd44fbfa7b39b4a985d4, type: 3}
    - {fileID: 21300000, guid: 41d0d330a842c174882ec52eb119b4c3, type: 3}
    - {fileID: 21300000, guid: 115b07a94da7f2f43aa028e748abcade, type: 3}
    - {fileID: 21300000, guid: 9a57fdecb87a9d1409241620313bed5a, type: 3}
    - {fileID: 21300000, guid: 092fc4cb232358e46b7346f0f1c232a1, type: 3}
    - {fileID: 21300000, guid: 233203ab85717ef4eb947e73ca2d701d, type: 3}
    - {fileID: 21300000, guid: 93198838260e47843b084de329dfedc0, type: 3}
    - {fileID: 21300000, guid: c32d08ff17b93b44d81959798eacad20, type: 3}
    - {fileID: 21300000, guid: 84eb8d8273ddfaa44a3698cc036b7d17, type: 3}
    - {fileID: 21300000, guid: 4d6e66c1a334bc247b5634406468b558, type: 3}
    - {fileID: 21300000, guid: d997f80513284534d839d3eb907dcc88, type: 3}
    - {fileID: 21300000, guid: 1b27ba21839a83f418c34271701b7896, type: 3}
    - {fileID: 21300000, guid: 942f9efb8fbec944785dd8a2d5bbcad1, type: 3}
    - {fileID: 21300000, guid: 4750a255d35fd9c46953d0cd0d6419ed, type: 3}
    - {fileID: 21300000, guid: 410e10f7fff115c408efd18486144a1a, type: 3}
    - {fileID: 21300000, guid: 893fe63599604a1429ae22950e6f4015, type: 3}
    - {fileID: 21300000, guid: 397798e0c17b54b4796b1435b26a3c37, type: 3}
    - {fileID: 21300000, guid: f01e0e985f49aed4aa9d040efe740f63, type: 3}
    - {fileID: 21300000, guid: 056627d610ef70e49b1d02f141f85d53, type: 3}
    - {fileID: 21300000, guid: 6a025582c66fcf94d89bd52304265421, type: 3}
    - {fileID: 21300000, guid: acdc34284eaeb5545ac36fba58fbc581, type: 3}
    - {fileID: 21300000, guid: f398ee3b0b3ccfc4e8c694ebc7fa4bc8, type: 3}
    - {fileID: 21300000, guid: 1a3d46469001dd24db7954f74a39226f, type: 3}
    - {fileID: 21300000, guid: 3f31b6d57598dce4695205abc566ad6a, type: 3}
    - {fileID: 21300000, guid: f4fe4a6ce08052646a2a535c4033e01e, type: 3}
    - {fileID: 21300000, guid: 9c5e4389b8dc17b459e534ffedb7c004, type: 3}
    - {fileID: 21300000, guid: 854e8a5f849d0434a870d9548f12e757, type: 3}
    - {fileID: 21300000, guid: a9fd331f4c54c6f4aaf16ad180cda5b1, type: 3}
    - {fileID: 21300000, guid: 34a833db49300774188be8b396528b93, type: 3}
    - {fileID: 21300000, guid: a99c8c127a6be384190ca7d5ec43b7a0, type: 3}
    - {fileID: 21300000, guid: 06e0076c06236ec45afbdb60973e30e4, type: 3}
    - {fileID: 21300000, guid: fc09e6a7a3e1c4c42a59b3d41750494a, type: 3}
    - {fileID: 21300000, guid: 457b64146ee4c3344bd3df9e1097a77b, type: 3}
    - {fileID: 21300000, guid: d8daf298c87586f45a30121c2a1fd12a, type: 3}
    - {fileID: 21300000, guid: 0b8ffc6edcdb8eb4bbcc2a5783907622, type: 3}
    - {fileID: 21300000, guid: 2cf2a6d204eb2f841acc7910a7a7cf74, type: 3}
    - {fileID: 21300000, guid: 3045bb3795b6ba942a81fb4c631ce906, type: 3}
    - {fileID: 21300000, guid: f5e9022747b4e7e44aa02036f5e98ffa, type: 3}
    - {fileID: 21300000, guid: acd79eb4ffbc761488cf6d16a0579508, type: 3}
    - {fileID: 21300000, guid: b0faa1d7daab447408eb4dd962e1c1ca, type: 3}
    - {fileID: 21300000, guid: 298daffdfe244e14e8c91e447f32b9e0, type: 3}
    - {fileID: 21300000, guid: e8955c21871508147a66b9917c3d4b32, type: 3}
    - {fileID: 21300000, guid: 567b1f645d20d624e9dbba4a3e745836, type: 3}
    - {fileID: 21300000, guid: eafec25d651086943a37031ea49ae409, type: 3}
    - {fileID: 21300000, guid: 963ca1f32a261b14d804c5a9fdaf0d4b, type: 3}
    - {fileID: 21300000, guid: 87a227b0b6efdb34aa61b609de850be9, type: 3}
    - {fileID: 21300000, guid: 55a6443d2f64fc449bc0d55b30f9a25c, type: 3}
    - {fileID: 21300000, guid: 07a335d04ccb79949ac800bef7698860, type: 3}
    - {fileID: 21300000, guid: 75ec439f80611aa479828fbfe1c2c4c8, type: 3}
    - {fileID: 21300000, guid: 9d80e04de9dbebe43873fc71a68adb9b, type: 3}
    - {fileID: 21300000, guid: f39827149633b804f9acce863b5125a6, type: 3}
    - {fileID: 21300000, guid: be0f8c4a1faf39d45a7a8b292c00084f, type: 3}
    - {fileID: 21300000, guid: e5a9bf73ff936904d808226a4f468625, type: 3}
    - {fileID: 21300000, guid: 5bf9e39895b629642a1271b98621e5fb, type: 3}
    - {fileID: 21300000, guid: a108e3d88f24df943aa77fb958b4e548, type: 3}
    - {fileID: 21300000, guid: 67179d761e556fd448a3ede03ad69f75, type: 3}
    - {fileID: 21300000, guid: ff5fde83cd4633344b938b63b3de3b8d, type: 3}
    - {fileID: 21300000, guid: 4234d84d762291c4ca7c3b66a6ee9b08, type: 3}
    - {fileID: 21300000, guid: e249014d8c5e47e42abbf75ad1088f8f, type: 3}
    - {fileID: 21300000, guid: 495d5ac57889eef4b8c789cdf10ee9a8, type: 3}
    - {fileID: 21300000, guid: ea9b9ce973059084484050e070254b74, type: 3}
    - {fileID: 21300000, guid: 424f21aab659c424d922e6dbf16b6b7a, type: 3}
    - {fileID: 21300000, guid: 0224f1896a0c60b429d86dd12d9405e5, type: 3}
    - {fileID: 21300000, guid: c0017584da3ad614ba8a895271fe8e52, type: 3}
    - {fileID: 21300000, guid: c1d2b4182e4a94c4ebb2b49912b9e397, type: 3}
    - {fileID: 21300000, guid: 15ba00451aefd144a9de05803758d63c, type: 3}
    - {fileID: 21300000, guid: 77c9c8196035b1743acebd610da54645, type: 3}
    - {fileID: 21300000, guid: ee1e4dc661ff26c42854e13c0a1578cb, type: 3}
    - {fileID: 21300000, guid: f1d43723702589948bb1f2ee3a567565, type: 3}
    - {fileID: 21300000, guid: 12f8a94e35dccdb42a7c1c390c45c521, type: 3}
    - {fileID: 21300000, guid: b0e1950564174ca4787828b5f00e6a9a, type: 3}
    - {fileID: 21300000, guid: 4ca3c21d4ba803247a20780d7d71fbf0, type: 3}
    - {fileID: 21300000, guid: cb805308b50d5984f8ac79d3b39c297a, type: 3}
    - {fileID: 21300000, guid: 05f84161f26899b408c5f404dc68f111, type: 3}
    - {fileID: 21300000, guid: f3a1aab52b1a6764da3148749c33fa97, type: 3}
    - {fileID: 21300000, guid: 71f1d09b650911743b83b2b8bf1e5462, type: 3}
    - {fileID: 21300000, guid: 78d9d9fbc332e0c4ba2a5405ff05235c, type: 3}
    - {fileID: 21300000, guid: ba7ea8b96efb8364facc0de7d9422395, type: 3}
    - {fileID: 21300000, guid: 173f999a5f0d6de4da133b07590f7b96, type: 3}
    - {fileID: 21300000, guid: c394d528a51573847a187956ff3eba28, type: 3}
    - {fileID: 21300000, guid: 0a72116ae7d8d67438e1c455e3587ec1, type: 3}
    - {fileID: 21300000, guid: bf88e046dd174fd46ab2ae73867b9206, type: 3}
    - {fileID: 21300000, guid: 1d84b7fad960a6a4184828890784e4d9, type: 3}
    - {fileID: 21300000, guid: 7c375366281bce04eb9d4875f5a216d9, type: 3}
    - {fileID: 21300000, guid: 8d6894b729b9d3645b459b87a4ce0711, type: 3}
    - {fileID: 21300000, guid: 2b64d96d36b013649ad0e5d0892fb000, type: 3}
    - {fileID: 21300000, guid: 0ec4da4e5f32d4e44821e99db221b43c, type: 3}
    - {fileID: 21300000, guid: ac047e96f9c7d34458f6461590d4e0b1, type: 3}
    - {fileID: 21300000, guid: e479a0dab7e08b149959844c12b7810e, type: 3}
    - {fileID: 21300000, guid: b491b2a616e417048bfbcd86bb901e39, type: 3}
    - {fileID: 21300000, guid: dfbcb59dbba58b84ba5db4fc1d952ff4, type: 3}
    - {fileID: 21300000, guid: ab3743f25cce20342af85f2437c3178c, type: 3}
    - {fileID: 21300000, guid: 049ce7da2fb89bd469f2fbfb799aaa4c, type: 3}
    - {fileID: 21300000, guid: 8a745f4a1b7b5ef47aab82a63d13b6eb, type: 3}
    - {fileID: 21300000, guid: f51637eda9266b54db01f366a09c085f, type: 3}
  m_AnimationClipSettings:
    serializedVersion: 2
    m_AdditiveReferencePoseClip: {fileID: 0}
    m_AdditiveReferencePoseTime: 0
    m_StartTime: 0
    m_StopTime: 1.7666667
    m_OrientationOffsetY: 0
    m_Level: 0
    m_CycleOffset: 0
    m_HasAdditiveReferencePose: 0
    m_LoopTime: 0
    m_LoopBlend: 0
    m_LoopBlendOrientation: 0
    m_LoopBlendPositionY: 0
    m_LoopBlendPositionXZ: 0
    m_KeepOriginalOrientation: 0
    m_KeepOriginalPositionY: 1
    m_KeepOriginalPositionXZ: 0
    m_HeightFromFeet: 0
    m_Mirror: 0
  m_EditorCurves: []
  m_EulerEditorCurves: []
  m_HasGenericRootTransform: 0
  m_HasMotionFloatCurves: 0
  m_Events: []
