%YAML 1.1
%TAG !u! tag:unity3d.com,2011:
--- !u!74 &7400000
AnimationClip:
  m_ObjectHideFlags: 0
  m_CorrespondingSourceObject: {fileID: 0}
  m_PrefabInstance: {fileID: 0}
  m_PrefabAsset: {fileID: 0}
  m_Name: Right to left
  serializedVersion: 7
  m_Legacy: 0
  m_Compressed: 0
  m_UseHighQualityCurve: 1
  m_RotationCurves: []
  m_CompressedRotationCurves: []
  m_EulerCurves: []
  m_PositionCurves: []
  m_ScaleCurves: []
  m_FloatCurves: []
  m_PPtrCurves:
  - curve:
    - time: 0
      value: {fileID: 21300000, guid: 0969ccde039e9f748b3bf54ce31c6ab5, type: 3}
    - time: 0.016666668
      value: {fileID: 21300000, guid: 361030787d59d2045a1e7ad8d3824406, type: 3}
    - time: 0.033333335
      value: {fileID: 21300000, guid: 455a9f91fb6f2b34ba9f0d503298e853, type: 3}
    - time: 0.05
      value: {fileID: 21300000, guid: 6d9096148913d6640b79c2bc38a98b4b, type: 3}
    - time: 0.06666667
      value: {fileID: 21300000, guid: 5cdf97627cbde774890365ae0712b9ff, type: 3}
    - time: 0.083333336
      value: {fileID: 21300000, guid: 16a4ea42be45f01408bca4082007618a, type: 3}
    - time: 0.1
      value: {fileID: 21300000, guid: 91daae837e417934cb5834e3eef61f6a, type: 3}
    - time: 0.11666667
      value: {fileID: 21300000, guid: 8ee29d8f7d526e948b271346bc9d0025, type: 3}
    - time: 0.13333334
      value: {fileID: 21300000, guid: 6e2902669f8384448b8de07907a9e3a6, type: 3}
    - time: 0.15
      value: {fileID: 21300000, guid: a997bacc46e65444dbb47e52e09ea2f2, type: 3}
    - time: 0.16666667
      value: {fileID: 21300000, guid: 0698c319b8bdc024b805c763ad83cbcb, type: 3}
    - time: 0.18333334
      value: {fileID: 21300000, guid: 1e278ff029799ee46bb502fb0e6e88ef, type: 3}
    - time: 0.2
      value: {fileID: 21300000, guid: 4bf206645ee8a2e47914b4aaeb4934f1, type: 3}
    - time: 0.21666667
      value: {fileID: 21300000, guid: 41fcbf867c99c05408ea3cf16933e742, type: 3}
    - time: 0.23333333
      value: {fileID: 21300000, guid: 5096fa11bf8ee474094dc495e3339c7c, type: 3}
    - time: 0.25
      value: {fileID: 21300000, guid: 0c51d52c9de8e5c49a985d68c7b16ba0, type: 3}
    - time: 0.26666668
      value: {fileID: 21300000, guid: 8cf174138776f9d4fb4896810b35e705, type: 3}
    - time: 0.28333333
      value: {fileID: 21300000, guid: a901876f1c2aa77438add8d22245be29, type: 3}
    - time: 0.3
      value: {fileID: 21300000, guid: 4597e7e2b0792204b8cf91a7ffab1480, type: 3}
    - time: 0.31666666
      value: {fileID: 21300000, guid: faa30df0caa1a3240a2625821ba94ed7, type: 3}
    - time: 0.33333334
      value: {fileID: 21300000, guid: 5f0c6f4c8c29ef545bc0f0cb1987c910, type: 3}
    - time: 0.35
      value: {fileID: 21300000, guid: 50c5e53102ff25c4c80bf5a9ac54fbf7, type: 3}
    - time: 0.36666667
      value: {fileID: 21300000, guid: b251f800c1514bc43a0cc35785defa2c, type: 3}
    - time: 0.38333333
      value: {fileID: 21300000, guid: 87b309a84887f334087b0e6501d1c321, type: 3}
    - time: 0.4
      value: {fileID: 21300000, guid: 16e6265b77c59af4f9c9dea669228005, type: 3}
    - time: 0.41666666
      value: {fileID: 21300000, guid: b262cf075a7942745a15a80667c78e3e, type: 3}
    - time: 0.43333334
      value: {fileID: 21300000, guid: 94d265810d9b25543ba21b0f35d83e21, type: 3}
    - time: 0.45
      value: {fileID: 21300000, guid: 29cc7187eb56aa34a871a9e8ba89a84d, type: 3}
    - time: 0.46666667
      value: {fileID: 21300000, guid: 4f48d87673ea69d41b83f50682112f7a, type: 3}
    - time: 0.48333332
      value: {fileID: 21300000, guid: e4d5d03a33245cb46b5937b62ce29db0, type: 3}
    - time: 0.5
      value: {fileID: 21300000, guid: 0f66ac3bcf3ff3d4d8ad7204ffe6d89f, type: 3}
    - time: 0.51666665
      value: {fileID: 21300000, guid: ef771f06afe32c645bea4fcfb8e06675, type: 3}
    - time: 0.53333336
      value: {fileID: 21300000, guid: 456885591e4fce64ba5e9ebfc18acb0a, type: 3}
    - time: 0.55
      value: {fileID: 21300000, guid: db6f31fede447974cbb48b45f3ef0080, type: 3}
    - time: 0.56666666
      value: {fileID: 21300000, guid: fce04f58c12ddb54fae17938d3e2b220, type: 3}
    - time: 0.5833333
      value: {fileID: 21300000, guid: 129ae330c5e4ab942a240c788d3fdf2b, type: 3}
    - time: 0.6
      value: {fileID: 21300000, guid: 50bc86c6542df564e89bba0dd4954267, type: 3}
    - time: 0.6166667
      value: {fileID: 21300000, guid: 14d9247b61a18cc438b8d53098ed541a, type: 3}
    - time: 0.6333333
      value: {fileID: 21300000, guid: 93c7c5c2cd3d7644ca62502c03d77ee7, type: 3}
    - time: 0.65
      value: {fileID: 21300000, guid: f50381ee94993934189724067c5a2509, type: 3}
    - time: 0.6666667
      value: {fileID: 21300000, guid: dbbdc7ef0d4b7504787e2811778a3c93, type: 3}
    - time: 0.68333334
      value: {fileID: 21300000, guid: 826fb0e664b92e548954dce02101c4e0, type: 3}
    - time: 0.7
      value: {fileID: 21300000, guid: a89089c3067f0f943a36ec589f1750a0, type: 3}
    - time: 0.71666664
      value: {fileID: 21300000, guid: 9ccc1865e0f66a346855891cf8df1392, type: 3}
    - time: 0.73333335
      value: {fileID: 21300000, guid: fbf427cc96fd6494aadc4143008e1aea, type: 3}
    - time: 0.75
      value: {fileID: 21300000, guid: aa3ab7d18340c0b47a3bcbc38f2d7d4d, type: 3}
    - time: 0.76666665
      value: {fileID: 21300000, guid: 891f74ee69bc8de4aa00be19add319fc, type: 3}
    - time: 0.78333336
      value: {fileID: 21300000, guid: da3f2a8408b4f8b40830ac4601c6a1c7, type: 3}
    - time: 0.8
      value: {fileID: 21300000, guid: 880e9646f1dd33645912c8185ca6f02d, type: 3}
    - time: 0.81666666
      value: {fileID: 21300000, guid: b8fb41c851fddb64a879a41c08d78dc2, type: 3}
    - time: 0.8333333
      value: {fileID: 21300000, guid: 13bc5230fc15a5f469a9a43190eea451, type: 3}
    - time: 0.85
      value: {fileID: 21300000, guid: d999c0c6b24d93448832736ba0d98a8f, type: 3}
    - time: 0.8666667
      value: {fileID: 21300000, guid: 4c193ae43e8ea55468ccbf9ac0908468, type: 3}
    - time: 0.8833333
      value: {fileID: 21300000, guid: 0d737e8e2056eca4980edb1d838ba742, type: 3}
    - time: 0.9
      value: {fileID: 21300000, guid: cfab00f8ff90c074bb8e5478d5879b5d, type: 3}
    - time: 0.9166667
      value: {fileID: 21300000, guid: f6981a115a61b944d9d000dc00c52de8, type: 3}
    - time: 0.93333334
      value: {fileID: 21300000, guid: f2cb9f71893e9fc49bd7a39232060816, type: 3}
    - time: 0.95
      value: {fileID: 21300000, guid: a85ecddc0a1ec164bbf6374cadcd4974, type: 3}
    - time: 0.96666664
      value: {fileID: 21300000, guid: 1a99c086e4918b34ea5f7ceec6b8970b, type: 3}
    - time: 0.98333335
      value: {fileID: 21300000, guid: ae6440582464aac47bb4e18582178441, type: 3}
    - time: 1
      value: {fileID: 21300000, guid: 4a0368126c7e0d64b9cfd0a19ce6ac8e, type: 3}
    - time: 1.0166667
      value: {fileID: 21300000, guid: fb8b212272f0313449783a4d9c5e47c2, type: 3}
    - time: 1.0333333
      value: {fileID: 21300000, guid: 8439dcbf64401d94eb43627cd78c1644, type: 3}
    - time: 1.05
      value: {fileID: 21300000, guid: 385a7783fbb024f42bf776d6d55449e8, type: 3}
    - time: 1.0666667
      value: {fileID: 21300000, guid: 30bf162ba9426884caad7492852d88ce, type: 3}
    - time: 1.0833334
      value: {fileID: 21300000, guid: 944655348c5075748a726830d41abd4d, type: 3}
    - time: 1.1
      value: {fileID: 21300000, guid: a94c0b619d605e649a222c5b7b3fc059, type: 3}
    - time: 1.1166667
      value: {fileID: 21300000, guid: 2dfbdb4621f0b7542ad7e20c076243f5, type: 3}
    - time: 1.1333333
      value: {fileID: 21300000, guid: 63ed01cf7abd20543b651b7b8e2046f5, type: 3}
    - time: 1.15
      value: {fileID: 21300000, guid: 4dcb29cfb0f925849b04d0a0f8769950, type: 3}
    - time: 1.1666666
      value: {fileID: 21300000, guid: 3247efe980e34cd46a90cf298a7efafb, type: 3}
    - time: 1.1833333
      value: {fileID: 21300000, guid: 42af15b9deb21ea43b5a469c4e80fe1e, type: 3}
    - time: 1.2
      value: {fileID: 21300000, guid: 5e787855bde77494c8342d46da464033, type: 3}
    - time: 1.2166667
      value: {fileID: 21300000, guid: eb9f1677223b82144986e209bdf7f6e4, type: 3}
    - time: 1.2333333
      value: {fileID: 21300000, guid: 71e53a4d45b0d6f4f952d563e947dab7, type: 3}
    - time: 1.25
      value: {fileID: 21300000, guid: 109e08e31498b34488042e9c4a885c84, type: 3}
    - time: 1.2666667
      value: {fileID: 21300000, guid: 76901fe29a664e24f84fb8860969cd83, type: 3}
    - time: 1.2833333
      value: {fileID: 21300000, guid: 52e2d35e43148d54987da6df368bda80, type: 3}
    - time: 1.3
      value: {fileID: 21300000, guid: ba6e754d92f24b444a2cb26ebbbcb8b4, type: 3}
    - time: 1.3166667
      value: {fileID: 21300000, guid: fcb7749f925aa55418fde94213e6106b, type: 3}
    - time: 1.3333334
      value: {fileID: 21300000, guid: 0fa163c6acb89cd45a2ac692cf23ec28, type: 3}
    - time: 1.35
      value: {fileID: 21300000, guid: 7f39415797454864ba7ed0a124a862c4, type: 3}
    - time: 1.3666667
      value: {fileID: 21300000, guid: bdf1ec1ecba92374491323289eb3e869, type: 3}
    - time: 1.3833333
      value: {fileID: 21300000, guid: e1e80c1663ba41c429049f59edc53a6f, type: 3}
    - time: 1.4
      value: {fileID: 21300000, guid: 2736b6f18fa278f448e9498811f37528, type: 3}
    - time: 1.4166666
      value: {fileID: 21300000, guid: 38d03ebabfc5cc44398d3b8d8bc2db32, type: 3}
    - time: 1.4333333
      value: {fileID: 21300000, guid: 8b70805e47cc62e44805ae4052dd3b7f, type: 3}
    - time: 1.45
      value: {fileID: 21300000, guid: 6e4991a35eebfe34ea808ef4098382e3, type: 3}
    - time: 1.4666667
      value: {fileID: 21300000, guid: 84d344012488b214398e1948e491eb2a, type: 3}
    - time: 1.4833333
      value: {fileID: 21300000, guid: 33b7851142927994a842d24bfa27bca5, type: 3}
    - time: 1.5
      value: {fileID: 21300000, guid: 4f11cb905bdbdf744b2c13ae69fbeb0f, type: 3}
    - time: 1.5166667
      value: {fileID: 21300000, guid: ee3ab04aa8aa00149a6f8bf2e77ee2df, type: 3}
    - time: 1.5333333
      value: {fileID: 21300000, guid: 82ad4965af4bce341a19278310172721, type: 3}
    - time: 1.55
      value: {fileID: 21300000, guid: dbb06d00b428dc549b67b4db5e7dc02f, type: 3}
    - time: 1.5666667
      value: {fileID: 21300000, guid: 91f29b3e094ee45478deacbc506d6698, type: 3}
    - time: 1.5833334
      value: {fileID: 21300000, guid: ff471bea3883c5c4b869067fc1da06a9, type: 3}
    attribute: m_Sprite
    path: 
    classID: 212
    script: {fileID: 0}
  m_SampleRate: 60
  m_WrapMode: 0
  m_Bounds:
    m_Center: {x: 0, y: 0, z: 0}
    m_Extent: {x: 0, y: 0, z: 0}
  m_ClipBindingConstant:
    genericBindings:
    - serializedVersion: 2
      path: 0
      attribute: 0
      script: {fileID: 0}
      typeID: 212
      customType: 23
      isPPtrCurve: 1
      isIntCurve: 0
    pptrCurveMapping:
    - {fileID: 21300000, guid: 0969ccde039e9f748b3bf54ce31c6ab5, type: 3}
    - {fileID: 21300000, guid: 361030787d59d2045a1e7ad8d3824406, type: 3}
    - {fileID: 21300000, guid: 455a9f91fb6f2b34ba9f0d503298e853, type: 3}
    - {fileID: 21300000, guid: 6d9096148913d6640b79c2bc38a98b4b, type: 3}
    - {fileID: 21300000, guid: 5cdf97627cbde774890365ae0712b9ff, type: 3}
    - {fileID: 21300000, guid: 16a4ea42be45f01408bca4082007618a, type: 3}
    - {fileID: 21300000, guid: 91daae837e417934cb5834e3eef61f6a, type: 3}
    - {fileID: 21300000, guid: 8ee29d8f7d526e948b271346bc9d0025, type: 3}
    - {fileID: 21300000, guid: 6e2902669f8384448b8de07907a9e3a6, type: 3}
    - {fileID: 21300000, guid: a997bacc46e65444dbb47e52e09ea2f2, type: 3}
    - {fileID: 21300000, guid: 0698c319b8bdc024b805c763ad83cbcb, type: 3}
    - {fileID: 21300000, guid: 1e278ff029799ee46bb502fb0e6e88ef, type: 3}
    - {fileID: 21300000, guid: 4bf206645ee8a2e47914b4aaeb4934f1, type: 3}
    - {fileID: 21300000, guid: 41fcbf867c99c05408ea3cf16933e742, type: 3}
    - {fileID: 21300000, guid: 5096fa11bf8ee474094dc495e3339c7c, type: 3}
    - {fileID: 21300000, guid: 0c51d52c9de8e5c49a985d68c7b16ba0, type: 3}
    - {fileID: 21300000, guid: 8cf174138776f9d4fb4896810b35e705, type: 3}
    - {fileID: 21300000, guid: a901876f1c2aa77438add8d22245be29, type: 3}
    - {fileID: 21300000, guid: 4597e7e2b0792204b8cf91a7ffab1480, type: 3}
    - {fileID: 21300000, guid: faa30df0caa1a3240a2625821ba94ed7, type: 3}
    - {fileID: 21300000, guid: 5f0c6f4c8c29ef545bc0f0cb1987c910, type: 3}
    - {fileID: 21300000, guid: 50c5e53102ff25c4c80bf5a9ac54fbf7, type: 3}
    - {fileID: 21300000, guid: b251f800c1514bc43a0cc35785defa2c, type: 3}
    - {fileID: 21300000, guid: 87b309a84887f334087b0e6501d1c321, type: 3}
    - {fileID: 21300000, guid: 16e6265b77c59af4f9c9dea669228005, type: 3}
    - {fileID: 21300000, guid: b262cf075a7942745a15a80667c78e3e, type: 3}
    - {fileID: 21300000, guid: 94d265810d9b25543ba21b0f35d83e21, type: 3}
    - {fileID: 21300000, guid: 29cc7187eb56aa34a871a9e8ba89a84d, type: 3}
    - {fileID: 21300000, guid: 4f48d87673ea69d41b83f50682112f7a, type: 3}
    - {fileID: 21300000, guid: e4d5d03a33245cb46b5937b62ce29db0, type: 3}
    - {fileID: 21300000, guid: 0f66ac3bcf3ff3d4d8ad7204ffe6d89f, type: 3}
    - {fileID: 21300000, guid: ef771f06afe32c645bea4fcfb8e06675, type: 3}
    - {fileID: 21300000, guid: 456885591e4fce64ba5e9ebfc18acb0a, type: 3}
    - {fileID: 21300000, guid: db6f31fede447974cbb48b45f3ef0080, type: 3}
    - {fileID: 21300000, guid: fce04f58c12ddb54fae17938d3e2b220, type: 3}
    - {fileID: 21300000, guid: 129ae330c5e4ab942a240c788d3fdf2b, type: 3}
    - {fileID: 21300000, guid: 50bc86c6542df564e89bba0dd4954267, type: 3}
    - {fileID: 21300000, guid: 14d9247b61a18cc438b8d53098ed541a, type: 3}
    - {fileID: 21300000, guid: 93c7c5c2cd3d7644ca62502c03d77ee7, type: 3}
    - {fileID: 21300000, guid: f50381ee94993934189724067c5a2509, type: 3}
    - {fileID: 21300000, guid: dbbdc7ef0d4b7504787e2811778a3c93, type: 3}
    - {fileID: 21300000, guid: 826fb0e664b92e548954dce02101c4e0, type: 3}
    - {fileID: 21300000, guid: a89089c3067f0f943a36ec589f1750a0, type: 3}
    - {fileID: 21300000, guid: 9ccc1865e0f66a346855891cf8df1392, type: 3}
    - {fileID: 21300000, guid: fbf427cc96fd6494aadc4143008e1aea, type: 3}
    - {fileID: 21300000, guid: aa3ab7d18340c0b47a3bcbc38f2d7d4d, type: 3}
    - {fileID: 21300000, guid: 891f74ee69bc8de4aa00be19add319fc, type: 3}
    - {fileID: 21300000, guid: da3f2a8408b4f8b40830ac4601c6a1c7, type: 3}
    - {fileID: 21300000, guid: 880e9646f1dd33645912c8185ca6f02d, type: 3}
    - {fileID: 21300000, guid: b8fb41c851fddb64a879a41c08d78dc2, type: 3}
    - {fileID: 21300000, guid: 13bc5230fc15a5f469a9a43190eea451, type: 3}
    - {fileID: 21300000, guid: d999c0c6b24d93448832736ba0d98a8f, type: 3}
    - {fileID: 21300000, guid: 4c193ae43e8ea55468ccbf9ac0908468, type: 3}
    - {fileID: 21300000, guid: 0d737e8e2056eca4980edb1d838ba742, type: 3}
    - {fileID: 21300000, guid: cfab00f8ff90c074bb8e5478d5879b5d, type: 3}
    - {fileID: 21300000, guid: f6981a115a61b944d9d000dc00c52de8, type: 3}
    - {fileID: 21300000, guid: f2cb9f71893e9fc49bd7a39232060816, type: 3}
    - {fileID: 21300000, guid: a85ecddc0a1ec164bbf6374cadcd4974, type: 3}
    - {fileID: 21300000, guid: 1a99c086e4918b34ea5f7ceec6b8970b, type: 3}
    - {fileID: 21300000, guid: ae6440582464aac47bb4e18582178441, type: 3}
    - {fileID: 21300000, guid: 4a0368126c7e0d64b9cfd0a19ce6ac8e, type: 3}
    - {fileID: 21300000, guid: fb8b212272f0313449783a4d9c5e47c2, type: 3}
    - {fileID: 21300000, guid: 8439dcbf64401d94eb43627cd78c1644, type: 3}
    - {fileID: 21300000, guid: 385a7783fbb024f42bf776d6d55449e8, type: 3}
    - {fileID: 21300000, guid: 30bf162ba9426884caad7492852d88ce, type: 3}
    - {fileID: 21300000, guid: 944655348c5075748a726830d41abd4d, type: 3}
    - {fileID: 21300000, guid: a94c0b619d605e649a222c5b7b3fc059, type: 3}
    - {fileID: 21300000, guid: 2dfbdb4621f0b7542ad7e20c076243f5, type: 3}
    - {fileID: 21300000, guid: 63ed01cf7abd20543b651b7b8e2046f5, type: 3}
    - {fileID: 21300000, guid: 4dcb29cfb0f925849b04d0a0f8769950, type: 3}
    - {fileID: 21300000, guid: 3247efe980e34cd46a90cf298a7efafb, type: 3}
    - {fileID: 21300000, guid: 42af15b9deb21ea43b5a469c4e80fe1e, type: 3}
    - {fileID: 21300000, guid: 5e787855bde77494c8342d46da464033, type: 3}
    - {fileID: 21300000, guid: eb9f1677223b82144986e209bdf7f6e4, type: 3}
    - {fileID: 21300000, guid: 71e53a4d45b0d6f4f952d563e947dab7, type: 3}
    - {fileID: 21300000, guid: 109e08e31498b34488042e9c4a885c84, type: 3}
    - {fileID: 21300000, guid: 76901fe29a664e24f84fb8860969cd83, type: 3}
    - {fileID: 21300000, guid: 52e2d35e43148d54987da6df368bda80, type: 3}
    - {fileID: 21300000, guid: ba6e754d92f24b444a2cb26ebbbcb8b4, type: 3}
    - {fileID: 21300000, guid: fcb7749f925aa55418fde94213e6106b, type: 3}
    - {fileID: 21300000, guid: 0fa163c6acb89cd45a2ac692cf23ec28, type: 3}
    - {fileID: 21300000, guid: 7f39415797454864ba7ed0a124a862c4, type: 3}
    - {fileID: 21300000, guid: bdf1ec1ecba92374491323289eb3e869, type: 3}
    - {fileID: 21300000, guid: e1e80c1663ba41c429049f59edc53a6f, type: 3}
    - {fileID: 21300000, guid: 2736b6f18fa278f448e9498811f37528, type: 3}
    - {fileID: 21300000, guid: 38d03ebabfc5cc44398d3b8d8bc2db32, type: 3}
    - {fileID: 21300000, guid: 8b70805e47cc62e44805ae4052dd3b7f, type: 3}
    - {fileID: 21300000, guid: 6e4991a35eebfe34ea808ef4098382e3, type: 3}
    - {fileID: 21300000, guid: 84d344012488b214398e1948e491eb2a, type: 3}
    - {fileID: 21300000, guid: 33b7851142927994a842d24bfa27bca5, type: 3}
    - {fileID: 21300000, guid: 4f11cb905bdbdf744b2c13ae69fbeb0f, type: 3}
    - {fileID: 21300000, guid: ee3ab04aa8aa00149a6f8bf2e77ee2df, type: 3}
    - {fileID: 21300000, guid: 82ad4965af4bce341a19278310172721, type: 3}
    - {fileID: 21300000, guid: dbb06d00b428dc549b67b4db5e7dc02f, type: 3}
    - {fileID: 21300000, guid: 91f29b3e094ee45478deacbc506d6698, type: 3}
    - {fileID: 21300000, guid: ff471bea3883c5c4b869067fc1da06a9, type: 3}
  m_AnimationClipSettings:
    serializedVersion: 2
    m_AdditiveReferencePoseClip: {fileID: 0}
    m_AdditiveReferencePoseTime: 0
    m_StartTime: 0
    m_StopTime: 1.6
    m_OrientationOffsetY: 0
    m_Level: 0
    m_CycleOffset: 0
    m_HasAdditiveReferencePose: 0
    m_LoopTime: 0
    m_LoopBlend: 0
    m_LoopBlendOrientation: 0
    m_LoopBlendPositionY: 0
    m_LoopBlendPositionXZ: 0
    m_KeepOriginalOrientation: 0
    m_KeepOriginalPositionY: 1
    m_KeepOriginalPositionXZ: 0
    m_HeightFromFeet: 0
    m_Mirror: 0
  m_EditorCurves: []
  m_EulerEditorCurves: []
  m_HasGenericRootTransform: 0
  m_HasMotionFloatCurves: 0
  m_Events: []
