Library\Bee\artifacts\mvdfrm\Unity.Services.Core.Internal.ref.dll_1A693ED936C5C9EF.mvfrm
Library\Bee\artifacts\mvdfrm\UnityEngine.UI.ref.dll_FAE6DBEA21006BE5.mvfrm
Library\Bee\artifacts\mvdfrm\UnityEngine.AccessibilityModule.dll_D382B1AE5A9F8C4B.mvfrm
Library\Bee\artifacts\mvdfrm\UnityEngine.AIModule.dll_E8B3C737D410723F.mvfrm
Library\Bee\artifacts\mvdfrm\UnityEngine.AndroidJNIModule.dll_7C5E6A268401577D.mvfrm
Library\Bee\artifacts\mvdfrm\UnityEngine.AnimationModule.dll_06BED982EF03E031.mvfrm
Library\Bee\artifacts\mvdfrm\UnityEngine.ARModule.dll_A2268C3B312DD108.mvfrm
Library\Bee\artifacts\mvdfrm\UnityEngine.AssetBundleModule.dll_78804849974E577F.mvfrm
Library\Bee\artifacts\mvdfrm\UnityEngine.AudioModule.dll_97ADF0F2AC844CE3.mvfrm
Library\Bee\artifacts\mvdfrm\UnityEngine.ClothModule.dll_FE964DED86A12BC7.mvfrm
Library\Bee\artifacts\mvdfrm\UnityEngine.ClusterInputModule.dll_6C193F04780D4647.mvfrm
Library\Bee\artifacts\mvdfrm\UnityEngine.ClusterRendererModule.dll_7EB14B832CEA4AEA.mvfrm
Library\Bee\artifacts\mvdfrm\UnityEngine.CoreModule.dll_7A16C4382A898A76.mvfrm
Library\Bee\artifacts\mvdfrm\UnityEngine.CrashReportingModule.dll_9506F981883C43CE.mvfrm
Library\Bee\artifacts\mvdfrm\UnityEngine.DirectorModule.dll_D6B53318CA33C613.mvfrm
Library\Bee\artifacts\mvdfrm\UnityEngine.dll_0F3E4DB83232D53F.mvfrm
Library\Bee\artifacts\mvdfrm\UnityEngine.DSPGraphModule.dll_DC0694823C949734.mvfrm
Library\Bee\artifacts\mvdfrm\UnityEngine.GameCenterModule.dll_A6ABB4414A42486E.mvfrm
Library\Bee\artifacts\mvdfrm\UnityEngine.GIModule.dll_80F010456FBF5A59.mvfrm
Library\Bee\artifacts\mvdfrm\UnityEngine.GridModule.dll_5787E02642DE206D.mvfrm
Library\Bee\artifacts\mvdfrm\UnityEngine.HotReloadModule.dll_88079788CA36FBB3.mvfrm
Library\Bee\artifacts\mvdfrm\UnityEngine.ImageConversionModule.dll_EAA34933AF0F02DE.mvfrm
Library\Bee\artifacts\mvdfrm\UnityEngine.IMGUIModule.dll_D00D905972B5E0C4.mvfrm
Library\Bee\artifacts\mvdfrm\UnityEngine.InputLegacyModule.dll_09C563682F400D70.mvfrm
Library\Bee\artifacts\mvdfrm\UnityEngine.InputModule.dll_FE23B8A322BC7187.mvfrm
Library\Bee\artifacts\mvdfrm\UnityEngine.JSONSerializeModule.dll_339A3AEA59DAECD5.mvfrm
Library\Bee\artifacts\mvdfrm\UnityEngine.LocalizationModule.dll_AA6609570F893940.mvfrm
Library\Bee\artifacts\mvdfrm\UnityEngine.ParticleSystemModule.dll_E81942CDF64DCF5C.mvfrm
Library\Bee\artifacts\mvdfrm\UnityEngine.PerformanceReportingModule.dll_EA4B2F7D6B7D1535.mvfrm
Library\Bee\artifacts\mvdfrm\UnityEngine.Physics2DModule.dll_5364C9739000D7C6.mvfrm
Library\Bee\artifacts\mvdfrm\UnityEngine.PhysicsModule.dll_7C2BB5791DC4C214.mvfrm
Library\Bee\artifacts\mvdfrm\UnityEngine.ProfilerModule.dll_08FB6C4F638D4D20.mvfrm
Library\Bee\artifacts\mvdfrm\UnityEngine.RuntimeInitializeOnLoadManagerInitializerModule.dll_B2FE0E8D1A56D48F.mvfrm
Library\Bee\artifacts\mvdfrm\UnityEngine.ScreenCaptureModule.dll_4D81E86F6E471937.mvfrm
Library\Bee\artifacts\mvdfrm\UnityEngine.SharedInternalsModule.dll_6EB48809263CFE2E.mvfrm
Library\Bee\artifacts\mvdfrm\UnityEngine.SpriteMaskModule.dll_8FD826D16BB1DDE8.mvfrm
Library\Bee\artifacts\mvdfrm\UnityEngine.SpriteShapeModule.dll_91E175A44CF08F89.mvfrm
Library\Bee\artifacts\mvdfrm\UnityEngine.StreamingModule.dll_BB53C6D33E8B976F.mvfrm
Library\Bee\artifacts\mvdfrm\UnityEngine.SubstanceModule.dll_97FEDB1C89DE957D.mvfrm
Library\Bee\artifacts\mvdfrm\UnityEngine.SubsystemsModule.dll_FA858D3339F9C5FB.mvfrm
Library\Bee\artifacts\mvdfrm\UnityEngine.TerrainModule.dll_967230E7F3830B02.mvfrm
Library\Bee\artifacts\mvdfrm\UnityEngine.TerrainPhysicsModule.dll_E893EBA10F90C9E9.mvfrm
Library\Bee\artifacts\mvdfrm\UnityEngine.TextCoreFontEngineModule.dll_06B30D2DE2C75F34.mvfrm
Library\Bee\artifacts\mvdfrm\UnityEngine.TextCoreTextEngineModule.dll_4E9B439F724B1852.mvfrm
Library\Bee\artifacts\mvdfrm\UnityEngine.TextRenderingModule.dll_76C15A7A257E992C.mvfrm
Library\Bee\artifacts\mvdfrm\UnityEngine.TilemapModule.dll_356E98690B3FEC0B.mvfrm
Library\Bee\artifacts\mvdfrm\UnityEngine.TLSModule.dll_AE40D1CF6AF26DE8.mvfrm
Library\Bee\artifacts\mvdfrm\UnityEngine.UIElementsModule.dll_FEC3EE9B3D2601F2.mvfrm
Library\Bee\artifacts\mvdfrm\UnityEngine.UIElementsNativeModule.dll_CA1BE1FAF7D5BD09.mvfrm
Library\Bee\artifacts\mvdfrm\UnityEngine.UIModule.dll_E4276565305777EB.mvfrm
Library\Bee\artifacts\mvdfrm\UnityEngine.UmbraModule.dll_12829D0B39AAF856.mvfrm
Library\Bee\artifacts\mvdfrm\UnityEngine.UNETModule.dll_0CBD0C2177987FEF.mvfrm
Library\Bee\artifacts\mvdfrm\UnityEngine.UnityAnalyticsModule.dll_07B8B397A2752158.mvfrm
Library\Bee\artifacts\mvdfrm\UnityEngine.UnityConnectModule.dll_D9DC4DFDC10D742C.mvfrm
Library\Bee\artifacts\mvdfrm\UnityEngine.UnityCurlModule.dll_39DB7AB45F17D21E.mvfrm
Library\Bee\artifacts\mvdfrm\UnityEngine.UnityTestProtocolModule.dll_C9F3DB207036F58C.mvfrm
Library\Bee\artifacts\mvdfrm\UnityEngine.UnityWebRequestAssetBundleModule.dll_EF9DCE53F6C48629.mvfrm
Library\Bee\artifacts\mvdfrm\UnityEngine.UnityWebRequestAudioModule.dll_6247835BF1E7DFCD.mvfrm
Library\Bee\artifacts\mvdfrm\UnityEngine.UnityWebRequestModule.dll_FC4250DDBA039D5D.mvfrm
Library\Bee\artifacts\mvdfrm\UnityEngine.UnityWebRequestTextureModule.dll_A9D8E75493D32142.mvfrm
Library\Bee\artifacts\mvdfrm\UnityEngine.UnityWebRequestWWWModule.dll_195D88FB620AD4BE.mvfrm
Library\Bee\artifacts\mvdfrm\UnityEngine.VehiclesModule.dll_4E782C98445D95AE.mvfrm
Library\Bee\artifacts\mvdfrm\UnityEngine.VFXModule.dll_2F1F6A3E415FD755.mvfrm
Library\Bee\artifacts\mvdfrm\UnityEngine.VideoModule.dll_BCB7755D6F166888.mvfrm
Library\Bee\artifacts\mvdfrm\UnityEngine.VirtualTexturingModule.dll_EEA89669D0843D94.mvfrm
Library\Bee\artifacts\mvdfrm\UnityEngine.VRModule.dll_36F98BEAD211FD63.mvfrm
Library\Bee\artifacts\mvdfrm\UnityEngine.WindModule.dll_F0659F60BBC008DF.mvfrm
Library\Bee\artifacts\mvdfrm\UnityEngine.XRModule.dll_69B84EEF5B4C4AC1.mvfrm
Library\Bee\artifacts\mvdfrm\Unity.Burst.Cecil.dll_4EB14FEDF862AEAF.mvfrm
Library\Bee\artifacts\mvdfrm\Unity.Burst.Cecil.Mdb.dll_88DB453A1B3AA5AC.mvfrm
Library\Bee\artifacts\mvdfrm\Unity.Burst.Cecil.Pdb.dll_A02DBDA999EFA72F.mvfrm
Library\Bee\artifacts\mvdfrm\Unity.Burst.Cecil.Rocks.dll_39A3EE63076E732F.mvfrm
Library\Bee\artifacts\mvdfrm\Unity.Burst.Unsafe.dll_1D55C0D5E0FF2434.mvfrm