{
  "qInfo": {
    "qId": "1b37a291-113a-4ad7-a21b-32a236c47761",
    "qType": "variable"
  },
  "qMetaDef": {},
  "qName": "TABLE_OWNER",
  "qNumberPresentation": {
    "qType": "U",
    "qnDec": 10,
    "qUseThou": 0
  },
  "qDefinition": "PRTL_PLATO_PROD",
  "qIsScriptCreated": true
}