{
  "qInfo": {
    "qId": "1196ef51-0114-4fb4-af48-b682dd2a9eff",
    "qType": "dimension"
  },
  "qDim": {
    "qGrouping": "N",
    "qFieldDefs": [
      "Region.City"
    ],
    "qFieldLabels": [
      "City"
    ],
    "title": "City",
    "coloring": {
      "colorMapRef": "TtzTyB",
      "changeHash": "0.3925679063230496"
    }
  },
  "qMetaDef": {
    "title": "City",
    "description": "",
    "tags": []
  }
}