{
  "qInfo": {
    "qId": "2fd68d56-9c60-4435-b6e5-3914216b4c64",
    "qType": "variable"
  },
  "qMetaDef": {},
  "qName": "vD_FCRange_From_Text",
  "qNumberPresentation": {
    "qType": "U",
    "qnDec": 10,
    "qUseThou": 0
  },
  "qDefinition": "=date(vD_CY_FCRange_From,'MMM')",
  "tags": []
}