{
  "qInfo": {
    "qId": "bce7f3dd-d3d0-4b07-9e9e-4c0c3585ee63",
    "qType": "variable"
  },
  "qMetaDef": {},
  "qName": "vD_PY_YTD_To",
  "qNumberPresentation": {
    "qType": "U",
    "qnDec": 10,
    "qUseThou": 0
  },
  "qDefinition": "=num(AddMonths(vD_CY_YTD_To,-12))",
  "tags": []
}