{
  "qInfo": {
    "qId": "fec74f20-5b8c-404f-886c-a4b1fdd90f08",
    "qType": "variable"
  },
  "qMetaDef": {},
  "qName": "vtCKey_ProductLine",
  "qNumberPresentation": {
    "qType": "U",
    "qnDec": 10,
    "qUseThou": 0
  }
}