{
  "qInfo": {
    "qId": "a4897cf0-8639-4cb7-97d6-d46cf5677117",
    "qType": "variable"
  },
  "qMetaDef": {},
  "qName": "vD_PY_FullYear_From",
  "qNumberPresentation": {
    "qType": "U",
    "qnDec": 10,
    "qUseThou": 0
  },
  "qDefinition": "=num(addmonths(vD_CY_FullYear_From,-12))",
  "tags": []
}