{
  "qInfo": {
    "qId": "14323ade-18a5-490d-b0ee-1f71cc8ef918",
    "qType": "dimension"
  },
  "qDim": {
    "qGrouping": "N",
    "qFieldDefs": [
      "Region.Country"
    ],
    "qFieldLabels": [
      "Country"
    ],
    "title": "Country",
    "coloring": {
      "colorMapRef": "TtzTyB",
      "changeHash": "0.7739876096904637"
    }
  },
  "qMetaDef": {
    "title": "Country",
    "description": "",
    "tags": []
  }
}