{
  "qInfo": {
    "qId": "1d2d011d-7bca-4384-92c2-16cf848cf7dd",
    "qType": "variable"
  },
  "qMetaDef": {},
  "qName": "vApp_Sheet_ID",
  "qNumberPresentation": {
    "qType": "U",
    "qnDec": 10,
    "qUseThou": 0
  },
  "qDefinition": "1"
}