[
  {
    "qProperty": {
      "qInfo": {
        "qId": "d4fc0074-ab9c-4c71-a9d8-025492d1ac13",
        "qType": "appprops"
      },
      "qMetaDef": {},
      "sheetTitleBgColor": {
        "color": "#761e46",
        "index": -1
      },
      "sheetTitleGradientColor": {
        "color": "#0e0b38",
        "index": -1
      },
      "sheetTitleColor": "",
      "sheetLogoThumbnail": {
        "qStaticContentUrlDef": {}
      },
      "sheetLogoPosition": "",
      "rtl": false,
      "theme": "sense"
    },
    "qChildren": []
  }
]