{
  "qInfo": {
    "qId": "1725d6c7-e993-443c-8cd6-b5c064646ad0",
    "qType": "variable"
  },
  "qMetaDef": {},
  "qName": "vC_tcm00_Background_Side_Custom",
  "qNumberPresentation": {
    "qType": "U",
    "qnDec": 10,
    "qUseThou": 0
  },
  "qDefinition": "=Only({<[MenuBarThemes.Theme]={'$(vThemeSelection)'}>}[MenuBarThemes.BackgroundSideCustom])"
}