{
  "qInfo": {
    "qId": "13a0cc85-514b-4576-8dea-51cc16ddd397",
    "qType": "variable"
  },
  "qMetaDef": {},
  "qName": "vtcKey_CommentKey",
  "qNumberPresentation": {
    "qType": "U",
    "qnDec": 10,
    "qUseThou": 0
  },
  "qDefinition": "=$(vD_CY_ACM)\r\n&'|'&\nif(GetPossibleCount([Product.ProductGroup])>1,'MultipleProducts',only([Product.ProductGroup]))\n&'|'&\nif(GetPossibleCount([Product.ProductName])>1,'MultipleProductNames',only([Product.ProductGroup]))\n&'|'&\nif(GetPossibleCount([Facts.SalesRep])>1,'MultipleSalesRep',only([Facts.SalesRep]))",
  "tags": []
}