{
  "qInfo": {
    "qId": "949285ae-0650-487b-ada9-09cc6810c7e4",
    "qType": "variable"
  },
  "qMetaDef": {},
  "qName": "vD_CY_YTD_To",
  "qNumberPresentation": {
    "qType": "U",
    "qnDec": 10,
    "qUseThou": 0
  },
  "qDefinition": "=num(vD_KeyDate)",
  "tags": []
}