{
  "qInfo": {
    "qId": "5f454af3-250e-492c-8610-67053d1e7163",
    "qType": "variable"
  },
  "qMetaDef": {},
  "qName": "vD_PY_FullYear_To",
  "qNumberPresentation": {
    "qType": "U",
    "qnDec": 10,
    "qUseThou": 0
  },
  "qDefinition": "=num(addmonths(vD_CY_FullYear_To,-12))",
  "tags": []
}