{
  "qInfo": {
    "qId": "CjpSJq",
    "qType": "measure"
  },
  "qMeasure": {
    "qLabel": "Kennzahlen_Der_letzten_7_Tage",
    "qDef": "SUM([Fallzahl])/SUM([Einwohneranzahl-BL])",
    "qGrouping": "N",
    "qExpressions": [],
    "qActiveExpression": 0,
    "qLabelExpression": "'Kennzahlen der letzten 7 Tage'",
    "qNumFormat": {
      "qType": "U",
      "qnDec": 10,
      "qUseThou": 0
    },
    "coloring": {
      "gradient": {
        "colors": [
          {
            "color": "#4477aa",
            "index": 6
          },
          {
            "color": "#f93f17",
            "index": 10
          }
        ],
        "breakTypes": [
          false
        ],
        "limits": [
          0.5
        ],
        "limitType": "percent"
      }
    }
  },
  "qMetaDef": {
    "title": "Kennzahlen_Der_letzten_7_Tage",
    "description": "",
    "tags": []
  }
}