{
  "qInfo": {
    "qId": "14963120-e390-40b2-8c68-c2d91e71db68",
    "qType": "variable"
  },
  "qMetaDef": {},
  "qName": "vThemeSelection",
  "qNumberPresentation": {
    "qType": "U",
    "qnDec": 10,
    "qUseThou": 0
  },
  "qDefinition": "=if(isNull(Only([MenuBarThemes.Theme])), 'trueChart', Only([MenuBarThemes.Theme]))"
}