{
  "qInfo": {
    "qId": "2fb46f68-70af-4ea4-a1b9-fda78d520be1",
    "qType": "variable"
  },
  "qMetaDef": {},
  "qName": "vC_tcm00_Text_Side",
  "qNumberPresentation": {
    "qType": "U",
    "qnDec": 10,
    "qUseThou": 0
  },
  "qDefinition": "=Only({<[MenuBarThemes.Theme]={'$(vThemeSelection)'}>}[MenuBarThemes.TextSide])"
}