{
  "qInfo": {
    "qId": "e0145abd-9c7c-46fa-bfd8-252614904586",
    "qType": "variable"
  },
  "qMetaDef": {},
  "qName": "HOST_DEV",
  "qNumberPresentation": {
    "qType": "U",
    "qnDec": 10,
    "qUseThou": 0
  },
  "qDefinition": "TRNBIQS01",
  "qIsScriptCreated": true
}