{
	"name": "rms-app-client",
	"projectId": "7d3fa052-1f51-4631-8cbc-65cf4bcb3a3d",
	"region": "ap-southeast-2",
	"state": "NORMAL",
	"createdDate": "2018-04-30T02:44:56.058Z",
	"lastUpdatedDate": "2018-06-02T23:51:06.215Z",
	"consoleUrl": "https://console.aws.amazon.com/mobilehub/home#/7d3fa052-1f51-4631-8cbc-65cf4bcb3a3d/build",
	"resources": [
		{
			"type": "AWS::Cognito::IdentityPool",
			"name": "rmsappclient_MOBILEHUB_2134715427",
			"arn": "ap-southeast-2:9beac7b9-77d8-442c-8ce6-6bd396ab8127",
			"feature": "user-signin",
			"attributes": {
				"lastUpdateRequestID": "3eb326e5-4c21-11e8-b53e-3bd2e92b4ba0",
				"poolid": "ap-southeast-2:9beac7b9-77d8-442c-8ce6-6bd396ab8127",
				"roleARNs": "arn:aws:iam::181630946722:role/rmsappclient_auth_MOBILEHUB_2134715427"
			}
		},
		{
			"type": "AWS::IAM::Role",
			"name": "rmsappclient_smsverification_MOBILEHUB_2134715427",
			"arn": "arn:aws:iam::181630946722:role/service-role/rmsappclient_smsverification_MOBILEHUB_2134715427",
			"feature": "user-signin",
			"attributes": {
				"lastUpdateRequestID": "3eb326e5-4c21-11e8-b53e-3bd2e92b4ba0",
				"user-pools-role-key": "user-pools-execution-role"
			}
		},
		{
			"type": "AWS::Cognito::UserPool",
			"name": "rmsappclient_userpool_MOBILEHUB_2134715427",
			"arn": "ap-southeast-2_3wZAxuJTF",
			"feature": "user-signin",
			"attributes": {
				"alias-attributes": "[\"email\",\"preferred_username\"]",
				"lastUpdateRequestID": "3eb326e5-4c21-11e8-b53e-3bd2e92b4ba0",
				"mfa-configuration": "OFF",
				"password-policy": "{\"minimumLength\":8,\"requireUppercase\":true,\"requireLowercase\":true,\"requireNumbers\":true,\"requireSymbols\":false}",
				"region": "ap-southeast-2",
				"user-pools-client-id": "76irq84tp433boa7qffhnpdb5o",
				"user-pools-client-secret": "1bt9t1fencep8v3lhkqf0136sfpum3gc8th6484k7s2a4orue47n",
				"user-pools-id": "ap-southeast-2_3wZAxuJTF",
				"user-pools-web-client-id": "7m6dm3ejr0ubg5k7sooj6mcgdv"
			}
		},
		{
			"type": "AWS::IAM::Role",
			"name": "rmsappclient_auth_MOBILEHUB_2134715427",
			"arn": "arn:aws:iam::181630946722:role/rmsappclient_auth_MOBILEHUB_2134715427",
			"feature": "user-signin",
			"attributes": {
				"authType": "authenticated",
				"lastUpdateRequestID": "3eb326e5-4c21-11e8-b53e-3bd2e92b4ba0"
			}
		},
		{
			"type": "AWS::Pinpoint::AnalyticsApplication",
			"name": "rmsappclient_MobileHub",
			"arn": "bcbc256db0944257b57e750095855399",
			"feature": "analytics",
			"attributes": {
				"lastUpdateRequestID": "7dba35b0-4c20-11e8-a9da-876b12037eb9"
			}
		},
		{
			"type": "AWS::IAM::Policy",
			"name": "rmsappclient_mobileanalytics_MOBILEHUB_2134715427",
			"arn": null,
			"feature": "analytics",
			"attributes": {
				"authType": "authenticated",
				"lastUpdateRequestID": "3eb326e5-4c21-11e8-b53e-3bd2e92b4ba0",
				"role": "rmsappclient_auth_MOBILEHUB_2134715427"
			}
		},
		{
			"type": "AWS::S3::Bucket",
			"name": "rmsappclient-hosting-mobilehub-2134715427",
			"arn": null,
			"feature": "hosting",
			"attributes": {
				"lastUpdateRequestID": "7dba35b0-4c20-11e8-a9da-876b12037eb9",
				"region": "ap-southeast-2",
				"s3-bucket-console-url": "https://s3.console.aws.amazon.com/s3/buckets/rmsappclient-hosting-mobilehub-2134715427",
				"s3-bucket-website-url": "https://s3.amazonaws.com/rmsappclient-hosting-mobilehub-2134715427"
			}
		},
		{
			"type": "AWS::CloudFront::Distribution",
			"name": "dfk9cqf2rap0v.cloudfront.net",
			"arn": null,
			"feature": "hosting",
			"attributes": {
				"id": "E3I078GUWALQRH",
				"lastUpdateRequestID": "7dba35b0-4c20-11e8-a9da-876b12037eb9"
			}
		},
		{
			"type": "AWS::IAM::Policy",
			"name": "rmsappclient_hosting_MOBILEHUB_2134715427",
			"arn": null,
			"feature": "hosting",
			"attributes": {
				"authType": "authenticated",
				"lastUpdateRequestID": "3eb326e5-4c21-11e8-b53e-3bd2e92b4ba0",
				"role": "rmsappclient_auth_MOBILEHUB_2134715427"
			}
		},
		{
			"type": "AWS::ApiGateway::RestApi",
			"name": "dev-rms-app-api",
			"arn": "arn:aws:execute-api:ap-southeast-2:181630946722:6zey72lgc9",
			"feature": "cloud-api",
			"attributes": {
				"cfLogicalID": "devrmsappapi",
				"cfPhysicalID": "6zey72lgc9",
				"configApiName": "dev-rms-app-api",
				"deeplinkURL": "https://console.aws.amazon.com/apigateway/home?region=ap-southeast-2#/apis/6zey72lgc9/resources",
				"existing": "true",
				"region": "ap-southeast-2",
				"stages": "dev"
			}
		},
		{
			"type": "AWS::IAM::Policy",
			"name": "MOBIL-Poli-8OS7H6P85NHC",
			"arn": null,
			"feature": "cloud-api",
			"attributes": {
				"cfLogicalID": "Policydevrmsappapi",
				"cfPhysicalID": "MOBIL-Poli-8OS7H6P85NHC",
				"lastUpdateTimestamp": "1527685646004",
				"reason": "none",
				"region": "ap-southeast-2",
				"status": "CREATE_COMPLETE"
			}
		},
		{
			"type": "AWS::IAM::Role",
			"name": "MOBILEHUB-2134715427-Developme-lambdaexecutionrole-1ALA7BRCELYCQ",
			"arn": null,
			"feature": "cloud-api",
			"attributes": {
				"cfLogicalID": "lambdaexecutionrole",
				"cfPhysicalID": "MOBILEHUB-2134715427-Developme-lambdaexecutionrole-1ALA7BRCELYCQ",
				"deeplinkURL": "https://console.aws.amazon.com/iam/home?region=ap-southeast-2#roles/MOBILEHUB-2134715427-Developme-lambdaexecutionrole-1ALA7BRCELYCQ",
				"lastUpdateTimestamp": "1527685658756",
				"reason": "none",
				"region": "ap-southeast-2",
				"status": "CREATE_COMPLETE"
			}
		},
		{
			"type": "AWS::CloudFormation::Stack",
			"name": "arn:aws:cloudformation:ap-southeast-2:181630946722:stack/MOBILEHUB-2134715427-Development-CloudLogic-X823C13JYV60/5caecbd0-640a-11e8-abc6-503f2373503d",
			"arn": null,
			"feature": "cloud-api",
			"attributes": {
				"cfLogicalID": "CloudLogic",
				"cfPhysicalID": "arn:aws:cloudformation:ap-southeast-2:181630946722:stack/MOBILEHUB-2134715427-Development-CloudLogic-X823C13JYV60/5caecbd0-640a-11e8-abc6-503f2373503d",
				"deeplinkURL": "https://console.aws.amazon.com/cloudformation/home?region=ap-southeast-2#/stack/detail?stackId=arn:aws:cloudformation:ap-southeast-2:181630946722:stack/MOBILEHUB-2134715427-Development-CloudLogic-X823C13JYV60/5caecbd0-640a-11e8-abc6-503f2373503d",
				"lastUpdateTimestamp": "1527685678312",
				"reason": "none",
				"region": "ap-southeast-2",
				"status": "CREATE_COMPLETE"
			}
		},
		{
			"type": "AWS::IAM::Policy",
			"name": "MOBIL-lamb-1Q07SWNARO7L0",
			"arn": null,
			"feature": "cloud-api",
			"attributes": {
				"cfLogicalID": "lambdaexecutionpolicy",
				"cfPhysicalID": "MOBIL-lamb-1Q07SWNARO7L0",
				"lastUpdateTimestamp": "1527685673095",
				"reason": "none",
				"region": "ap-southeast-2",
				"status": "CREATE_COMPLETE"
			}
		},
		{
			"type": "AWS::S3::Bucket",
			"name": "rmsappclient-deployments-mobilehub-2134715427",
			"arn": null,
			"feature": "common",
			"attributes": {
				"region": "ap-southeast-2",
				"s3-bucket-console-url": "https://s3.console.aws.amazon.com/s3/buckets/rmsappclient-deployments-mobilehub-2134715427"
			}
		},
		{
			"type": "AWS::CloudFormation::Stack",
			"name": "Development",
			"arn": "arn:aws:cloudformation:ap-southeast-2:181630946722:stack/MOBILEHUB-2134715427-Development/5a3c4530-640a-11e8-855b-5081eaa770a1",
			"feature": "cloud-api",
			"attributes": {
				"cfHash": "-1004848252",
				"primary": "true",
				"region": "ap-southeast-2",
				"stack-arn": "arn:aws:cloudformation:ap-southeast-2:181630946722:stack/MOBILEHUB-2134715427-Development/5a3c4530-640a-11e8-855b-5081eaa770a1",
				"stateDetails": "none",
				"stateSummary": "CREATE_COMPLETE"
			}
		}
	]
}