<svg width="24" height="24" viewBox="0 0 24 24" fill="none" xmlns="http://www.w3.org/2000/svg">
<path d="M12 7.01013L12.01 6.99902" stroke="#F24A00" stroke-width="1.5" stroke-linecap="round" stroke-linejoin="round"/>
<path d="M16 9.01013L16.01 8.99902" stroke="#F24A00" stroke-width="1.5" stroke-linecap="round" stroke-linejoin="round"/>
<path d="M8 9.01013L8.01 8.99902" stroke="#F24A00" stroke-width="1.5" stroke-linecap="round" stroke-linejoin="round"/>
<path d="M18 13.0101L18.01 12.999" stroke="#F24A00" stroke-width="1.5" stroke-linecap="round" stroke-linejoin="round"/>
<path d="M6 13.0101L6.01 12.999" stroke="#F24A00" stroke-width="1.5" stroke-linecap="round" stroke-linejoin="round"/>
<path d="M17 17.0101L17.01 16.999" stroke="#F24A00" stroke-width="1.5" stroke-linecap="round" stroke-linejoin="round"/>
<path d="M7 17.0101L7.01 16.999" stroke="#F24A00" stroke-width="1.5" stroke-linecap="round" stroke-linejoin="round"/>
<path d="M12 17L13 11" stroke="#F24A00" stroke-width="1.5" stroke-linecap="round" stroke-linejoin="round"/>
<path d="M8.5 20.001H4C2.74418 18.3295 2 16.2516 2 14C2 8.47715 6.47715 4 12 4C17.5228 4 22 8.47715 22 14C22 16.2516 21.2558 18.3295 20 20.001L15.5 20" stroke="#F24A00" stroke-width="1.5" stroke-linecap="round" stroke-linejoin="round"/>
<path d="M12 23C13.6569 23 15 21.6569 15 20C15 18.3431 13.6569 17 12 17C10.3431 17 9 18.3431 9 20C9 21.6569 10.3431 23 12 23Z" stroke="#F24A00" stroke-width="1.5" stroke-linecap="round" stroke-linejoin="round"/>
</svg>
