{
    "/js/app.js": "/js/app.js",
    "/js/notification.js": "/js/notification.js",
    "/js/interaction.js": "/js/interaction.js",
    "/js/crm.js": "/js/crm.js",
    "/js/integration.js": "/js/integration.js",
    "/js/finance.js": "/js/finance.js",
    "/js/studylog.js": "/js/studylog.js",
    "/js/card.js": "/js/card.js",
    "/js/bcoin.js": "/js/bcoin.js",
    "/js/import.js": "/js/import.js",
    "/js/report.js": "/js/report.js",
    "/js/beli_chat.js": "/js/beli_chat.js"
}
