{
  "packageName": "copay",
  "packageDescription": "Copay Bitcoin Wallet",
  "packageNameId": "com.bitpay.copay",
  "packageNameIdDesktop": "com.bitpay.copay.desktop2",
  "themeColor": "#ffffff",
  "userVisibleName": "Copay",
  "purposeLine": "AbcPay Wallet",
  "bundleName": "copay",
  "appUri": "abcpay",
  "name": "copay",
  "applePay": "",
  "dynamicLink": "copay.page.link",
  "nameNoSpace": "copay",
  "nameCase": "Copay",
  "nameCaseNoSpace": "Copay",
  "gitHubRepoName": "copay",
  "gitHubRepoUrl": "git://github.com/bitpay/copay.git",
  "gitHubRepoBugs": "https://github.com/bitpay/copay/issues",
  "disclaimerUrl": "https://copay.io/disclaimer",
  "url": "https://copay.io",
  "appDescription": "AbcPay Wallet",
  "winAppName": "CopayWallet",
  "WindowsStoreIdentityName": "18C7659D.CopayforWindows",
  "WindowsStoreDisplayName": "Copay for Windows",
  "WindowsApplicationId": "CopayforWindows",
  "pushSenderId": "1036948132229",
  "description": "AbcPay Wallet",
  "version": "12.5.1",
  "androidVersion": "91205001",
  "iOSBuildVersion": "1",
  "_extraCSS": null,
  "_enabledExtensions": {
    "buycrypto": false,
    "coinbase": false,
    "exchangecrypto": false,
    "glidera": false,
    "debitcard": false,
    "giftcards": false,
    "walletConnect": true
  }
}
