{
  "name": "*PACKAGEDESCRIPTION*",
  "short_name": "*NAMECASE*",
  "start_url": "index.html",
  "background_color": "*THEMECOLOR*",
  "theme_color": "*THEMECOLOR*",
  "display": "standalone",
  "scope": "/",
  "icons": [
    {
      "src": "assets/img/app/48x48.png",
      "sizes": "48x48",
      "type": "image/png"
    },
    {
      "src": "assets/img/app/72x72.png",
      "sizes": "72x72",
      "type": "image/png"
    },
    {
      "src": "assets/img/app/96x96.png",
      "sizes": "96x96",
      "type": "image/png"
    },
    {
      "src": "assets/img/app/128x128.png",
      "sizes": "128x128",
      "type": "image/png"
    },
    {
      "src": "assets/img/app/192x192.png",
      "sizes": "192x192",
      "type": "image/png"
    },
    {
      "src": "assets/img/app/384x384.png",
      "sizes": "384x384",
      "type": "image/png"
    },
    {
      "src": "assets/img/app/512x512.png",
      "sizes": "512x512",
      "type": "image/png"
    }
  ]
}