#
# A fatal error has been detected by the Java Runtime Environment:
#
#  Internal Error (javaCalls.cpp:51), pid=8168, tid=0x0000000000002104
#  guarantee(thread->is_Java_thread()) failed: crucial check - the VM thread cannot and must not escape to Java code
#
# JRE version: Java(TM) SE Runtime Environment (8.0_181-b13) (build 1.8.0_181-b13)
# Java VM: Java HotSpot(TM) 64-Bit Server VM (25.181-b13 mixed mode windows-amd64 compressed oops)
# Failed to write core dump. Minidumps are not enabled by default on client versions of Windows
#
# If you would like to submit a bug report, please visit:
#   http://bugreport.java.com/bugreport/crash.jsp
#

---------------  T H R E A D  ---------------

Current thread (0x0000000004782800):  GCTaskThread [stack: 0x0000000014270000,0x0000000014370000] [id=8452]

Stack: [0x0000000014270000,0x0000000014370000]
[error occurred during error reporting (printing stack bounds), id 0xc0000005]

Native frames: (J=compiled Java code, j=interpreted, Vv=VM code, C=native code)

JavaThread 0x000000001bddc800 (nid = 5448) was being processed
Java frames: (J=compiled Java code, j=interpreted, Vv=VM code)
j  com.example.demo.resource.UserResource.welcome(Ljavax/servlet/http/HttpSession;Lorg/springframework/ui/Model;)Ljava/lang/String;+131
v  ~StubRoutines::call_stub
J 1933  sun.reflect.NativeMethodAccessorImpl.invoke0(Ljava/lang/reflect/Method;Ljava/lang/Object;[Ljava/lang/Object;)Ljava/lang/Object; (0 bytes) @ 0x0000000004f869ff [0x0000000004f86980+0x7f]
J 13660 C2 java.lang.reflect.Method.invoke(Ljava/lang/Object;[Ljava/lang/Object;)Ljava/lang/Object; (62 bytes) @ 0x000000000717f5e4 [0x000000000717f4e0+0x104]
J 15115 C1 org.springframework.web.method.support.InvocableHandlerMethod.doInvoke([Ljava/lang/Object;)Ljava/lang/Object; (124 bytes) @ 0x000000000773bb6c [0x000000000773b880+0x2ec]
J 15147 C1 org.springframework.web.method.support.InvocableHandlerMethod.invokeForRequest(Lorg/springframework/web/context/request/NativeWebRequest;Lorg/springframework/web/method/support/ModelAndViewContainer;[Ljava/lang/Object;)Ljava/lang/Object; (60 bytes) @ 0x0000000007a8ee84 [0x0000000007a8e5e0+0x8a4]
J 15155 C1 org.springframework.web.servlet.mvc.method.annotation.ServletInvocableHandlerMethod.invokeAndHandle(Lorg/springframework/web/context/request/ServletWebRequest;Lorg/springframework/web/method/support/ModelAndViewContainer;[Ljava/lang/Object;)V (140 bytes) @ 0x0000000007a996e4 [0x0000000007a995c0+0x124]
J 14368 C1 org.springframework.web.servlet.mvc.method.annotation.RequestMappingHandlerAdapter.invokeHandlerMethod(Ljavax/servlet/http/HttpServletRequest;Ljavax/servlet/http/HttpServletResponse;Lorg/springframework/web/method/HandlerMethod;)Lorg/springframework/web/servlet/ModelAndView; (296 bytes) @ 0x0000000007776edc [0x0000000007774c00+0x22dc]
J 14371 C1 org.springframework.web.servlet.mvc.method.annotation.RequestMappingHandlerAdapter.handleInternal(Ljavax/servlet/http/HttpServletRequest;Ljavax/servlet/http/HttpServletResponse;Lorg/springframework/web/method/HandlerMethod;)Lorg/springframework/web/servlet/ModelAndView; (129 bytes) @ 0x000000000777b8d4 [0x000000000777b2a0+0x634]
J 14365 C1 org.springframework.web.servlet.mvc.method.AbstractHandlerMethodAdapter.handle(Ljavax/servlet/http/HttpServletRequest;Ljavax/servlet/http/HttpServletResponse;Ljava/lang/Object;)Lorg/springframework/web/servlet/ModelAndView; (11 bytes) @ 0x000000000777288c [0x0000000007772680+0x20c]
J 14135 C1 org.springframework.web.servlet.DispatcherServlet.doDispatch(Ljavax/servlet/http/HttpServletRequest;Ljavax/servlet/http/HttpServletResponse;)V (545 bytes) @ 0x00000000076173fc [0x0000000007615b20+0x18dc]
J 14138 C1 org.springframework.web.servlet.DispatcherServlet.doService(Ljavax/servlet/http/HttpServletRequest;Ljavax/servlet/http/HttpServletResponse;)V (264 bytes) @ 0x000000000763ad44 [0x0000000007638d00+0x2044]
J 14145 C1 org.springframework.web.servlet.FrameworkServlet.processRequest(Ljavax/servlet/http/HttpServletRequest;Ljavax/servlet/http/HttpServletResponse;)V (187 bytes) @ 0x00000000075f7964 [0x00000000075f6600+0x1364]
J 14152 C1 org.springframework.web.servlet.FrameworkServlet.doGet(Ljavax/servlet/http/HttpServletRequest;Ljavax/servlet/http/HttpServletResponse;)V (7 bytes) @ 0x0000000007641194 [0x0000000007641080+0x114]
J 14133 C1 javax.servlet.http.HttpServlet.service(Ljavax/servlet/http/HttpServletRequest;Ljavax/servlet/http/HttpServletResponse;)V (270 bytes) @ 0x00000000075fa12c [0x00000000075f9d80+0x3ac]
J 14154 C1 org.springframework.web.servlet.FrameworkServlet.service(Ljavax/servlet/http/HttpServletRequest;Ljavax/servlet/http/HttpServletResponse;)V (37 bytes) @ 0x0000000007642aec [0x0000000007642400+0x6ec]
J 15361 C2 org.apache.catalina.core.ApplicationFilterChain.internalDoFilter(Ljavax/servlet/ServletRequest;Ljavax/servlet/ServletResponse;)V (388 bytes) @ 0x0000000004f19908 [0x0000000004f197a0+0x168]
J 15360 C2 org.apache.catalina.core.ApplicationFilterChain.doFilter(Ljavax/servlet/ServletRequest;Ljavax/servlet/ServletResponse;)V (105 bytes) @ 0x0000000004b77520 [0x0000000004b774e0+0x40]
J 14232 C1 org.apache.tomcat.websocket.server.WsFilter.doFilter(Ljavax/servlet/ServletRequest;Ljavax/servlet/ServletResponse;Ljavax/servlet/FilterChain;)V (139 bytes) @ 0x00000000076c890c [0x00000000076c7dc0+0xb4c]
J 15361 C2 org.apache.catalina.core.ApplicationFilterChain.internalDoFilter(Ljavax/servlet/ServletRequest;Ljavax/servlet/ServletResponse;)V (388 bytes) @ 0x0000000004f199f0 [0x0000000004f197a0+0x250]
J 15360 C2 org.apache.catalina.core.ApplicationFilterChain.doFilter(Ljavax/servlet/ServletRequest;Ljavax/servlet/ServletResponse;)V (105 bytes) @ 0x0000000004b77520 [0x0000000004b774e0+0x40]
J 14210 C1 org.springframework.web.filter.RequestContextFilter.doFilterInternal(Ljavax/servlet/http/HttpServletRequest;Ljavax/servlet/http/HttpServletResponse;Ljavax/servlet/FilterChain;)V (133 bytes) @ 0x00000000076a6eec [0x00000000076a6980+0x56c]
J 13757 C1 org.springframework.web.filter.OncePerRequestFilter.doFilter(Ljavax/servlet/ServletRequest;Ljavax/servlet/ServletResponse;Ljavax/servlet/FilterChain;)V (139 bytes) @ 0x000000000741efcc [0x000000000741e620+0x9ac]
J 15361 C2 org.apache.catalina.core.ApplicationFilterChain.internalDoFilter(Ljavax/servlet/ServletRequest;Ljavax/servlet/ServletResponse;)V (388 bytes) @ 0x0000000004f199f0 [0x0000000004f197a0+0x250]
J 15360 C2 org.apache.catalina.core.ApplicationFilterChain.doFilter(Ljavax/servlet/ServletRequest;Ljavax/servlet/ServletResponse;)V (105 bytes) @ 0x0000000004b77520 [0x0000000004b774e0+0x40]
J 14204 C1 org.springframework.web.filter.FormContentFilter.doFilterInternal(Ljavax/servlet/http/HttpServletRequest;Ljavax/servlet/http/HttpServletResponse;Ljavax/servlet/FilterChain;)V (44 bytes) @ 0x000000000764bbb4 [0x000000000764b660+0x554]
J 13757 C1 org.springframework.web.filter.OncePerRequestFilter.doFilter(Ljavax/servlet/ServletRequest;Ljavax/servlet/ServletResponse;Ljavax/servlet/FilterChain;)V (139 bytes) @ 0x000000000741efcc [0x000000000741e620+0x9ac]
J 15361 C2 org.apache.catalina.core.ApplicationFilterChain.internalDoFilter(Ljavax/servlet/ServletRequest;Ljavax/servlet/ServletResponse;)V (388 bytes) @ 0x0000000004f199f0 [0x0000000004f197a0+0x250]
J 15360 C2 org.apache.catalina.core.ApplicationFilterChain.doFilter(Ljavax/servlet/ServletRequest;Ljavax/servlet/ServletResponse;)V (105 bytes) @ 0x0000000004b77520 [0x0000000004b774e0+0x40]
J 14231 C1 org.springframework.web.filter.HiddenHttpMethodFilter.doFilterInternal(Ljavax/servlet/http/HttpServletRequest;Ljavax/servlet/http/HttpServletResponse;Ljavax/servlet/FilterChain;)V (93 bytes) @ 0x00000000076c7414 [0x00000000076c6ae0+0x934]
J 13757 C1 org.springframework.web.filter.OncePerRequestFilter.doFilter(Ljavax/servlet/ServletRequest;Ljavax/servlet/ServletResponse;Ljavax/servlet/FilterChain;)V (139 bytes) @ 0x000000000741efcc [0x000000000741e620+0x9ac]
J 15361 C2 org.apache.catalina.core.ApplicationFilterChain.internalDoFilter(Ljavax/servlet/ServletRequest;Ljavax/servlet/ServletResponse;)V (388 bytes) @ 0x0000000004f199f0 [0x0000000004f197a0+0x250]
J 15360 C2 org.apache.catalina.core.ApplicationFilterChain.doFilter(Ljavax/servlet/ServletRequest;Ljavax/servlet/ServletResponse;)V (105 bytes) @ 0x0000000004b77520 [0x0000000004b774e0+0x40]
J 14209 C1 org.springframework.web.filter.CharacterEncodingFilter.doFilterInternal(Ljavax/servlet/http/HttpServletRequest;Ljavax/servlet/http/HttpServletResponse;Ljavax/servlet/FilterChain;)V (59 bytes) @ 0x0000000007647ec4 [0x0000000007647900+0x5c4]
J 13757 C1 org.springframework.web.filter.OncePerRequestFilter.doFilter(Ljavax/servlet/ServletRequest;Ljavax/servlet/ServletResponse;Ljavax/servlet/FilterChain;)V (139 bytes) @ 0x000000000741efcc [0x000000000741e620+0x9ac]
J 15361 C2 org.apache.catalina.core.ApplicationFilterChain.internalDoFilter(Ljavax/servlet/ServletRequest;Ljavax/servlet/ServletResponse;)V (388 bytes) @ 0x0000000004f199f0 [0x0000000004f197a0+0x250]
J 15360 C2 org.apache.catalina.core.ApplicationFilterChain.doFilter(Ljavax/servlet/ServletRequest;Ljavax/servlet/ServletResponse;)V (105 bytes) @ 0x0000000004b77520 [0x0000000004b774e0+0x40]
J 13821 C1 org.apache.catalina.core.StandardWrapperValve.invoke(Lorg/apache/catalina/connector/Request;Lorg/apache/catalina/connector/Response;)V (1371 bytes) @ 0x00000000074c4b1c [0x00000000074bf740+0x53dc]
J 14184 C1 org.apache.catalina.core.StandardContextValve.invoke(Lorg/apache/catalina/connector/Request;Lorg/apache/catalina/connector/Response;)V (172 bytes) @ 0x0000000006d2be1c [0x0000000006d2a980+0x149c]
J 14190 C1 org.apache.catalina.authenticator.AuthenticatorBase.invoke(Lorg/apache/catalina/connector/Request;Lorg/apache/catalina/connector/Response;)V (838 bytes) @ 0x000000000769d30c [0x0000000007697220+0x60ec]
J 13820 C1 org.apache.catalina.core.StandardHostValve.invoke(Lorg/apache/catalina/connector/Request;Lorg/apache/catalina/connector/Response;)V (382 bytes) @ 0x00000000074ae634 [0x00000000074ad7a0+0xe94]
J 14229 C1 org.apache.catalina.valves.ErrorReportValve.invoke(Lorg/apache/catalina/connector/Request;Lorg/apache/catalina/connector/Response;)V (124 bytes) @ 0x00000000076c1b84 [0x00000000076c19c0+0x1c4]
J 14208 C1 org.apache.catalina.core.StandardEngineValve.invoke(Lorg/apache/catalina/connector/Request;Lorg/apache/catalina/connector/Response;)V (51 bytes) @ 0x00000000076a5da4 [0x00000000076a5660+0x744]
J 13944 C1 org.apache.catalina.connector.CoyoteAdapter.service(Lorg/apache/coyote/Request;Lorg/apache/coyote/Response;)V (893 bytes) @ 0x000000000751cb5c [0x000000000751b480+0x16dc]
J 14188 C1 org.apache.coyote.http11.Http11Processor.service(Lorg/apache/tomcat/util/net/SocketWrapperBase;)Lorg/apache/tomcat/util/net/AbstractEndpoint$Handler$SocketState; (1248 bytes) @ 0x0000000007186a3c [0x0000000007181fa0+0x4a9c]
J 13624 C1 org.apache.coyote.AbstractProcessorLight.process(Lorg/apache/tomcat/util/net/SocketWrapperBase;Lorg/apache/tomcat/util/net/SocketEvent;)Lorg/apache/tomcat/util/net/AbstractEndpoint$Handler$SocketState; (302 bytes) @ 0x0000000005cde514 [0x0000000005cddb80+0x994]
J 14186 C1 org.apache.coyote.AbstractProtocol$ConnectionHandler.process(Lorg/apache/tomcat/util/net/SocketWrapperBase;Lorg/apache/tomcat/util/net/SocketEvent;)Lorg/apache/tomcat/util/net/AbstractEndpoint$Handler$SocketState; (1215 bytes) @ 0x0000000007679a94 [0x00000000076763e0+0x36b4]
J 13617 C1 org.apache.tomcat.util.net.NioEndpoint$SocketProcessor.doRun()V (532 bytes) @ 0x0000000004a2b5f4 [0x0000000004a2a340+0x12b4]
J 13905 C1 org.apache.tomcat.util.net.SocketProcessorBase.run()V (35 bytes) @ 0x00000000061ee11c [0x00000000061ede60+0x2bc]
j  java.util.concurrent.ThreadPoolExecutor.runWorker(Ljava/util/concurrent/ThreadPoolExecutor$Worker;)V+95
J 13714 C1 java.util.concurrent.ThreadPoolExecutor$Worker.run()V (9 bytes) @ 0x000000000595facc [0x000000000595f9c0+0x10c]
j  org.apache.tomcat.util.threads.TaskThread$WrappingRunnable.run()V+4
j  java.lang.Thread.run()V+11
v  ~StubRoutines::call_stub

---------------  P R O C E S S  ---------------

Java Threads: ( => current thread )
  0x000000001bdd1000 JavaThread "Thread-124" [_thread_blocked, id=5076, stack(0x0000000045330000,0x0000000045430000)]
  0x000000001bdd0800 JavaThread "http-nio-8080-Acceptor-0" daemon [_thread_blocked, id=5852, stack(0x0000000045230000,0x0000000045330000)]
  0x000000001ce34000 JavaThread "Catalina-utility-2" [_thread_blocked, id=8032, stack(0x0000000044230000,0x0000000044330000)]
  0x000000001ce2d000 JavaThread "Catalina-utility-1" [_thread_blocked, id=6444, stack(0x0000000044130000,0x0000000044230000)]
  0x000000001bddc800 JavaThread "http-nio-8080-exec-3" daemon [_thread_blocked, id=5448, stack(0x000000003f730000,0x000000003f830000)]
  0x00000000215c3000 JavaThread "DestroyJavaVM" [_thread_blocked, id=1628, stack(0x00000000044a0000,0x00000000045a0000)]
  0x000000002309b800 JavaThread "Live Reload Server" daemon [_thread_in_native, id=7752, stack(0x0000000023d30000,0x0000000023e30000)]
  0x0000000020f2f800 JavaThread "mysql-cj-abandoned-connection-cleanup" daemon [_thread_blocked, id=6244, stack(0x0000000020390000,0x0000000020490000)]
  0x0000000018e4d000 JavaThread "Service Thread" daemon [_thread_blocked, id=8556, stack(0x0000000019980000,0x0000000019a80000)]
  0x0000000018ea2800 JavaThread "C1 CompilerThread2" daemon [_thread_blocked, id=2424, stack(0x0000000019880000,0x0000000019980000)]
  0x0000000018d9d000 JavaThread "C2 CompilerThread1" daemon [_thread_blocked, id=244, stack(0x0000000019780000,0x0000000019880000)]
  0x0000000018e97800 JavaThread "C2 CompilerThread0" daemon [_thread_blocked, id=2312, stack(0x0000000019680000,0x0000000019780000)]
  0x0000000016e1e000 JavaThread "JDWP Command Reader" daemon [_thread_in_native, id=6124, stack(0x0000000018980000,0x0000000018a80000)]
  0x0000000016e1c800 JavaThread "JDWP Event Helper Thread" daemon [_thread_blocked, id=10136, stack(0x0000000018880000,0x0000000018980000)]
  0x0000000016e0f000 JavaThread "JDWP Transport Listener: dt_socket" daemon [_thread_blocked, id=4864, stack(0x0000000018780000,0x0000000018880000)]
  0x0000000016e05000 JavaThread "Attach Listener" daemon [_thread_blocked, id=9112, stack(0x0000000018340000,0x0000000018440000)]
  0x0000000016e03800 JavaThread "Signal Dispatcher" daemon [_thread_blocked, id=9208, stack(0x0000000018240000,0x0000000018340000)]
  0x0000000016df0000 JavaThread "Finalizer" daemon [_thread_blocked, id=9368, stack(0x0000000018050000,0x0000000018150000)]
  0x0000000004855000 JavaThread "Reference Handler" daemon [_thread_blocked, id=2828, stack(0x0000000017f50000,0x0000000018050000)]

Other Threads:
  0x0000000016dc7800 VMThread [stack: 0x0000000017e50000,0x0000000017f50000] [id=5112]
  0x0000000018e78800 WatcherThread [stack: 0x0000000019a80000,0x0000000019b80000] [id=6792]

=>0x0000000004782800 (exited) GCTaskThread [stack: 0x0000000014270000,0x0000000014370000] [id=8452]

VM state:at safepoint (normal execution)

VM Mutex/Monitor currently owned by a thread:  ([mutex/lock_event])
[0x00000000047636e0] Threads_lock - owner thread: 0x0000000016dc7800
[0x0000000004764b70] Heap_lock - owner thread: 0x000000001bdd1000

Heap:
 PSYoungGen      total 86528K, used 32115K [0x00000000eb580000, 0x00000000f1180000, 0x0000000100000000)
  eden space 79872K, 34% used [0x00000000eb580000,0x00000000ed05cfe8,0x00000000f0380000)
  from space 6656K, 69% used [0x00000000f0b00000,0x00000000f0f80010,0x00000000f1180000)
  to   space 7168K, 37% used [0x00000000f0380000,0x00000000f0628000,0x00000000f0a80000)
 ParOldGen       total 52224K, used 25585K [0x00000000c2000000, 0x00000000c5300000, 0x00000000eb580000)
  object space 52224K, 48% used [0x00000000c2000000,0x00000000c38fc540,0x00000000c5300000)
 Metaspace       used 61951K, capacity 65442K, committed 66048K, reserved 1107968K
  class space    used 7122K, capacity 7808K, committed 7936K, reserved 1048576K

Card table byte_map: [0x0000000013c20000,0x0000000013e20000] byte_map_base: 0x0000000013610000

Marking Bits: (ParMarkBitMap*) 0x0000000076a62d00
 Begin Bits: [0x0000000014370000, 0x00000000152f0000)
 End Bits:   [0x00000000152f0000, 0x0000000016270000)

Polling page: 0x0000000002760000

CodeCache: size=245760Kb used=51957Kb max_used=52074Kb free=193802Kb
 bounds [0x0000000004860000, 0x0000000007b90000, 0x0000000013860000]
 total_blobs=12724 nmethods=12202 adapters=440
 compilation: enabled

Compilation events (10 events):
Event: 10592.386 Thread 0x0000000018ea2800 15992       3       java.lang.System::getProperty (26 bytes)
Event: 10592.387 Thread 0x0000000018ea2800 nmethod 15992 0x000000000499ad10 code [0x000000000499af00, 0x000000000499b6e8]
Event: 10592.388 Thread 0x0000000018ea2800 15993       3       java.net.SocksSocketImpl::close (24 bytes)
Event: 10592.388 Thread 0x0000000018ea2800 nmethod 15993 0x00000000067f6210 code [0x00000000067f63a0, 0x00000000067f67b8]
Event: 10592.389 Thread 0x0000000018ea2800 15994   !   3       java.net.PlainSocketImpl::close (24 bytes)
Event: 10592.390 Thread 0x0000000018ea2800 nmethod 15994 0x0000000004dce250 code [0x0000000004dce3c0, 0x0000000004dce668]
Event: 10592.460 Thread 0x0000000018ea2800 15995   !   3       java.util.concurrent.ThreadPoolExecutor$Worker::interruptIfStarted (32 bytes)
Event: 10592.461 Thread 0x0000000018ea2800 nmethod 15995 0x0000000004fe9b10 code [0x0000000004fe9ca0, 0x0000000004fea158]
Event: 10592.465 Thread 0x0000000018ea2800 15996       1       java.util.concurrent.ThreadPoolExecutor::runStateOf (5 bytes)
Event: 10592.467 Thread 0x0000000018ea2800 nmethod 15996 0x000000000499aa50 code [0x000000000499aba0, 0x000000000499ac90]

GC Heap History (10 events):
Event: 10546.590 GC heap after
Heap after GC invocations=238 (full 22):
 PSYoungGen      total 73728K, used 0K [0x00000000eb580000, 0x00000000f0400000, 0x0000000100000000)
  eden space 67072K, 0% used [0x00000000eb580000,0x00000000eb580000,0x00000000ef700000)
  from space 6656K, 0% used [0x00000000efd80000,0x00000000efd80000,0x00000000f0400000)
  to   space 6656K, 0% used [0x00000000ef700000,0x00000000ef700000,0x00000000efd80000)
 ParOldGen       total 52224K, used 25569K [0x00000000c2000000, 0x00000000c5300000, 0x00000000eb580000)
  object space 52224K, 48% used [0x00000000c2000000,0x00000000c38f8540,0x00000000c5300000)
 Metaspace       used 61532K, capacity 64846K, committed 65408K, reserved 1107968K
  class space    used 7076K, capacity 7725K, committed 7808K, reserved 1048576K
}
Event: 10547.530 GC heap before
{Heap before GC invocations=239 (full 22):
 PSYoungGen      total 73728K, used 67072K [0x00000000eb580000, 0x00000000f0400000, 0x0000000100000000)
  eden space 67072K, 100% used [0x00000000eb580000,0x00000000ef700000,0x00000000ef700000)
  from space 6656K, 0% used [0x00000000efd80000,0x00000000efd80000,0x00000000f0400000)
  to   space 6656K, 0% used [0x00000000ef700000,0x00000000ef700000,0x00000000efd80000)
 ParOldGen       total 52224K, used 25569K [0x00000000c2000000, 0x00000000c5300000, 0x00000000eb580000)
  object space 52224K, 48% used [0x00000000c2000000,0x00000000c38f8540,0x00000000c5300000)
 Metaspace       used 61662K, capacity 65060K, committed 65536K, reserved 1107968K
  class space    used 7096K, capacity 7770K, committed 7936K, reserved 1048576K
Event: 10547.537 GC heap after
Heap after GC invocations=239 (full 22):
 PSYoungGen      total 73728K, used 4016K [0x00000000eb580000, 0x00000000f0880000, 0x0000000100000000)
  eden space 67072K, 0% used [0x00000000eb580000,0x00000000eb580000,0x00000000ef700000)
  from space 6656K, 60% used [0x00000000ef700000,0x00000000efaec2f8,0x00000000efd80000)
  to   space 6656K, 0% used [0x00000000f0200000,0x00000000f0200000,0x00000000f0880000)
 ParOldGen       total 52224K, used 25577K [0x00000000c2000000, 0x00000000c5300000, 0x00000000eb580000)
  object space 52224K, 48% used [0x00000000c2000000,0x00000000c38fa540,0x00000000c5300000)
 Metaspace       used 61662K, capacity 65060K, committed 65536K, reserved 1107968K
  class space    used 7096K, capacity 7770K, committed 7936K, reserved 1048576K
}
Event: 10547.810 GC heap before
{Heap before GC invocations=240 (full 22):
 PSYoungGen      total 73728K, used 71088K [0x00000000eb580000, 0x00000000f0880000, 0x0000000100000000)
  eden space 67072K, 100% used [0x00000000eb580000,0x00000000ef700000,0x00000000ef700000)
  from space 6656K, 60% used [0x00000000ef700000,0x00000000efaec2f8,0x00000000efd80000)
  to   space 6656K, 0% used [0x00000000f0200000,0x00000000f0200000,0x00000000f0880000)
 ParOldGen       total 52224K, used 25577K [0x00000000c2000000, 0x00000000c5300000, 0x00000000eb580000)
  object space 52224K, 48% used [0x00000000c2000000,0x00000000c38fa540,0x00000000c5300000)
 Metaspace       used 61683K, capacity 65072K, committed 65536K, reserved 1107968K
  class space    used 7098K, capacity 7772K, committed 7936K, reserved 1048576K
Event: 10547.819 GC heap after
Heap after GC invocations=240 (full 22):
 PSYoungGen      total 77824K, used 4685K [0x00000000eb580000, 0x00000000f0b80000, 0x0000000100000000)
  eden space 71168K, 0% used [0x00000000eb580000,0x00000000eb580000,0x00000000efb00000)
  from space 6656K, 70% used [0x00000000f0200000,0x00000000f06935b0,0x00000000f0880000)
  to   space 7168K, 0% used [0x00000000efb00000,0x00000000efb00000,0x00000000f0200000)
 ParOldGen       total 52224K, used 25577K [0x00000000c2000000, 0x00000000c5300000, 0x00000000eb580000)
  object space 52224K, 48% used [0x00000000c2000000,0x00000000c38fa540,0x00000000c5300000)
 Metaspace       used 61683K, capacity 65072K, committed 65536K, reserved 1107968K
  class space    used 7098K, capacity 7772K, committed 7936K, reserved 1048576K
}
Event: 10548.015 GC heap before
{Heap before GC invocations=241 (full 22):
 PSYoungGen      total 77824K, used 75853K [0x00000000eb580000, 0x00000000f0b80000, 0x0000000100000000)
  eden space 71168K, 100% used [0x00000000eb580000,0x00000000efb00000,0x00000000efb00000)
  from space 6656K, 70% used [0x00000000f0200000,0x00000000f06935b0,0x00000000f0880000)
  to   space 7168K, 0% used [0x00000000efb00000,0x00000000efb00000,0x00000000f0200000)
 ParOldGen       total 52224K, used 25577K [0x00000000c2000000, 0x00000000c5300000, 0x00000000eb580000)
  object space 52224K, 48% used [0x00000000c2000000,0x00000000c38fa540,0x00000000c5300000)
 Metaspace       used 61756K, capacity 65200K, committed 65792K, reserved 1107968K
  class space    used 7106K, capacity 7772K, committed 7936K, reserved 1048576K
Event: 10548.033 GC heap after
Heap after GC invocations=241 (full 22):
 PSYoungGen      total 78336K, used 3984K [0x00000000eb580000, 0x00000000f1200000, 0x0000000100000000)
  eden space 71168K, 0% used [0x00000000eb580000,0x00000000eb580000,0x00000000efb00000)
  from space 7168K, 55% used [0x00000000efb00000,0x00000000efee4040,0x00000000f0200000)
  to   space 7168K, 0% used [0x00000000f0b00000,0x00000000f0b00000,0x00000000f1200000)
 ParOldGen       total 52224K, used 25577K [0x00000000c2000000, 0x00000000c5300000, 0x00000000eb580000)
  object space 52224K, 48% used [0x00000000c2000000,0x00000000c38fa540,0x00000000c5300000)
 Metaspace       used 61756K, capacity 65200K, committed 65792K, reserved 1107968K
  class space    used 7106K, capacity 7772K, committed 7936K, reserved 1048576K
}
Event: 10572.755 GC heap before
{Heap before GC invocations=242 (full 22):
 PSYoungGen      total 78336K, used 75152K [0x00000000eb580000, 0x00000000f1200000, 0x0000000100000000)
  eden space 71168K, 100% used [0x00000000eb580000,0x00000000efb00000,0x00000000efb00000)
  from space 7168K, 55% used [0x00000000efb00000,0x00000000efee4040,0x00000000f0200000)
  to   space 7168K, 0% used [0x00000000f0b00000,0x00000000f0b00000,0x00000000f1200000)
 ParOldGen       total 52224K, used 25577K [0x00000000c2000000, 0x00000000c5300000, 0x00000000eb580000)
  object space 52224K, 48% used [0x00000000c2000000,0x00000000c38fa540,0x00000000c5300000)
 Metaspace       used 61814K, capacity 65212K, committed 65792K, reserved 1107968K
  class space    used 7110K, capacity 7774K, committed 7936K, reserved 1048576K
Event: 10572.761 GC heap after
Heap after GC invocations=242 (full 22):
 PSYoungGen      total 86528K, used 4608K [0x00000000eb580000, 0x00000000f1180000, 0x0000000100000000)
  eden space 79872K, 0% used [0x00000000eb580000,0x00000000eb580000,0x00000000f0380000)
  from space 6656K, 69% used [0x00000000f0b00000,0x00000000f0f80010,0x00000000f1180000)
  to   space 7168K, 0% used [0x00000000f0380000,0x00000000f0380000,0x00000000f0a80000)
 ParOldGen       total 52224K, used 25585K [0x00000000c2000000, 0x00000000c5300000, 0x00000000eb580000)
  object space 52224K, 48% used [0x00000000c2000000,0x00000000c38fc540,0x00000000c5300000)
 Metaspace       used 61814K, capacity 65212K, committed 65792K, reserved 1107968K
  class space    used 7110K, capacity 7774K, committed 7936K, reserved 1048576K
}
Event: 10592.476 GC heap before
{Heap before GC invocations=243 (full 22):
 PSYoungGen      total 86528K, used 32115K [0x00000000eb580000, 0x00000000f1180000, 0x0000000100000000)
  eden space 79872K, 34% used [0x00000000eb580000,0x00000000ed05cf00,0x00000000f0380000)
  from space 6656K, 69% used [0x00000000f0b00000,0x00000000f0f80010,0x00000000f1180000)
  to   space 7168K, 0% used [0x00000000f0380000,0x00000000f0380000,0x00000000f0a80000)
 ParOldGen       total 52224K, used 25585K [0x00000000c2000000, 0x00000000c5300000, 0x00000000eb580000)
  object space 52224K, 48% used [0x00000000c2000000,0x00000000c38fc540,0x00000000c5300000)
 Metaspace       used 61951K, capacity 65442K, committed 66048K, reserved 1107968K
  class space    used 7122K, capacity 7808K, committed 7936K, reserved 1048576K

Deoptimization events (10 events):
Event: 10592.254 Thread 0x000000001ce35800 Uncommon trap: reason=unhandled action=none pc=0x00000000054f3424 method=java.net.URLClassLoader.findClass(Ljava/lang/String;)Ljava/lang/Class; @ 44
Event: 10592.254 Thread 0x000000001ce35800 Uncommon trap: reason=unhandled action=none pc=0x0000000005102cd4 method=java.net.URLClassLoader.findClass(Ljava/lang/String;)Ljava/lang/Class; @ 44
Event: 10592.255 Thread 0x000000001ce35800 Uncommon trap: reason=unhandled action=none pc=0x00000000054f3424 method=java.net.URLClassLoader.findClass(Ljava/lang/String;)Ljava/lang/Class; @ 44
Event: 10592.255 Thread 0x000000001ce35800 Uncommon trap: reason=unhandled action=none pc=0x0000000005102cd4 method=java.net.URLClassLoader.findClass(Ljava/lang/String;)Ljava/lang/Class; @ 44
Event: 10592.446 Thread 0x000000001bdd1000 Uncommon trap: reason=unhandled action=none pc=0x000000000510c95c method=java.net.URLClassLoader.findClass(Ljava/lang/String;)Ljava/lang/Class; @ 44
Event: 10592.447 Thread 0x000000001bdd1000 Uncommon trap: reason=unhandled action=none pc=0x000000000510c95c method=java.net.URLClassLoader.findClass(Ljava/lang/String;)Ljava/lang/Class; @ 44
Event: 10592.448 Thread 0x000000001bdd1000 Uncommon trap: reason=unhandled action=none pc=0x000000000510c95c method=java.net.URLClassLoader.findClass(Ljava/lang/String;)Ljava/lang/Class; @ 44
Event: 10592.448 Thread 0x000000001bdd1000 Uncommon trap: reason=unhandled action=none pc=0x000000000510c95c method=java.net.URLClassLoader.findClass(Ljava/lang/String;)Ljava/lang/Class; @ 44
Event: 10592.448 Thread 0x000000001bdd1000 Uncommon trap: reason=unhandled action=none pc=0x000000000510c95c method=java.net.URLClassLoader.findClass(Ljava/lang/String;)Ljava/lang/Class; @ 44
Event: 10592.449 Thread 0x000000001bdd1000 Uncommon trap: reason=unhandled action=none pc=0x000000000510c95c method=java.net.URLClassLoader.findClass(Ljava/lang/String;)Ljava/lang/Class; @ 44

Classes redefined (10 events):
Event: 10589.606 Thread 0x0000000016dc7800 redefined class name=com.example.demo.resource.UserResource, count=1
Event: 10589.690 Thread 0x0000000016dc7800 redefined class name=com.example.demo.resource.UserResource, count=6
Event: 10589.774 Thread 0x0000000016dc7800 redefined class name=com.example.demo.resource.UserResource, count=6
Event: 10589.875 Thread 0x0000000016dc7800 redefined class name=com.example.demo.resource.UserResource, count=2
Event: 10589.956 Thread 0x0000000016dc7800 redefined class name=com.example.demo.resource.UserResource, count=6
Event: 10590.036 Thread 0x0000000016dc7800 redefined class name=com.example.demo.resource.UserResource, count=6
Event: 10590.125 Thread 0x0000000016dc7800 redefined class name=com.example.demo.resource.UserResource, count=5
Event: 10590.224 Thread 0x0000000016dc7800 redefined class name=com.example.demo.resource.UserResource, count=6
Event: 10590.331 Thread 0x0000000016dc7800 redefined class name=com.example.demo.resource.UserResource, count=6
Event: 10590.427 Thread 0x0000000016dc7800 redefined class name=com.example.demo.resource.UserResource, count=6

Internal exceptions (10 events):
Event: 10548.408 Thread 0x000000001ce2e000 Exception <a 'java/lang/ArrayIndexOutOfBoundsException': 63> (0x00000000ece08cb8) thrown at [C:\re\workspace\8-2-build-windows-amd64-cygwin\jdk8u181\11358\hotspot\src\share\vm\interpreter\interpreterRuntime.cpp, line 366]
Event: 10548.410 Thread 0x000000001ce2e000 Exception <a 'java/lang/ArrayIndexOutOfBoundsException': 92> (0x00000000ece22378) thrown at [C:\re\workspace\8-2-build-windows-amd64-cygwin\jdk8u181\11358\hotspot\src\share\vm\interpreter\interpreterRuntime.cpp, line 366]
Event: 10548.410 Thread 0x000000001ce2e000 Exception <a 'java/lang/ArrayIndexOutOfBoundsException': 88> (0x00000000ece25230) thrown at [C:\re\workspace\8-2-build-windows-amd64-cygwin\jdk8u181\11358\hotspot\src\share\vm\interpreter\interpreterRuntime.cpp, line 366]
Event: 10548.411 Thread 0x000000001ce2e000 Exception <a 'java/lang/ArrayIndexOutOfBoundsException': 131> (0x00000000ece5cfe0) thrown at [C:\re\workspace\8-2-build-windows-amd64-cygwin\jdk8u181\11358\hotspot\src\share\vm\interpreter\interpreterRuntime.cpp, line 366]
Event: 10548.413 Thread 0x000000001ce2e000 Exception <a 'java/lang/ArrayIndexOutOfBoundsException': 137> (0x00000000ecf035d8) thrown at [C:\re\workspace\8-2-build-windows-amd64-cygwin\jdk8u181\11358\hotspot\src\share\vm\interpreter\interpreterRuntime.cpp, line 366]
Event: 10548.427 Thread 0x000000001ce2e000 Exception <a 'java/lang/ArrayIndexOutOfBoundsException': 231> (0x00000000ed0e81b0) thrown at [C:\re\workspace\8-2-build-windows-amd64-cygwin\jdk8u181\11358\hotspot\src\share\vm\interpreter\interpreterRuntime.cpp, line 366]
Event: 10548.447 Thread 0x000000001ce2e000 Exception <a 'java/lang/ArrayIndexOutOfBoundsException': 123> (0x00000000ed21b760) thrown at [C:\re\workspace\8-2-build-windows-amd64-cygwin\jdk8u181\11358\hotspot\src\share\vm\interpreter\interpreterRuntime.cpp, line 366]
Event: 10548.472 Thread 0x000000001ce2e000 Exception <a 'java/lang/ArrayIndexOutOfBoundsException': 159> (0x00000000ed4c9b48) thrown at [C:\re\workspace\8-2-build-windows-amd64-cygwin\jdk8u181\11358\hotspot\src\share\vm\interpreter\interpreterRuntime.cpp, line 366]
Event: 10548.481 Thread 0x000000001ce2e000 Exception <a 'java/lang/ArrayIndexOutOfBoundsException': 234> (0x00000000ed53ddf0) thrown at [C:\re\workspace\8-2-build-windows-amd64-cygwin\jdk8u181\11358\hotspot\src\share\vm\interpreter\interpreterRuntime.cpp, line 366]
Event: 10592.471 Thread 0x000000001ce35000 Exception <a 'java/lang/InterruptedException': sleep interrupted> (0x00000000ed00d148) thrown at [C:\re\workspace\8-2-build-windows-amd64-cygwin\jdk8u181\11358\hotspot\src\share\vm\prims\jvm.cpp, line 3273]

Events (10 events):
Event: 10592.470 Executing VM operation: RevokeBias
Event: 10592.470 Executing VM operation: RevokeBias done
Event: 10592.470 Executing VM operation: BulkRevokeBias
Event: 10592.471 Executing VM operation: BulkRevokeBias done
Event: 10592.471 Executing VM operation: RevokeBias
Event: 10592.471 Executing VM operation: RevokeBias done
Event: 10592.471 Thread 0x000000001ce35000 Thread exited: 0x000000001ce35000
Event: 10592.472 Executing VM operation: RevokeBias
Event: 10592.472 Executing VM operation: RevokeBias done
Event: 10592.476 Executing VM operation: ParallelGCSystemGC


Dynamic libraries:
0x00007ff7aaf00000 - 0x00007ff7aaf37000 	C:\Program Files\Java\jre1.8.0_181\bin\javaw.exe
0x00007ffce7600000 - 0x00007ffce77e0000 	C:\Windows\SYSTEM32\ntdll.dll
0x00007ffce7340000 - 0x00007ffce73ee000 	C:\Windows\System32\KERNEL32.DLL
0x00007ffce4370000 - 0x00007ffce45d6000 	C:\Windows\System32\KERNELBASE.dll
0x00007ffce7290000 - 0x00007ffce7331000 	C:\Windows\System32\ADVAPI32.dll
0x00007ffce5210000 - 0x00007ffce52ad000 	C:\Windows\System32\msvcrt.dll
0x00007ffce5350000 - 0x00007ffce53ab000 	C:\Windows\System32\sechost.dll
0x00007ffce53b0000 - 0x00007ffce54cf000 	C:\Windows\System32\RPCRT4.dll
0x00007ffce6e50000 - 0x00007ffce6fde000 	C:\Windows\System32\USER32.dll
0x00007ffce3c00000 - 0x00007ffce3c20000 	C:\Windows\System32\win32u.dll
0x00007ffce51e0000 - 0x00007ffce5208000 	C:\Windows\System32\GDI32.dll
0x00007ffce4930000 - 0x00007ffce4ac1000 	C:\Windows\System32\gdi32full.dll
0x00007ffce4810000 - 0x00007ffce48ab000 	C:\Windows\System32\msvcp_win.dll
0x00007ffce3a50000 - 0x00007ffce3b46000 	C:\Windows\System32\ucrtbase.dll
0x00007ffccf5e0000 - 0x00007ffccf849000 	C:\Windows\WinSxS\amd64_microsoft.windows.common-controls_6595b64144ccf1df_6.0.16299.15_none_cc92fb402215d91d\COMCTL32.dll
0x00007ffce54e0000 - 0x00007ffce57e8000 	C:\Windows\System32\combase.dll
0x00007ffce48b0000 - 0x00007ffce4922000 	C:\Windows\System32\bcryptPrimitives.dll
0x00007ffce5320000 - 0x00007ffce534d000 	C:\Windows\System32\IMM32.DLL
0x0000000075fc0000 - 0x0000000076092000 	C:\Program Files\Java\jre1.8.0_181\bin\msvcr100.dll
0x0000000076240000 - 0x0000000076ae2000 	C:\Program Files\Java\jre1.8.0_181\bin\server\jvm.dll
0x00007ffce6da0000 - 0x00007ffce6da8000 	C:\Windows\System32\PSAPI.DLL
0x00007ffce0190000 - 0x00007ffce01b3000 	C:\Windows\SYSTEM32\WINMM.dll
0x00007ffcd9200000 - 0x00007ffcd920a000 	C:\Windows\SYSTEM32\VERSION.dll
0x00007ffce2600000 - 0x00007ffce2609000 	C:\Windows\SYSTEM32\WSOCK32.dll
0x00007ffcdf650000 - 0x00007ffcdf67a000 	C:\Windows\SYSTEM32\WINMMBASE.dll
0x00007ffce3a00000 - 0x00007ffce3a4a000 	C:\Windows\System32\cfgmgr32.dll
0x00007ffce52b0000 - 0x00007ffce531c000 	C:\Windows\System32\WS2_32.dll
0x0000000077140000 - 0x000000007714f000 	C:\Program Files\Java\jre1.8.0_181\bin\verify.dll
0x0000000076130000 - 0x0000000076159000 	C:\Program Files\Java\jre1.8.0_181\bin\java.dll
0x0000000075f80000 - 0x0000000075fb5000 	C:\Program Files\Java\jre1.8.0_181\bin\jdwp.dll
0x0000000075f70000 - 0x0000000075f78000 	C:\Program Files\Java\jre1.8.0_181\bin\npt.dll
0x0000000075f40000 - 0x0000000075f63000 	C:\Program Files\Java\jre1.8.0_181\bin\instrument.dll
0x0000000077120000 - 0x0000000077136000 	C:\Program Files\Java\jre1.8.0_181\bin\zip.dll
0x00007ffce5960000 - 0x00007ffce6d97000 	C:\Windows\System32\SHELL32.dll
0x00007ffce7400000 - 0x00007ffce74a6000 	C:\Windows\System32\shcore.dll
0x00007ffce3c20000 - 0x00007ffce4367000 	C:\Windows\System32\windows.storage.dll
0x00007ffce74b0000 - 0x00007ffce7501000 	C:\Windows\System32\shlwapi.dll
0x00007ffce39e0000 - 0x00007ffce39f1000 	C:\Windows\System32\kernel.appcore.dll
0x00007ffce3990000 - 0x00007ffce39dc000 	C:\Windows\System32\powrprof.dll
0x00007ffce3950000 - 0x00007ffce396b000 	C:\Windows\System32\profapi.dll
0x0000000075f30000 - 0x0000000075f39000 	C:\Program Files\Java\jre1.8.0_181\bin\dt_socket.dll
0x00007ffcde1c0000 - 0x00007ffcde1d6000 	C:\Windows\system32\napinsp.dll
0x00007ffcd41e0000 - 0x00007ffcd41fa000 	C:\Windows\system32\pnrpnsp.dll
0x00007ffce0030000 - 0x00007ffce0048000 	C:\Windows\system32\NLAapi.dll
0x00007ffce3180000 - 0x00007ffce31e6000 	C:\Windows\System32\mswsock.dll
0x00007ffce2f50000 - 0x00007ffce3006000 	C:\Windows\SYSTEM32\DNSAPI.dll
0x00007ffce54d0000 - 0x00007ffce54d8000 	C:\Windows\System32\NSI.dll
0x00007ffce2f10000 - 0x00007ffce2f49000 	C:\Windows\SYSTEM32\IPHLPAPI.DLL
0x00007ffce0260000 - 0x00007ffce026e000 	C:\Windows\System32\winrnr.dll
0x00007ffcc3990000 - 0x00007ffcc39a5000 	C:\Windows\System32\wshbth.dll
0x00007ffcdc1e0000 - 0x00007ffcdc250000 	C:\Windows\System32\fwpuclnt.dll
0x00007ffce34b0000 - 0x00007ffce34d5000 	C:\Windows\SYSTEM32\bcrypt.dll
0x00007ffcdb2c0000 - 0x00007ffcdb2ca000 	C:\Windows\System32\rasadhlp.dll
0x00000000760b0000 - 0x00000000760bd000 	C:\Program Files\Java\jre1.8.0_181\bin\management.dll
0x0000000076110000 - 0x000000007612a000 	C:\Program Files\Java\jre1.8.0_181\bin\net.dll
0x00000000760f0000 - 0x0000000076101000 	C:\Program Files\Java\jre1.8.0_181\bin\nio.dll
0x00007ffce3340000 - 0x00007ffce3357000 	C:\Windows\SYSTEM32\CRYPTSP.dll
0x00007ffce2d90000 - 0x00007ffce2dc3000 	C:\Windows\system32\rsaenh.dll
0x00007ffce3880000 - 0x00007ffce38a9000 	C:\Windows\SYSTEM32\USERENV.dll
0x00007ffce3360000 - 0x00007ffce336b000 	C:\Windows\SYSTEM32\CRYPTBASE.dll
0x00007ffcdc480000 - 0x00007ffcdc496000 	C:\Windows\SYSTEM32\dhcpcsvc6.DLL
0x00007ffcdd180000 - 0x00007ffcdd19a000 	C:\Windows\SYSTEM32\dhcpcsvc.DLL

VM Arguments:
jvm_args: -agentlib:jdwp=transport=dt_socket,suspend=y,address=localhost:59428 -javaagent:C:\Users\Admin\Downloads\spring-tool-suite-3.9.5.RELEASE-e4.8.0-win32-x86_64\sts-bundle\sts-3.9.5.RELEASE\configuration\org.eclipse.osgi\316\0\.cp\lib\javaagent-shaded.jar -Dfile.encoding=UTF-8 
java_command: com.example.demo.TestSbSvProduct2Application
java_class_path (initial): C:\Program Files\Java\jre1.8.0_181\lib\resources.jar;C:\Program Files\Java\jre1.8.0_181\lib\rt.jar;C:\Program Files\Java\jre1.8.0_181\lib\jsse.jar;C:\Program Files\Java\jre1.8.0_181\lib\jce.jar;C:\Program Files\Java\jre1.8.0_181\lib\charsets.jar;C:\Program Files\Java\jre1.8.0_181\lib\jfr.jar;C:\Program Files\Java\jre1.8.0_181\lib\ext\access-bridge-64.jar;C:\Program Files\Java\jre1.8.0_181\lib\ext\cldrdata.jar;C:\Program Files\Java\jre1.8.0_181\lib\ext\dnsns.jar;C:\Program Files\Java\jre1.8.0_181\lib\ext\jaccess.jar;C:\Program Files\Java\jre1.8.0_181\lib\ext\jfxrt.jar;C:\Program Files\Java\jre1.8.0_181\lib\ext\localedata.jar;C:\Program Files\Java\jre1.8.0_181\lib\ext\nashorn.jar;C:\Program Files\Java\jre1.8.0_181\lib\ext\sunec.jar;C:\Program Files\Java\jre1.8.0_181\lib\ext\sunjce_provider.jar;C:\Program Files\Java\jre1.8.0_181\lib\ext\sunmscapi.jar;C:\Program Files\Java\jre1.8.0_181\lib\ext\sunpkcs11.jar;C:\Program Files\Java\jre1.8.0_181\lib\ext\zipfs.jar;C:\Users\Admin\git\jvb_demo_sb_2\test_SB_SV_Product_2\target\classes;C:\Users\Admin\.m2\repository\org\springframework\boot\spring-boot-starter-jdbc\2.1.3.RELEASE\spring-boot-starter-jdbc-2.1.3.RELEASE.jar;C:\Users\Admin\.m2\repository\org\springframework\boot\spring-boot-starter\2.1.3.RELEASE\spring-boot-starter-2.1.3.RELEASE.jar;C:\Users\Admin\.m2\repository\org\springframework\boot\spring-boot-starter-logging\2.1.3.RELEASE\spring-boot-starter-logging-2.1.3.RELEASE.jar;C:\Users\Admin\.m2\repository\ch\qos\logback\logback-classic\1.2.3\logback-classic-1.2.3.jar;C:\Users\Admin\.m2\repository\ch\qos\logback\logback-core\1.2.3\logback-core-1.2.3.jar;C:\Users\Admin\.m2\repository\org\apache\logging\log4j\log4j-to-slf4j\2.11.2\log4j-to-slf4j-2.11.2.jar;C:\Users\Admin\.m2\repository\org\apache\logging\log4j\log4j-api\2.11.2\log4j-api-2.11.2.jar;C:\Users\Admin\.m2\repository\org\slf4j\jul-to-slf4j\1.7.25\jul-to-slf4j-1.7.25.jar;C:\Users\Admin\.m2\repository\javax\annotation\javax.annotation-a
Launcher Type: SUN_STANDARD

Environment Variables:
JAVA_HOME=C:\Program Files\Java\jdk1.8.0_181
JRE_HOME=C:\Program Files\Java\jdk1.8.0_181\jre
PATH=C:/Program Files/Java/jre1.8.0_181/bin/server;C:/Program Files/Java/jre1.8.0_181/bin;C:/Program Files/Java/jre1.8.0_181/lib/amd64;C:\Python27\Lib\site-packages\PyQt4;C:\Program Files\Microsoft MPI\Bin\;C:\Program Files (x86)\Common Files\Oracle\Java\javapath;C:\Windows\system32;C:\Windows;C:\Windows\System32\Wbem;C:\Windows\System32\WindowsPowerShell\v1.0\;C:\Program Files\Java\jdk1.8.0_181\bin;D:\code\Git\cmd;C:\Program Files (x86)\Microsoft SQL Server\100\Tools\Binn\;C:\Program Files\Microsoft SQL Server\100\Tools\Binn\;C:\Program Files\Microsoft SQL Server\100\DTS\Binn\;C:\Program Files (x86)\Microsoft SQL Server\100\Tools\Binn\VSShell\Common7\IDE\;C:\Program Files (x86)\Microsoft SQL Server\100\DTS\Binn\;C:\Program Files (x86)\Microsoft Visual Studio 9.0\Common7\IDE\PrivateAssemblies\;C:\Program Files\dotnet\;C:\Program Files\Microsoft SQL Server\130\Tools\Binn\;C:\Windows\System32;C:\Windows;D:\WPy-3670\python-3.6.7.amd64\Scripts;D:\WPy-3670;C:\Program Files\nodejs\;C:\Program Files (x86)\Microsoft SQL Server\Client SDK\ODBC\130\Tools\Binn\;C:\Program Files (x86)\Microsoft SQL Server\140\Tools\Binn\;C:\Program Files (x86)\Microsoft SQL Server\140\DTS\Binn\;C:\Program Files (x86)\Microsoft SQL Server\140\Tools\Binn\ManagementStudio\;C:\Python27;C:\Python27\DLLs;C:\Python27\Scripts;C:\Python27\gnuplot\binary;C:\Program Files (x86)\pythonxy\SciTE-3.5.1-4;C:\Program Files (x86)\pythonxy\console;C:\Users\Admin\AppData\Local\Microsoft\WindowsApps;C:\Program Files\Mercurial;C:\Program Files\Java\jdk1.8.0_181\bin;C:\Users\Admin\AppData\Roaming\npm;C:\Users\Admin\AppData\Local\Programs\MiKTeX 2.9\miktex\bin\x64\;C:\Users\Admin\Downloads\spring-tool-suite-3.9.5.RELEASE-e4.8.0-win32-x86_64\sts-bundle\sts-3.9.5.RELEASE;
USERNAME=Admin
OS=Windows_NT
PROCESSOR_IDENTIFIER=Intel64 Family 6 Model 78 Stepping 3, GenuineIntel



---------------  S Y S T E M  ---------------

OS: Windows 10.0 , 64 bit Build 16299 (10.0.16299.15)

CPU:total 4 (initial active 4) (2 cores per cpu, 2 threads per core) family 6 model 78 stepping 3, cmov, cx8, fxsr, mmx, sse, sse2, sse3, ssse3, sse4.1, sse4.2, popcnt, avx, avx2, aes, clmul, erms, 3dnowpref, lzcnt, ht, tsc, tscinvbit, bmi1, bmi2, adx

Memory: 4k page, physical 4056632k(505296k free), swap 6547000k(1535708k free)

vm_info: Java HotSpot(TM) 64-Bit Server VM (25.181-b13) for windows-amd64 JRE (1.8.0_181-b13), built on Jul  7 2018 04:01:33 by "java_re" with MS VC++ 10.0 (VS2010)

time: Fri Apr 26 16:50:59 2019
elapsed time: 10592 seconds (0d 2h 56m 32s)

