{
  "project_id": "bf",
  "language": "en",
  "KAFKA_BOOTSTRAP_SERVERS": "192.168.20.15:9092",
  "KAFKA_TOPIC": "ks_rasa_events",
  "CONSUMER_GROUP_ID": "cobat_kcloset",
  "KAFKA_SASL_USERNAME": "admin",
  "KAFKA_SASL_PASSWORD": "admin-secret"
}