{
  "project_info": {
    "project_number": "1018779821983",
    "project_id": "rn-common",
    "storage_bucket": "rn-common.appspot.com"
  },
  "client": [
    {
      "client_info": {
        "mobilesdk_app_id": "1:1018779821983:android:e4d82e7b3b0a9e23a0ffaa",
        "android_client_info": {
          "package_name": "com.pt.rncommon"
        }
      },
      "oauth_client": [],
      "api_key": [
        {
          "current_key": "AIzaSyB83OaMIEbbKFBLjK79N-df5VcWzYQka2c"
        }
      ],
      "services": {
        "appinvite_service": {
          "other_platform_oauth_client": []
        }
      }
    }
  ],
  "configuration_version": "1"
}