{
    "compilerOptions": {
        "module": "commonjs",
        "target": "es6",
        "baseUrl": "./",
        "paths": {
            "@src/*": ["src/*"], 
            "@sagas/*": ["src/sagas/*"],
            "@redux/*": ["src/redux/*"],
            "@components/*": ["src/components/*"],
            "@pages/*": ["src/pages/*"],
            "@layout/*": ["src/layouts/*"],
            "@config/*": ["src/config/*"],
            "@utils/*": ["src/utils/*"],
            "@hoc/*": ["src/hoc/*"],
            "@hooks/*": ["src/hooks/*"]
        }
    },
    "exclude": ["node_modules"]
}
