<?xml version="1.0" encoding="UTF-8" standalone="no"?>
<!-- Created with Inkscape (http://www.inkscape.org/) -->

<svg
   xmlns:dc="http://purl.org/dc/elements/1.1/"
   xmlns:cc="http://creativecommons.org/ns#"
   xmlns:rdf="http://www.w3.org/1999/02/22-rdf-syntax-ns#"
   xmlns:svg="http://www.w3.org/2000/svg"
   xmlns="http://www.w3.org/2000/svg"
   xmlns:sodipodi="http://sodipodi.sourceforge.net/DTD/sodipodi-0.dtd"
   xmlns:inkscape="http://www.inkscape.org/namespaces/inkscape"
   width="256"
   height="256"
   viewBox="0 0 67.733332 67.733335"
   version="1.1"
   id="svg8"
   inkscape:version="0.92.4 (5da689c313, 2019-01-14)"
   sodipodi:docname="camillan.svg">
  <defs
     id="defs2">
    <filter
       inkscape:collect="always"
       style="color-interpolation-filters:sRGB"
       id="filter843"
       x="-0.082315615"
       width="1.1646312"
       y="-0.063981924"
       height="1.1279638">
      <feGaussianBlur
         inkscape:collect="always"
         stdDeviation="1.4709911"
         id="feGaussianBlur845" />
    </filter>
    <filter
       inkscape:collect="always"
       style="color-interpolation-filters:sRGB"
       id="filter847"
       x="-0.013719269"
       width="1.0274385"
       y="-0.010663654"
       height="1.0213273">
      <feGaussianBlur
         inkscape:collect="always"
         stdDeviation="0.24516519"
         id="feGaussianBlur849" />
    </filter>
  </defs>
  <sodipodi:namedview
     id="base"
     pagecolor="#ffffff"
     bordercolor="#666666"
     borderopacity="1.0"
     inkscape:pageopacity="0.0"
     inkscape:pageshadow="2"
     inkscape:zoom="1.979899"
     inkscape:cx="110.55285"
     inkscape:cy="94.88255"
     inkscape:document-units="mm"
     inkscape:current-layer="layer1"
     showgrid="false"
     units="px"
     inkscape:pagecheckerboard="true"
     inkscape:window-width="1885"
     inkscape:window-height="1385"
     inkscape:window-x="70"
     inkscape:window-y="27"
     inkscape:window-maximized="0" />
  <metadata
     id="metadata5">
    <rdf:RDF>
      <cc:Work
         rdf:about="">
        <dc:format>image/svg+xml</dc:format>
        <dc:type
           rdf:resource="http://purl.org/dc/dcmitype/StillImage" />
        <dc:title></dc:title>
      </cc:Work>
    </rdf:RDF>
  </metadata>
  <g
     inkscape:label="Layer 1"
     inkscape:groupmode="layer"
     id="layer1"
     transform="translate(0,-229.26665)">
    <text
       id="text821"
       y="289.43506"
       x="7.7231221"
       style="font-style:normal;font-weight:normal;font-size:72.95289612px;line-height:1.25;font-family:sans-serif;letter-spacing:0px;word-spacing:0px;fill:#ff0000;fill-opacity:1;stroke:#ff0002;stroke-width:2.924;stroke-opacity:1;stroke-miterlimit:4;stroke-dasharray:none;filter:url(#filter843)"
       xml:space="preserve"><tspan
         style="stroke-width:2.924;fill:#ff0000;fill-opacity:1;stroke:#ff0002;stroke-opacity:1;stroke-miterlimit:4;stroke-dasharray:none"
         y="289.43506"
         x="7.7231221"
         id="tspan819"
         sodipodi:role="line">C</tspan></text>
    <text
       xml:space="preserve"
       style="font-style:normal;font-weight:normal;font-size:72.95289612px;line-height:1.25;font-family:sans-serif;letter-spacing:0px;word-spacing:0px;fill:#000000;fill-opacity:1;stroke:#ffffff;stroke-width:0.8;stroke-opacity:1;stroke-miterlimit:4;stroke-dasharray:none;filter:url(#filter847)"
       x="7.7231221"
       y="289.43506"
       id="text817"><tspan
         sodipodi:role="line"
         id="tspan815"
         x="7.7231221"
         y="289.43506"
         style="stroke-width:0.8;stroke:#ffffff;stroke-opacity:1;stroke-miterlimit:4;stroke-dasharray:none">C</tspan></text>
  </g>
</svg>
