{'is_success': True, 'data': {'symbol': 'AOT', 'high': 74.5, 'low': 74.25, 'last': 74.5, 'change': -7.5, 'total_volume': '36600', 'total_value': 2726650.0, 'market_status': 'OPEN1_E'}
{'is_success': True, 'data': {'symbol': 'AOT', 'high': 74.5, 'low': 74.25, 'last': 74.5, 'change': -7.5, 'total_volume': '37400', 'total_value': 2786250.0, 'market_status': 'INTERMISSION_E'}}
{'is_success': True, 'data': {'symbol': 'AOT', 'projected_open_price': 74.5, 'high': 74.5, 'low': 74.25, 'last': 74.5, 'change': -7.5, 'total_volume': '37400', 'total_value': 2786250.0, 'market_status': 'PRE_OPEN2_E'}}
{'is_success': True, 'data': {'symbol': 'AOT', 'projected_open_price': 74.25, 'high': 74.5, 'low': 74.25, 'last': 74.5, 'change': -7.5, 'total_volume': '37400', 'total_value': 2786250.0, 'market_status': 'PRE_OPEN2_E'}}
{'is_success': True, 'data': {'symbol': 'AOT', 'projected_open_price': 74.0, 'high': 74.5, 'low': 74.25, 'last': 74.5, 'change': -7.5, 'total_volume': '37400', 'total_value': 2786250.0, 'market_status': 'PRE_OPEN2_E'}}
{'is_success': True, 'data': {'symbol': 'AOT', 'projected_open_price': 74.0, 'high': 74.5, 'low': 74.25, 'last': 74.5, 'change': -7.5, 'total_volume': '37400', 'total_value': 2786250.0, 'market_status': 'OPEN2_E'}}

{'is_success': True, 'data': {'symbol': 'AOT', 'projected_open_price': 74.0, 'high': 75.0, 'low': 73.0, 'last': 75.0, 'change': -7.0, 'total_volume': '208300', 'total_value': 15467600.0, 'market_status': 'OPEN2_E'}}
{'is_success': True, 'data': {'symbol': 'AOT', 'projected_open_price': 74.0, 'high': 75.0, 'low': 73.0, 'last': 75.0, 'change': -7.0, 'total_volume': '218300', 'total_value': 16217600.0, 'market_status': 'OPEN2_E'}}
{'is_success': True, 'data': {'symbol': 'AOT', 'projected_open_price': 74.0, 'high': 75.0, 'low': 73.0, 'last': 75.0, 'change': -7.0, 'total_volume': '218300', 'total_value': 16217600.0, 'market_status': 'CALL_E'}}
{'is_success': True, 'data': {'symbol': 'AOT', 'projected_open_price': 74.0, 'high': 75.0, 'low': 72.5, 'last': 72.5, 'change': -9.5, 'total_volume': '220600', 'total_value': 16384350.0, 'market_status': 'RUN_OFF_E'}}
{'is_success': True, 'data': {'symbol': 'AOT', 'projected_open_price': 74.0, 'high': 75.0, 'low': 72.5, 'last': 72.5, 'change': -9.5, 'total_volume': '220600', 'total_value': 16384350.0, 'market_status': 'CLOSE_E'}}