module gitlab.com/dew-playground/gin-golang/melody-websocket

go 1.15

require (
	github.com/gin-gonic/gin v1.6.3
	github.com/gorilla/websocket v1.4.2 // indirect
	gopkg.in/olahol/melody.v1 v1.0.0-20170518105555-d52139073376
)
