module sample/gin-poc

go 1.15

require (
	github.com/dgrijalva/jwt-go v3.2.0+incompatible
	github.com/gin-gonic/gin v1.6.3
	github.com/tpkeeper/gin-dump v1.0.0
	gopkg.in/go-playground/validator.v9 v9.31.0
)
