absl-py==0.9.0
astor==0.8.1
cycler==0.10.0
gast==0.3.3
grpcio==1.28.1
h5py==2.10.0
joblib==0.14.1
kiwisolver==1.2.0
Markdown==3.2.1
matplotlib==3.2.1
mock==4.0.2
numpy==1.18.3
pandas==1.0.3
Pillow==7.1.1
protobuf==3.11.3
pyparsing==3.0.0a1
python-dateutil==2.8.1
pytz==2019.3
PyYAML==5.3.1
scikit-learn==0.22.2.post1
scipy==1.4.1
seaborn==0.10.0
six==1.14.0
sklearn==0.0
tensorboard==2.2.1
tensorflow-rocm==2.3.1
tensorflow-estimator==2.2.0
termcolor==1.1.0
Werkzeug==1.0.1
