absl-py==0.11.0
astunparse==1.6.3
attrs==20.3.0
cached-property==1.5.2
cachetools==4.2.0
certifi==2020.12.5
chardet==4.0.0
coverage==5.3.1
flatbuffers==1.12
gast==0.3.3
google-auth==1.24.0
google-auth-oauthlib==0.4.2
google-pasta==0.2.0
grpcio==1.32.0
h5py==2.10.0
idna==2.10
iniconfig==1.1.1
joblib==1.0.0
Keras-Preprocessing==1.1.2
Markdown==3.3.3
numpy==1.19.4
oauthlib==3.1.0
opt-einsum==3.3.0
packaging==20.8
pandas==1.2.0
pip==20.3.3
pluggy==0.13.1
protobuf==3.14.0
py==1.10.0
pyasn1==0.4.8
pyasn1-modules==0.2.8
pyparsing==2.4.7
pytest==6.2.1
pytest-cov==2.10.1
python-dateutil==2.8.1
pytz==2020.5
requests==2.25.1
requests-oauthlib==1.3.0
rsa==4.6
scikit-learn==0.24.0
scipy==1.5.4
setuptools==51.1.0.post20201221
six==1.15.0
sklearn==0.0
tensorboard==2.4.0
tensorboard-plugin-wit==1.7.0
tensorflow-estimator==2.4.0
tensorflow-rocm==2.4.0
termcolor==1.1.0
threadpoolctl==2.1.0
toml==0.10.2
typing-extensions==3.7.4.3
urllib3==1.26.2
Werkzeug==1.0.1
wheel==0.36.2
wrapt==1.12.1
