{
"IMM_W":         16,
"DELAY_SLOTS":          1,
"shft": 0,
"add": 1,
"addi": 2,
"sub": 3,
"and": 4,
"xor": 5,
"ldi": 6,
"ldih": 7,
"rdw": 8,
"wrw": 9,
"rdwb":10,
"wrwb":11,
"beqi":12,
"beq":13,
"bneqi":14,
"bneq":15,
"nop": 0,
"wrc": 9,
"INSTR_W":         20,
"PROG_ADDR_W":          9,
"RB":   0,
"RC":   1,
"R0":  16,
"R1":  17,
"R2":  18,
"R3":  19,
"R4":  20,
"R5":  21,
"R6":  22,
"R7":  23,
"R8":  24,
"R9":  25,
"R10":  26,
"R11":  27,
"R12":  28,
"R13":  29,
"R14":  30,
"R15":  31,
"PROG_ROM":  0,
"PROG_ROM_ADDR_W":          4,
"PROG_RAM":256,
"PROG_RAM_ADDR_W":          8,
"PROG_BASE": 512,
"CPRT_BASE":  32,
}
