# File exported by Houdini 16.0.504.20 (www.sidefx.com)
# 231 points
# 978 vertices
# 260 primitives
# Bounds: [-44.5879822, 0.370714068, -5.09581614] to [44.5296059, 81.7724762, 0]
g 
v -0.126398727 0.468465686 0
v 0.02358949 0.375181437 0
v 4.41128302 4.49508715 0
v 8.15661526 7.90512276 0
v 11.6149273 10.994935 0
v 14.7177086 13.7172966 0
v 17.5762405 16.2005768 0
v 20.7060928 18.9159966 0
v 24.2162056 21.9659634 0
v 28.0447388 25.3761806 0
v 30.208334 27.3959999 0
v 30.2916679 27.4684677 0
v 30.2916679 27.4684677 0
v 33.7688217 30.9152031 0
v 36.1517487 33.630867 0
v 37.935463 35.9080544 0
v 39.2296906 37.8162804 0
v 40.5015106 39.9544792 0
v 41.237072 41.4684639 0
v 41.2916679 41.5517998 0
v 41.2916679 41.5517998 0
v 41.8461685 42.8125191 0
v 42.6473007 44.9723396 0
v 43.3790131 47.4728546 0
v 44.068943 50.9354095 0
v 44.3533974 53.5517998 0
v 44.3750038 53.6351318 0
v 44.3750038 53.6351318 0
v 44.4951286 55.4193611 0
v 44.5256424 61.2233276 0
v 43.9440536 64.4656982 0
v 43.4418182 66.2133102 0
v 42.8272362 67.9031754 0
v 42.1613922 69.3603134 0
v 41.5339699 70.5414505 0
v 40.8178635 71.7082062 0
v 39.4837494 73.5738754 0
v 37.7916679 75.3871765 0
v 37.7083321 75.4684677 0
v 37.7083321 75.4684677 0
v 36.0143204 76.9723206 0
v 34.4812431 78.0481491 0
v 33.2584839 78.8063965 0
v 31.9579639 79.4872513 0
v 30.7621574 80.0242996 0
v 29.1663208 80.6230927 0
v 26.4546547 81.3666611 0
v 23.5370922 81.7724762 0
v 19.1766243 81.750618 0
v 16.9308701 81.3802338 0
v 14.2298851 80.6651993 0
v 12.04776 79.8008881 0
v 10.5136194 79.051796 0
v 8.63427639 77.9273071 0
v 6.14028597 76.1037064 0
v 3.78576136 73.8018036 0
v 3.70833349 73.7184677 0
v 3.70833349 73.7184677 0
v 1.6524806 71.2888336 0
v -0.000239163637 68.8504944 0
v -1.90997267 71.589386 0
v -4.89745235 74.9555206 0
v -8.19577694 77.6513443 0
v -10.6170301 79.1117706 0
v -12.2999477 79.915329 0
v -13.9317141 80.5536728 0
v -16.4189072 81.2668076 0
v -19.2016811 81.7513428 0
v -23.5439396 81.7709808 0
v -26.4462357 81.3695374 0
v -28.7357597 80.7622299 0
v -30.4427834 80.1654587 0
v -32.1364975 79.4015656 0
v -33.5817108 78.6135941 0
v -35.1875687 77.5791168 0
v -37.0428162 76.0933609 0
v -39.3635902 73.6993561 0
v -40.4567451 72.2420654 0
v -41.2659531 71.0032196 0
v -41.97295 69.7327347 0
v -42.548336 68.5527954 0
v -43.0752258 67.2778397 0
v -43.6471825 65.532074 0
v -44.1606598 63.496315 0
v -44.4324684 61.4684639 0
v -44.4583359 61.3851318 0
v -44.4583359 61.3851318 0
v -44.4877625 60.8859177 0
v -44.5250015 60.4684639 0
v -44.5416679 60.3851318 0
v -44.5416679 60.3851318 0
v -44.5879822 57.2350998 0
v -44.3687363 53.5579071 0
v -44.0091629 50.6493683 0
v -43.5961571 48.4080849 0
v -43.1698952 46.6761703 0
v -42.7736893 45.3399086 0
v -42.2939606 43.9576416 0
v -41.5683632 42.1543388 0
v -40.6664963 40.2739944 0
v -39.3330383 37.9615326 0
v -37.4639778 35.2668877 0
v -35.206852 32.5149193 0
v -29.713192 26.8872948 0
v -25.6403828 23.2202702 0
v -22.2860641 20.2878914 0
v -17.8793468 16.4621181 0
v -13.3661251 12.5338049 0
v -11.125001 10.5433998 0
v -11.041667 10.4684649 0
v -11.041667 10.4684649 0
v -10.0615482 9.61092091 0
v -8.79166698 8.4600687 0
v -8.70833302 8.38513088 0
v -8.70833302 8.38513088 0
v -6.73950768 6.6244216 0
v -2.60832429 2.81856966 0
v -0.208333343 0.545847416 0
v -0.126398727 0.468465686 0
v -0.126398727 0.468465686 -5.09581566
v 0.020373458 0.370714068 -5.09581566
v 3.80840445 3.93350124 -5.09581614
v 6.77329159 6.64844513 -5.09581566
v 9.34448051 8.96623421 -5.09581518
v 11.6213274 10.9931202 -5.09581566
v 14.0865402 13.1610003 -5.09581518
v 18.2253113 16.7583561 -5.09581614
v 22.6208782 20.5776939 -5.09581566
v 25.2850113 22.9086647 -5.09581566
v 28.0628891 25.3921413 -5.09581614
v 30.2916679 27.4684677 -5.09581566
v 30.2916679 27.4684677 -5.09581566
v 30.375 27.5477638 -5.09581566
v 33.7613487 30.9094486 -5.09581614
v 36.3817291 33.9122009 -5.09581566
v 38.1508446 36.215641 -5.09581566
v 39.3440208 38.0004272 -5.09581566
v 40.0382805 39.1534462 -5.09581566
v 40.7893639 40.516552 -5.09581566
v 41.2916679 41.5517998 -5.09581566
v 41.2916679 41.5517998 -5.09581566
v 41.3173141 41.6351318 -5.09581566
v 41.4900322 41.9892502 -5.09581566
v 42.0022621 43.2041054 -5.09581566
v 42.6516228 44.9790955 -5.09581566
v 43.165226 46.6823235 -5.09581566
v 43.5437317 48.1670189 -5.09581566
v 43.9804688 50.4842644 -5.09581566
v 44.2492867 52.4783974 -5.09581566
v 44.3750038 53.6351318 -5.09581566
v 44.3750038 53.6351318 -5.09581566
v 44.3838005 53.7184639 -5.09581566
v 44.5228996 55.7065506 -5.09581566
v 44.5296059 60.8494759 -5.09581566
v 44.0463066 64.0545578 -5.09581518
v 43.4634132 66.1270447 -5.09581614
v 42.5720215 68.515686 -5.09581566
v 41.4306717 70.7384262 -5.09581566
v 39.8429451 73.151268 -5.09581566
v 37.7083321 75.4684677 -5.09581566
v 37.7083321 75.4684677 -5.09581566
v 37.625 75.54599 -5.09581566
v 36.0055313 76.9790878 -5.09581566
v 33.5341606 78.6639328 -5.09581518
v 30.9432392 79.9607773 -5.09581566
v 28.8021317 80.7412415 -5.09581566
v 26.8704796 81.2688217 -5.09581566
v 24.2674694 81.7158585 -5.09581518
v 19.1784134 81.7497864 -5.09581566
v 17.1180859 81.4102554 -5.09581566
v 14.6222572 80.7936401 -5.09581518
v 11.6096783 79.6136398 -5.09581566
v 8.84850502 78.083313 -5.09581518
v 5.93304873 75.9175262 -5.09581614
v 3.70833349 73.7184677 -5.09581566
v 3.70833349 73.7184677 -5.09581566
v 3.6416676 73.6351395 -5.09581566
v 2.46773958 72.2982178 -5.09581566
v 0.880838931 70.1497269 -5.09581566
v -0.0193588436 68.8162384 -5.09581566
v -1.31722689 70.772171 -5.09581566
v -3.01786661 72.9542999 -5.09581566
v -6.31830168 76.2439041 -5.09581566
v -9.09306145 78.2395782 -5.09581566
v -11.6022444 79.5990219 -5.09581566
v -13.3383827 80.332634 -5.09581566
v -15.0854225 80.9263458 -5.09581566
v -17.9278049 81.6349411 -5.09581566
v -23.5517731 81.7675629 -5.09581566
v -26.4927654 81.3504868 -5.09581518
v -29.1648178 80.6238403 -5.09581566
v -31.7665997 79.5956573 -5.09581566
v -34.0295219 78.3480377 -5.09581566
v -36.6702652 76.4735718 -5.09581566
v -40.5970993 72.1054916 -5.09581566
v -41.8528824 69.965004 -5.09581566
v -42.5848732 68.4650803 -5.09581566
v -43.4090614 66.3334351 -5.09581566
v -44.0738602 63.9927254 -5.09581518
v -44.4583359 61.3851318 -5.09581566
v -44.4583359 61.3851318 -5.09581566
v -44.4686813 61.301796 -5.09581566
v -44.4956436 60.7217674 -5.09581566
v -44.5416679 60.3851318 -5.09581566
v -44.5416679 60.3851318 -5.09581566
v -44.5477524 60.3017998 -5.09581566
v -44.572319 56.2239113 -5.09581518
v -44.114624 51.1481094 -5.09581518
v -43.387722 47.5030556 -5.09581566
v -42.6184425 44.8851471 -5.09581566
v -41.8939476 42.9326172 -5.09581566
v -40.9526863 40.8251152 -5.09581566
v -39.6302681 38.4462585 -5.09581614
v -38.3387871 36.4820786 -5.09581566
v -36.5405846 34.0703354 -5.09581518
v -33.3683586 30.50844 -5.09581566
v -27.2349663 24.6246243 -5.09581566
v -22.9301414 20.8431587 -5.09581566
v -18.1842232 16.7257271 -5.09581614
v -13.3622036 12.5313435 -5.09581518
v -11.041667 10.4684649 -5.09581566
v -11.041667 10.4684649 -5.09581566
v -10.958333 10.4089413 -5.09581566
v -10.009304 9.5631752 -5.09581566
v -8.70833302 8.38513088 -5.09581566
v -8.70833302 8.38513088 -5.09581566
v -8.625 8.32340431 -5.09581566
v -6.67206192 6.56327009 -5.09581566
v -2.60425568 2.81597376 -5.09581566
v -0.208333343 0.545847416 -5.09581566
v -0.126398727 0.468465686 -5.09581566
g 
f 1 121 2
f 2 121 3
f 3 123 4
f 4 124 5
f 5 126 6
f 6 127 7
f 7 127 8
f 8 128 9
f 9 129 10
f 10 130 11
f 11 131 12
f 12 131 13
f 13 133 14
f 14 134 15
f 15 135 16
f 16 136 17
f 17 137 18
f 18 139 19
f 19 140 20
f 20 140 21
f 21 142 22
f 22 145 23
f 23 145 24
f 24 147 25
f 25 149 26
f 26 150 27
f 27 150 28
f 28 152 29
f 29 153 30
f 30 155 31
f 31 156 32
f 32 156 33
f 33 157 34
f 34 158 35
f 35 158 36
f 36 159 37
f 37 159 38
f 38 160 39
f 39 160 40
f 40 162 41
f 41 164 42
f 42 164 43
f 43 164 44
f 44 165 45
f 45 165 46
f 46 167 47
f 47 168 48
f 48 169 49
f 49 169 50
f 50 171 51
f 51 172 52
f 52 172 53
f 53 173 54
f 54 173 55
f 55 174 56
f 56 175 57
f 57 175 58
f 58 177 59
f 59 179 60
f 60 181 61
f 61 182 62
f 62 183 63
f 63 184 64
f 64 185 65
f 65 186 66
f 66 187 67
f 67 188 68
f 68 189 69
f 69 189 70
f 70 190 71
f 71 191 72
f 72 192 73
f 73 192 74
f 74 193 75
f 75 194 76
f 76 194 77
f 77 195 78
f 78 195 79
f 79 196 80
f 80 197 81
f 81 197 82
f 82 198 83
f 83 199 84
f 84 199 85
f 85 200 86
f 86 200 87
f 87 202 88
f 88 203 89
f 89 204 90
f 90 204 91
f 91 206 92
f 92 207 93
f 93 208 94
f 94 208 95
f 95 209 96
f 96 210 97
f 97 210 98
f 98 211 99
f 99 212 100
f 100 213 101
f 101 214 102
f 102 215 103
f 103 216 104
f 104 217 105
f 105 218 106
f 106 219 107
f 107 219 108
f 108 220 109
f 109 221 110
f 110 221 111
f 111 223 112
f 112 224 113
f 113 225 114
f 114 225 115
f 115 227 116
f 116 228 117
f 117 230 118
f 118 231 119
f 119 231 1
f 1 231 120
f 231 118 230
f 230 117 229
f 229 117 228
f 228 116 227
f 227 115 226
f 115 225 226
f 225 113 224
f 224 112 223
f 223 111 222
f 111 221 222
f 221 109 220
f 220 108 219
f 219 106 218
f 218 105 217
f 217 104 216
f 216 103 215
f 215 102 214
f 214 101 213
f 213 100 212
f 212 99 211
f 211 98 210
f 210 96 209
f 209 95 208
f 208 93 207
f 207 92 206
f 206 91 205
f 91 204 205
f 204 89 203
f 203 88 202
f 202 87 201
f 87 200 201
f 200 85 199
f 199 83 198
f 198 82 197
f 197 80 196
f 196 79 195
f 195 77 194
f 194 75 193
f 193 74 192
f 192 72 191
f 191 71 190
f 190 70 189
f 189 68 188
f 188 67 187
f 187 66 186
f 186 65 185
f 185 64 184
f 184 63 183
f 183 62 182
f 182 61 181
f 181 60 180
f 180 60 179
f 179 59 178
f 178 59 177
f 177 58 176
f 58 175 176
f 175 56 174
f 174 55 173
f 173 53 172
f 172 51 171
f 171 50 170
f 170 50 169
f 169 48 168
f 168 47 167
f 167 46 166
f 166 46 165
f 165 44 164
f 164 41 163
f 163 41 162
f 162 40 161
f 40 160 161
f 160 38 159
f 159 36 158
f 158 34 157
f 157 33 156
f 156 31 155
f 155 30 154
f 154 30 153
f 153 29 152
f 152 28 151
f 28 150 151
f 150 26 149
f 149 25 148
f 148 25 147
f 147 24 146
f 146 24 145
f 145 22 144
f 144 22 143
f 143 22 142
f 142 21 141
f 21 140 141
f 140 19 139
f 139 18 138
f 138 18 137
f 137 17 136
f 136 16 135
f 135 15 134
f 134 14 133
f 133 13 132
f 13 131 132
f 131 11 130
f 130 10 129
f 129 9 128
f 128 8 127
f 127 6 126
f 126 5 125
f 125 5 124
f 124 4 123
f 123 3 122
f 122 3 121
f 121 1 120
f 131 133 132
f 140 142 141
f 150 152 151
f 160 162 161
f 175 177 176
f 200 202 201
f 204 206 205
f 221 223 222
f 225 227 226
f 230 120 231
f 199 207 200
f 200 207 202
f 202 207 203
f 203 207 204
f 204 207 206
f 1 118 119
f 115 113 114
f 111 109 110
f 91 89 90
f 87 85 86
f 58 56 57
f 40 38 39
f 28 26 27
f 21 19 20
f 13 11 12
f 92 88 89
f 92 89 91
f 147 146 145 144 143 142 140 139 138 137 136 135 134 133 131 130 129 128 127 126 125 124 123 122 121 120 230 229 228 227 225 224 223 221 220 219 218 217 216 215 214 213 212 211 210 209 208 207 199 198 197 196 195 194 193 192 191 190 189 188 187 186 185 184 183 182 181 180 179 178 177 175 174 173 172 171 170 169 168 167 166 165 164 163 162 160 159 158 157 156 155 154 153 152 150 149 148
f 31 32 33 34 35 36 37 38 40 41 42 43 44 45 46 47 48 49 50 51 52 53 54 55 56 58 59 60 61 62 63 64 65 66 67 68 69 70 71 72 73 74 75 76 77 78 79 80 81 82 83 84 85 87 88 92 93 94 95 96 97 98 99 100 101 102 103 104 105 106 107 108 109 111 112 113 115 116 117 118 1 2 3 4 5 6 7 8 9 10 11 13 14 15 16 17 18 19 21 22 23 24 25 26 28 29 30
