<?xml version="1.0" standalone="no"?>
<!DOCTYPE svg PUBLIC "-//W3C//DTD SVG 20010904//EN"
 "http://www.w3.org/TR/2001/REC-SVG-20010904/DTD/svg10.dtd">
<svg version="1.0" xmlns="http://www.w3.org/2000/svg"
 width="512.000000pt" height="512.000000pt" viewBox="0 0 512.000000 512.000000"
 preserveAspectRatio="xMidYMid meet">

<g transform="translate(0.000000,512.000000) scale(0.100000,-0.100000)"
fill="#000000" stroke="none">
<path d="M2370 5113 c-379 -36 -661 -116 -980 -278 -378 -193 -717 -497 -965
-865 -104 -156 -232 -419 -294 -605 -49 -150 -89 -321 -113 -490 -17 -118 -17
-512 0 -630 42 -295 120 -553 242 -800 137 -280 272 -468 494 -691 221 -220
412 -357 681 -489 188 -92 309 -137 500 -185 500 -126 1002 -102 1490 71 149
53 407 182 540 271 365 243 667 578 866 963 181 348 271 694 286 1090 15 426
-73 832 -263 1214 -124 250 -263 447 -458 648 -216 224 -428 378 -711 518
-296 146 -572 225 -900 255 -102 9 -333 11 -415 3z m395 -303 c785 -72 1480
-553 1825 -1264 106 -217 166 -409 206 -661 25 -154 25 -496 0 -650 -40 -252
-100 -444 -206 -661 -223 -458 -585 -820 -1045 -1045 -216 -105 -408 -165
-660 -205 -154 -25 -496 -25 -650 0 -433 70 -808 240 -1135 514 -498 417 -800
1067 -800 1722 0 655 301 1302 800 1723 464 390 1069 582 1665 527z"/>
<path d="M2020 3823 c-8 -3 -26 -15 -38 -27 -53 -48 -52 -31 -52 -661 l0 -585
-103 0 c-80 0 -110 -4 -137 -19 -107 -56 -107 -210 0 -263 27 -14 60 -18 138
-18 l102 0 0 -169 0 -169 -107 -3 c-91 -4 -114 -8 -144 -27 -93 -57 -91 -195
3 -252 28 -17 51 -20 141 -20 l107 0 0 -189 c0 -179 1 -190 23 -221 35 -52 68
-72 119 -72 56 0 99 22 130 64 22 31 23 43 26 226 l4 192 347 0 c345 0 348 0
382 23 92 61 90 181 -4 251 -27 20 -41 21 -378 24 l-349 3 0 169 0 169 398 4
c432 4 442 5 578 67 158 71 301 208 378 362 70 140 90 232 84 393 -4 107 -10
144 -32 210 -84 246 -261 424 -511 512 l-80 28 -505 2 c-278 1 -512 -1 -520
-4z m1009 -312 c156 -48 294 -196 330 -352 6 -24 11 -78 11 -120 0 -230 -163
-431 -388 -478 -33 -7 -186 -11 -402 -11 l-350 0 0 490 0 490 369 0 c334 0
375 -2 430 -19z"/>
</g>
</svg>
