<?xml version="1.0" standalone="no"?>
<!DOCTYPE svg PUBLIC "-//W3C//DTD SVG 20010904//EN"
 "http://www.w3.org/TR/2001/REC-SVG-20010904/DTD/svg10.dtd">
<svg version="1.0" xmlns="http://www.w3.org/2000/svg"
 width="512.000000pt" height="512.000000pt" viewBox="0 0 512.000000 512.000000"
 preserveAspectRatio="xMidYMid meet">

<g transform="translate(0.000000,512.000000) scale(0.100000,-0.100000)"
fill="#000000" stroke="none">
<path d="M2270 4629 c-359 -37 -733 -188 -1020 -412 -96 -75 -253 -230 -330
-327 -241 -303 -388 -662 -430 -1052 -13 -125 -13 -416 0 -549 24 -242 89
-470 194 -684 273 -556 777 -951 1376 -1079 286 -61 686 -63 980 -5 770 153
1397 776 1555 1547 60 293 62 679 4 972 -103 517 -425 987 -881 1284 -251 163
-574 275 -887 306 -121 12 -439 11 -561 -1z m655 -333 c351 -64 647 -218 895
-466 257 -256 410 -548 476 -905 27 -144 27 -586 0 -730 -65 -353 -219 -648
-471 -901 -247 -248 -552 -408 -900 -470 -122 -22 -461 -30 -606 -15 -282 30
-541 121 -760 267 -394 264 -649 652 -735 1119 -27 144 -27 586 0 730 137 743
720 1294 1466 1385 119 14 529 5 635 -14z"/>
<path d="M2420 3504 c-295 -63 -515 -351 -497 -650 4 -68 12 -99 49 -185 l45
-104 -158 -5 c-171 -5 -186 -10 -233 -74 -29 -39 -29 -133 0 -172 49 -67 57
-69 269 -72 l194 -3 -16 -42 c-29 -74 -84 -148 -194 -256 -115 -114 -129 -141
-115 -216 9 -47 59 -102 104 -115 25 -8 257 -10 714 -8 665 3 677 3 704 24 53
39 69 71 69 134 0 63 -16 95 -69 134 -27 20 -40 21 -512 24 -266 1 -484 5
-484 7 0 3 13 26 30 53 35 57 75 160 85 219 l7 42 183 3 c201 3 210 6 259 72
29 39 29 133 0 172 -50 67 -56 69 -282 72 l-207 3 -27 67 c-15 37 -43 105 -64
151 -32 74 -36 89 -30 138 13 108 82 205 181 253 73 35 199 35 270 0 62 -31
123 -90 155 -153 28 -57 58 -83 111 -97 44 -12 98 -1 138 26 29 20 60 88 61
130 0 58 -67 173 -149 254 -158 157 -375 221 -591 174z"/>
</g>
</svg>
