INIT
            Warehouses: {"Chicken":3,"Tuna":0,"Potatoes":0,"Asparagus":3,"Milk":3,"Honey":3,"Paprika":3,"Garlic":3,"Water":1,"Lemon":1,"Tomatoes":1,"Pickles":3,"Feta":3,"Vinegar":1,"Rice":3,"Chocolate":3,"Emperor Chicken":1,"Fat Cat Chicken":3,"Princess Chicken":1,"Youth Sauce":0,"Spicy Sauce":3,"Omega Sauce":3,"Diamond Salad":3,"Ruby Salad":1,"Fries":0,"Smashed Potatoes":3,"Tuna Cake":3,"Fish In Water":3,"Irish Fish":3}
            Restaurant Budget: 500
            Daily Tax: 0

            START
            
command: => Buy,Julie Mirage,Fries => ERROR. Lack of ingredients
            Warehouse: {"Chicken":3,"Tuna":0,"Potatoes":0,"Asparagus":3,"Milk":3,"Honey":3,"Paprika":3,"Garlic":3,"Water":1,"Lemon":1,"Tomatoes":1,"Pickles":3,"Feta":3,"Vinegar":1,"Rice":3,"Chocolate":3,"Emperor Chicken":1,"Fat Cat Chicken":3,"Princess Chicken":1,"Youth Sauce":0,"Spicy Sauce":3,"Omega Sauce":3,"Diamond Salad":3,"Ruby Salad":1,"Fries":0,"Smashed Potatoes":3,"Tuna Cake":3,"Fish In Water":3,"Irish Fish":3}
            Restaurant Budget: 500
            All Transaction Tax: 0
            Trash: {}
            Tips: 0
            Time: 17
command: => Buy,Julie Mirage,Fries => ERROR. Lack of ingredients
            Warehouse: {"Chicken":3,"Tuna":0,"Potatoes":0,"Asparagus":3,"Milk":3,"Honey":3,"Paprika":3,"Garlic":3,"Water":1,"Lemon":1,"Tomatoes":1,"Pickles":3,"Feta":3,"Vinegar":1,"Rice":3,"Chocolate":3,"Emperor Chicken":1,"Fat Cat Chicken":3,"Princess Chicken":1,"Youth Sauce":0,"Spicy Sauce":3,"Omega Sauce":3,"Diamond Salad":3,"Ruby Salad":1,"Fries":0,"Smashed Potatoes":3,"Tuna Cake":3,"Fish In Water":3,"Irish Fish":3}
            Restaurant Budget: 500
            All Transaction Tax: 0
            Trash: {}
            Tips: 0
            Time: 25

    DAILY TAX: 0             
    Daily tips tax: 0 
    Daily most popular basic ingredient: 
    Daily most profitable dish: undefined - total: undefined
    Daily dishes total: 0
    Daily most recommended dish: 
           
                AUDIT END
INIT
            Warehouses: {"Chicken":3,"Tuna":0,"Potatoes":0,"Asparagus":3,"Milk":3,"Honey":3,"Paprika":3,"Garlic":3,"Water":1,"Lemon":1,"Tomatoes":1,"Pickles":3,"Feta":3,"Vinegar":1,"Rice":3,"Chocolate":3,"Emperor Chicken":1,"Fat Cat Chicken":3,"Princess Chicken":1,"Youth Sauce":0,"Spicy Sauce":3,"Omega Sauce":3,"Diamond Salad":3,"Ruby Salad":1,"Fries":0,"Smashed Potatoes":3,"Tuna Cake":3,"Fish In Water":3,"Irish Fish":3}
            Restaurant Budget: 500
            Daily Tax: 0

            START
            
command: => Buy,Julie Mirage,Fries => ERROR. Lack of ingredients
            Warehouse: {"Chicken":3,"Tuna":0,"Potatoes":0,"Asparagus":3,"Milk":3,"Honey":3,"Paprika":3,"Garlic":3,"Water":1,"Lemon":1,"Tomatoes":1,"Pickles":3,"Feta":3,"Vinegar":1,"Rice":3,"Chocolate":3,"Emperor Chicken":1,"Fat Cat Chicken":3,"Princess Chicken":1,"Youth Sauce":0,"Spicy Sauce":3,"Omega Sauce":3,"Diamond Salad":3,"Ruby Salad":1,"Fries":0,"Smashed Potatoes":3,"Tuna Cake":3,"Fish In Water":3,"Irish Fish":3}
            Restaurant Budget: 500
            All Transaction Tax: 0
            Trash: {}
            Tips: 0
            Time: 21
command: => Buy,Julie Mirage,Fries => ERROR. Lack of ingredients
            Warehouse: {"Chicken":3,"Tuna":0,"Potatoes":0,"Asparagus":3,"Milk":3,"Honey":3,"Paprika":3,"Garlic":3,"Water":1,"Lemon":1,"Tomatoes":1,"Pickles":3,"Feta":3,"Vinegar":1,"Rice":3,"Chocolate":3,"Emperor Chicken":1,"Fat Cat Chicken":3,"Princess Chicken":1,"Youth Sauce":0,"Spicy Sauce":3,"Omega Sauce":3,"Diamond Salad":3,"Ruby Salad":1,"Fries":0,"Smashed Potatoes":3,"Tuna Cake":3,"Fish In Water":3,"Irish Fish":3}
            Restaurant Budget: 500
            All Transaction Tax: 0
            Trash: {}
            Tips: 0
            Time: 23

    DAILY TAX: 0             
    Daily tips tax: 0 
    Daily most popular basic ingredient: 
    Daily most profitable dish: undefined - total: undefined
    Daily dishes total: 0
    Daily most recommended dish: 
           
                AUDIT END
