{
  "Regular customer budget": {
    "Julie Mirage": 100,
    "Elon Carousel": 50,
    "Adam Smith": 8000,
    "Alexandra Smith": 190,
    "Barbara Smith": 250,
    "Christian Donnovan": 500,
    "Bernard Unfortunate": 15
  }
}