{
  "memes": [
            {
              "slug": "doesnt-that-make-you-gay",
              "displayname": "Doesn't that make you gay?"
           },
            {
              "slug": "who-is-gay",
              "displayname": "Who is gay?"
           },
            {
              "slug": "why-are-you-gay",
              "displayname": "Why are you gay?"
           },
            {
              "slug": "you-are-gay",
              "displayname": "You are gay!"
           },
            {
              "slug": "huh-dhmis",
              "displayname": "Huh?"
           },
            {
              "slug": "you-cant-handle-the-truth",
              "displayname": "You can't handle the truth!"
           }
         ]
}
