

          F O S D E M   2 0 1 8   K E Y S I G N I N G   E V E N T

                            List of Participants


Here's what you have to do with this file:

(0) Verify that the key-id and the fingerprint of your key(s) on this list
    match with your expectation.

(1) Print this UTF-8 encoded file to paper.
    Use e.g. paps(1) from http://paps.sf.net/.
      paps --columns=2 --font=Monospace\ 5 ksp-fosdem2018.txt

(2) Compute this file's RIPEMD160 and SHA256 checksums.

      gpg --print-md RIPEMD160 ksp-fosdem2018.txt
      gpg --print-md SHA256 ksp-fosdem2018.txt

(3) Fill in the hash values on the printout.

(4) Bring the printout, a pen, and proof of identity to the keysigning event.
    You may find it useful to make a badge stating the number(s) of your key(s)
    on this list and the fact that you verified the fingerprints of your own
    key(s).  Also provide a place to mark that your hashes match.  Be on time
    to actually verify the hashes as they are announced!
    e.g.
       +----------------------------+
       | I am number 001            |
       | My key-id & fingerprint: ☑ |
       | The hashes:              ☐ |
       +----------------------------+

(5) Make sure that you finish your signing-work at home no later than
    Saturday 28 April 2018.  Please.

(6) Check https://fosdem.org/2018/keysigning for further announcements and
    updates.

(7) Please upload your keys to a reliable keyserver on a regular basis so we
    can make nice statistics!


RIPEMD160 Checksum: __ __ __ __  __ __ __ __  __ __ __ __  __ __ __ __

                    __ __ __ __  __ __ __ __  __ __ __ __  __ __ __ __

                    __ __ __ __  __ __ __ __                               [ ]


SHA256 Checksum:    __ __ __ __ __ __ __ __  __ __ __ __ __ __ __ __

                    __ __ __ __ __ __ __ __  __ __ __ __ __ __ __ __

                    __ __ __ __ __ __ __ __  __ __ __ __ __ __ __ __

                    __ __ __ __ __ __ __ __  __ __ __ __ __ __ __ __       [ ]


-----BEGIN KEY LIST-----

001  [ ] Fingerprint OK        [ ] ID OK
pub   rsa4096 2009-09-01 [C]
      31C8 D089 DDB6 96C6 F3C1  29C0 A9C8 6C8D D3AE 8D3A
uid  Johan van Selst
uid  Johan van Selst <johans@gletsjer.net>
uid  Johan van Selst <johans@stack.nl>
uid  Johan van Selst <johans@FreeBSD.org>
uid  Johan van Selst <johans@fosdem.org>
--------------------------------------------------------------------------------

002  [ ] Fingerprint OK        [ ] ID OK
pub   rsa4096 2012-11-05 [C] [expires: 2019-12-31]
      7420 DF86 BCE1 5A45 8DCE  9976 3927 8DA8 109E 6244
uid  Guilhem Moulin
uid  Guilhem Moulin <guilhem@fripost.org>
uid  Guilhem Moulin <guilhem.moulin@ens-lyon.org>
uid  Guilhem Moulin <guilhem@guilhem.org>
uid  Guilhem Moulin <guilhem@libreoffice.org>
uid  Guilhem Moulin <guilhem@debian.org>
--------------------------------------------------------------------------------

003  [ ] Fingerprint OK        [ ] ID OK
pub   rsa2048 2016-04-01 [SC] [expires: 2021-03-31]
      924E AD00 CA6B 5BDB F62F  CD76 88BA F781 81D7 83A6
uid  Pavel Zhukov <pzhukov@redhat.com>
--------------------------------------------------------------------------------

004  [ ] Fingerprint OK        [ ] ID OK
pub   rsa4096 2011-09-17 [SC]
      D137 F68B 7199 E293 57DD  32FA A162 1211 8ACB 4CC5
uid  Vladimir Vitkov <vvitkov@linux-bg.org>
uid  Vladimir Vitkov <vvitkov@netsecad.com>
uid  Vladimir Vitkov <vvitkov@supportbg.com>
--------------------------------------------------------------------------------

005  [ ] Fingerprint OK        [ ] ID OK
pub   rsa4096 2017-12-14 [SC]
      AB8A 6D37 ACD9 EFAB B6BD  0B1A 4EA5 68FC 3D6A D153
uid  Vladimir Vitkov <v.vitkov@nebosystems.eu>
--------------------------------------------------------------------------------

006  [ ] Fingerprint OK        [ ] ID OK
pub   rsa4096 2017-06-06 [SC] [expires: 2027-11-13]
      00CE 76D1 8349 60DF CE88  6DF8 EF4C A150 2CCB AB41
uid  Palmer Dabbelt <palmer@dabbelt.com>
uid  Palmer Dabbelt <palmer@sifive.com>
--------------------------------------------------------------------------------

007  [ ] Fingerprint OK        [ ] ID OK
pub   rsa4096 2017-12-05 [SC]
      8E44 D914 9F1B 49FB 45F6  AEE3 664F DB28 438A 27C0
uid  Dennis Eriksen (These pickles are making me thirsty) <dennis@eriksen.im>
--------------------------------------------------------------------------------

008  [ ] Fingerprint OK        [ ] ID OK
pub   rsa4096 2014-07-31 [SCA] [expires: 2019-07-30]
      F25D E77B 33FA EA16 DF6C  D5E9 BA3D 00C7 F5FE 3668
uid  André Ockers <andre@ockers.eu>
uid  André Ockers <ao@fsfe.org>
--------------------------------------------------------------------------------

009  [ ] Fingerprint OK        [ ] ID OK
pub   rsa4096 2017-11-28 [SC] [expires: 2021-11-27]
      B47A FE18 B23C 1B83 164E  0728 BEDC 5875 7EEC BCB9
uid  Lubor Jurena <jurena@skhosting.eu>
--------------------------------------------------------------------------------

010  [ ] Fingerprint OK        [ ] ID OK
pub   rsa4096 2013-02-13 [SC]
      5A5A 5AA0 B09A 7A36 BA2A  A8DC E66E 676C 0949 4C14
uid  Adrià García-Alzórriz <adria@fsfe.org>
uid  Adrià García-Alzórriz <adria@ilogic.io>
--------------------------------------------------------------------------------

011  [ ] Fingerprint OK        [ ] ID OK
pub   rsa4096 2017-06-13 [SC]
      9C86 4C21 E3A5 9C41 237B  FF66 11AF E464 45A7 941F
uid  Robin Vanhove <robin@robinvanhove.me>
uid  Robin Vanhove (Webteam wina) <robin@wina.be>
--------------------------------------------------------------------------------

012  [ ] Fingerprint OK        [ ] ID OK
pub   ed25519 2015-11-21 [SC]
      2555 2B89 D33A A6F6 8230  1E82 AE3A E456 4225 519A
uid  Lapo Luchini <lapo.luchini@gmail.com>
uid  Lapo Luchini <lapo@lapo.it>
--------------------------------------------------------------------------------

013  [ ] Fingerprint OK        [ ] ID OK
pub   rsa4096 2009-05-16 [SC]
      1651 5D1E D58A BCB0 36C3  1F59 83B0 B8C6 CBDA 71F0
uid  Lapo Luchini <lapo@lapo.it>
uid  Lapo Luchini <lapo.luchini@gmail.com>
uid  [jpeg image of size 12505]
--------------------------------------------------------------------------------

014  [ ] Fingerprint OK        [ ] ID OK
pub   rsa4096 2016-11-26 [SC]
      0638 3241 EA70 6B7B C9CC  3B97 280A 3AB7 E360 782B
uid  Ludovic Hirlimann <ludovic@hirlimann.net>
--------------------------------------------------------------------------------

015  [ ] Fingerprint OK        [ ] ID OK
pub   rsa4096 2015-10-14 [SC] [expires: 2018-08-15]
      7845 120B 07CB D8D6 ECE5  FF2B 2A17 43ED A91A 35B6
uid  Darshit Shah <darnir@gmail.com>
uid  Darshit Shah <s8dashah@stud.uni-saarland.de>
uid  Darshit Shah <darnir@gnu.org>
--------------------------------------------------------------------------------

016  [ ] Fingerprint OK        [ ] ID OK
pub   rsa4096 2017-10-17 [SC]
      6EDD 1280 D6D3 F7B9 0ECD  CC24 D6E7 2B81 14F2 C982
uid  Wei Tang <hi@that.world>
--------------------------------------------------------------------------------

017  [ ] Fingerprint OK        [ ] ID OK
pub   rsa4096 2017-12-24 [SC]
      753B 6ECF 2B45 8FF3 D19D  568C 1E0A 2883 97AE 739E
uid  Muharem Hrnjadovic <mh@cryptostars.co>
uid  Muharem Hrnjadovic <mh@token.vision>
uid  Muharem Hrnjadovic <muharem@linux.com>
--------------------------------------------------------------------------------

018  [ ] Fingerprint OK        [ ] ID OK
pub   rsa4096 2011-01-10 [SC]
      69E1 EE07 F7A6 AA8E 4A77  7B2A 7A06 8542 1E89 9042
uid  Marcus Frings <protagonist@gmx.net>
uid  Marcus Frings <marcus.frings@gmx.net>
uid  Marcus Frings <marcus.frings@rwth-aachen.de>
--------------------------------------------------------------------------------

019  [ ] Fingerprint OK        [ ] ID OK
pub   ed25519 2016-08-20 [SC]
      6C34 58EE 737C E22C 0EF9  FA3B E88F EBBE 202C E599
uid  Marcus Frings (Work) <marcus.frings@oc.rwth-aachen.de>
uid  Marcus Frings <marcus.frings@rwth-aachen.de>
--------------------------------------------------------------------------------

020  [ ] Fingerprint OK        [ ] ID OK
pub   dsa1024 2002-05-07 [SC]
      0138 DA92 EDFF B27D D270  F86D B475 E207 BAB5 8229
uid  Marcus Frings (Work) <marcus.frings@oc.rwth-aachen.de>
uid  Marcus Frings <marcus.frings@rwth-aachen.de>
--------------------------------------------------------------------------------

021  [ ] Fingerprint OK        [ ] ID OK
pub   dsa1024 2002-03-22 [SCA]
      53FC 5A87 27BE 1D30 FEB4  861A 948F D6A0 E10F 502E
uid  Marcus Frings <protagonist@gmx.net>
uid  Marcus Frings <webmaster@gothgoose.net>
uid  Marcus Frings <marcus.frings@gmx.net>
uid  Marcus Frings <marcus.frings@rwth-aachen.de>
--------------------------------------------------------------------------------

022  [ ] Fingerprint OK        [ ] ID OK
pub   rsa4096 2016-04-04 [SCA] [expires: 2021-04-03]
      620A A422 B12D 1E1D B5F3  3C32 190E 5F6B 3F57 C384
uid  Pontus Falk (SM0RUX) <pfalk@ax25.org>
uid  [jpeg image of size 21959]
--------------------------------------------------------------------------------

023  [ ] Fingerprint OK        [ ] ID OK
pub   rsa4096 2017-06-09 [SCA] [expires: 2022-06-08]
      44A1 4245 035E 0C7E 5986  9F25 040E 3718 2C34 0362
uid  Pontus Falk <pf@ax25.org>
--------------------------------------------------------------------------------

024  [ ] Fingerprint OK        [ ] ID OK
pub   rsa4096 2015-07-22 [SCA] [expires: 2025-07-19]
      1BD8 86F2 46FD 4908 79D4  E150 5A09 B457 6DE8 080E
uid  Paride Legovini <pl@ninthfloor.org>
uid  torn@autistici.org <torn@autistici.org>
uid  Paride Legovini <paride.legovini@gmail.com>
--------------------------------------------------------------------------------

025  [ ] Fingerprint OK        [ ] ID OK
pub   rsa4096 2011-10-31 [SC] [expires: 2018-08-30]
      C6DA 50D9 2B6A BE73 513B  0B30 B971 AFBB 606C 3402
uid  Grégoire Détrez
uid  Grégoire Détrez <gdetrez@crans.org>
uid  Grégoire Détrez <gregoire@fripost.org>
--------------------------------------------------------------------------------

026  [ ] Fingerprint OK        [ ] ID OK
pub   rsa4096 2015-07-19 [SC] [expires: 2018-07-16]
      FFCB D29F 3AFE D453 AE4B  9E32 1D40 FBA2 9EB3 9616
uid  Thomas Gerbet <thomas@gerbet.me>
uid  Thomas Gerbet <thomas.gerbet@enalean.com>
--------------------------------------------------------------------------------

027  [ ] Fingerprint OK        [ ] ID OK
pub   rsa4096 2010-04-13 [SC] [expires: 2018-09-06]
      F682 CDCC 39DC 0FEA E116  20B6 C746 CFA9 E74F A4B0
uid  Ashish SHUKLA (Lost Case) <ashish.is@lostca.se>
uid  Ashish SHUKLA <wahjava@gmail.com>
uid  Ashish SHUKLA <wahjava@googlemail.com>
uid  Ashish SHUKLA <wahjava.ml@gmail.com>
uid  Ashish SHUKLA <wahjava@members.fsf.org>
uid  Ashish SHUKLA <wahjava@users.sourceforge.net>
uid  Ashish SHUKLA <wah.java@yahoo.com>
uid  Ashish SHUKLA <wah_java@hotmail.com>
uid  Ashish SHUKLA <wahjava@member.fsf.org>
uid  Ashish SHUKLA (FreeBSD Committer Address) <ashish@FreeBSD.ORG>
uid  Ashish SHUKLA (Work Address) <ashish@automattic.com>
uid  Ashish SHUKLA (Lost Case) <abbe@lostca.se>
uid  Ashish SHUKLA (Personal Email) <ashish@members.fsf.org>
uid  [jpeg image of size 4655]
uid  Ashish SHUKLA <ashish@INET6.IN>
--------------------------------------------------------------------------------

028  [ ] Fingerprint OK        [ ] ID OK
pub   rsa4096 2013-04-14 [SC] [expires: 2024-03-14]
      8116 EA60 4039 1437 E28A  CCA8 A0B3 1F88 E812 3356
uid  William Hay (Main Address) <wish@dumain.com>
uid  William Hay (Gmail address) <wish.dumain@gmail.com>
uid  William Hay (Work Alias) <w.hay@ucl.ac.uk>
uid  William Hay (Work Address) <ccaawih@ucl.ac.uk>
uid  [jpeg image of size 9899]
uid  William Hay <wish@fsfe.org>
uid  William Hay <william.hay@emedlab.ac.uk>
--------------------------------------------------------------------------------

029  [ ] Fingerprint OK        [ ] ID OK
pub   rsa2048 2017-12-30 [SC]
      8258 AC51 8F78 9B59 3729  3683 D42B FFB6 1F23 C5BD
uid  Olivier Debouverie <odeb@aurantifolia.com>
--------------------------------------------------------------------------------

030  [ ] Fingerprint OK        [ ] ID OK
pub   rsa4096 2012-07-13 [SC]
      E5E5 2560 DD91 C556 DDBD  A5D0 2064 C536 41C2 5E5D
uid  Kurt Roeckx <kurt@roeckx.be>
--------------------------------------------------------------------------------

031  [ ] Fingerprint OK        [ ] ID OK
pub   rsa3744 2014-06-22 [SC] [expires: 2018-02-24]
      9AA9 BDB1 1BB1 B99A 2128  5A33 0664 A769 5426 5E8C
uid  Simon Josefsson <simon@josefsson.org>
uid  Simon Josefsson <simon@yubico.com>
--------------------------------------------------------------------------------

032  [ ] Fingerprint OK        [ ] ID OK
pub   rsa4096 2017-07-22 [SC] [expires: 2022-07-22]
      D579 2C4C 8C6F 8DE8 3779  49D1 F483 80B2 EC8F 9449
uid  Tom Yates <madhatter@teaparty.net>
uid  Tom Yates <tyates@gatekeeper.ltd.uk>
uid  [jpeg image of size 1690]
uid  Tom Yates <tom@yates.me.uk>
--------------------------------------------------------------------------------

033  [ ] Fingerprint OK        [ ] ID OK
pub   rsa4096 2014-10-23 [SC]
      AC41 128E C3F5 FB23 DBB3  ACA8 217D 974B FFEC 420B
uid  Azhagu Selvan <tamizhgeek@gmail.com>
--------------------------------------------------------------------------------

034  [ ] Fingerprint OK        [ ] ID OK
pub   rsa4096 2013-01-17 [SC] [expires: 2018-10-08]
      3C9D 54A4 7575 C026 FB17  FD26 B79A 3C16 A0C4 F296
uid  Dominik George (Natureshadow) <nik@naturalnet.de>
uid  Dominik George (pro parity IT-Service) <dominik.george@proparity.de>
uid  Dominik George (Bergische Universität Wuppertal) <dominik.george@uni-wuppertal.de>
uid  Dominik George (FrOSCon e.V.) <dominik.george@froscon.org>
uid  Dominik George (Teckids e.V.) <dominik.george@teckids.org>
uid  [jpeg image of size 3957]
uid  Dominik George (Fellowship of the FSFE) <natureshadow@fsfe.org>
uid  Dominik George (Privat; Fallback) <nik@bessermailer.de>
uid  Dominik George (Teckids e.V.; XMPP) <nik@mercurius.teckids.org>
uid  Dominik George (Piratenpartei Deutschland - Bundes-IT) <dominik.george@it.piratenpartei.de>
--------------------------------------------------------------------------------

035  [ ] Fingerprint OK        [ ] ID OK
pub   rsa4096 2017-01-15 [SC] [expires: 2020-01-15]
      0BE0 51B2 12A5 1464 0102  0354 8F39 C8EF BC97 9206
uid  Anton Marchukov <amarchuk@redhat.com>
uid  Anton Marchukov <anton@marchukov.com>
uid  Anton Marchukov <anton@martchukov.com>
uid  Anton Marchukov <anton.marchukov@eesti.ee>
uid  [jpeg image of size 2962]
--------------------------------------------------------------------------------

036  [ ] Fingerprint OK        [ ] ID OK
pub   rsa4096 2015-03-27 [SC]
      8CD7 227D A467 D3ED 404F  6EEF DB59 0F73 9E5A C458
uid  Joseph Graham <joseph.graham@gmx.com>
uid  Joseph Graham (http://www.xylon.me.uk) <joseph@xylon.me.uk>
--------------------------------------------------------------------------------

037  [ ] Fingerprint OK        [ ] ID OK
pub   rsa4096 2013-05-27 [SCEA] [expires: 2018-05-28]
      962B 7979 A01D CE54 B18D  4514 0604 F490 CA40 55BC
uid  Laurent Desgrange <laurent@desgrange.net>
uid  Laurent Desgrange <ldesgrange@microworld.org>
uid  [jpeg image of size 11831]
uid  Laurent Desgrange <laurent@babyloan.org>
--------------------------------------------------------------------------------

038  [ ] Fingerprint OK        [ ] ID OK
pub   rsa4096 2016-05-15 [C] [expires: 2020-05-15]
      C4DD 695F A713 8F24 2AA1  5638 5849 7EE5 1D5D 74A5
uid  Thomas Deutschmann <thomas@deutschmann.biz>
uid  Thomas Deutschmann <whissi@whissi.de>
uid  Thomas Deutschmann <whissi@gentoo.org>
--------------------------------------------------------------------------------

039  [ ] Fingerprint OK        [ ] ID OK
pub   rsa4096 2017-01-01 [C] [expires: 2018-12-31]
      6539 09A2 F0E3 7C10 6F5F  AF54 6C88 57E0 D8E8 F074
uid  Wiktor Kwapisiewicz <wiktor@metacode.biz>
uid  [unknown attribute of size 83]
--------------------------------------------------------------------------------

040  [ ] Fingerprint OK        [ ] ID OK
pub   rsa4096 2011-04-19 [SC]
      C22C 4F08 6BA6 3ADE 5FE4  8496 23BA D351 C916 B67D
uid  Otto de Voogd (ottodv) <otto@de-voogd.com>
uid  [jpeg image of size 17703]
--------------------------------------------------------------------------------

041  [ ] Fingerprint OK        [ ] ID OK
pub   rsa4096 2017-12-17 [SC] [expires: 2037-12-12]
      C700 9C53 D67B B7FC 8FD6  D93E E5E1 B1D4 9ACC 288C
uid  Rodolpho Henrique Orlovsky Eckhardt <rod@lpho.de>
uid  Rodolpho Eckhardt <rodolpho.eckhardt@gmail.com>
uid  Rodolpho Eckhardt <rod@lpho.de>
uid  Rodolpho Eckhardt <rodolpho@onoeck.de>
uid  Rodolpho Eckhardt <rodolpho@eckhardt.com.br>
uid  [jpeg image of size 3726]
--------------------------------------------------------------------------------

042  [ ] Fingerprint OK        [ ] ID OK
pub   rsa4096 2015-09-14 [SC] [expires: 2019-09-14]
      3D98 3C52 EB85 980C 46A5  6090 3573 1255 9D1E 064B
uid  Ondřej Nový <novy@ondrej.org>
uid  Ondřej Nový <ondrej.novy@firma.seznam.cz>
uid  Ondřej Nový <onovy@debian.org>
--------------------------------------------------------------------------------

043  [ ] Fingerprint OK        [ ] ID OK
pub   rsa4096 2013-12-03 [SC]
      6C5D EDBB 2F28 5B25 4AEF  8AF0 708B 5F3E F3B2 CEDE
uid  François Magimel <magimel.francois@gmail.com>
uid  François Magimel <francois.magimel@alumni.enseeiht.fr>
uid  François Magimel <francois.magimel@inpt.fr>
uid  François Magimel <linkid@inp-net.eu.org>
--------------------------------------------------------------------------------

044  [ ] Fingerprint OK        [ ] ID OK
pub   rsa4096 2014-02-07 [SC] [expires: 2018-12-31]
      8467 53CB 1921 3142 C56D  C918 F5C8 3C05 D9CE EEEE
uid  Chris Boot <bootc@boo.tc>
uid  Chris Boot <bootc@bootc.net>
uid  Chris Boot <chris.boot@gmail.com>
uid  Chris Boot <bootc@debian.org>
--------------------------------------------------------------------------------

045  [ ] Fingerprint OK        [ ] ID OK
pub   dsa1024 2005-05-28 [SCA]
      F0F3 E19E A598 0C2A 2594  E16C 9767 6CE1 C337 BA05
uid  Joerg Plate <plate@patterner.eu>
uid  Joerg Plate <plate@dymer.de>
uid  Joerg Plate <plate@patterner.de>
uid  Joerg Plate <plate@psyche.kn-bremen.de>
uid  Joerg Plate <patterner@fastmail.fm>
uid  Joerg Plate <patterner@gmail.com>
uid  Joerg Plate <plate@studiesinwords.eu>
uid  Joerg Plate <patterner@cpan.org>
uid  JÃ¶rg Plate <plate@patterner.eu>
uid  [jpeg image of size 12853]
--------------------------------------------------------------------------------

046  [ ] Fingerprint OK        [ ] ID OK
pub   rsa4096 2013-02-18 [SC] [expires: 2019-04-01]
      569D E362 A219 F26B 2C0F  3B7A 25BF 484F 08AB 4849
uid  Niels Laukens
uid  Niels Laukens <niels@dest-unreach.be>
uid  Niels Laukens (FOSDEM) <niels@fosdem.org>
uid  Niels Laukens (VRT) <niels.laukens@vrt.be>
--------------------------------------------------------------------------------

047  [ ] Fingerprint OK        [ ] ID OK
pub   rsa4096 2018-01-05 [SC] [expires: 2022-01-05]
      8CE1 E979 5763 5169 ADB4  5FCB 5EA0 256A 5E3A 1293
uid  Camil Blanaru <camil@edka.io>
--------------------------------------------------------------------------------

048  [ ] Fingerprint OK        [ ] ID OK
pub   rsa4096 2015-01-29 [SC]
      A9EA 9081 724F FAE0 484C  35A1 A81C EA22 BC8C 7E2E
uid  Luca Boccassi <luca.boccassi@gmail.com>
uid  Luca Boccassi <bluca@debian.org>
--------------------------------------------------------------------------------

049  [ ] Fingerprint OK        [ ] ID OK
pub   rsa4096 2012-09-18 [SC] [expires: 2019-07-21]
      D902 CB1C 9FC4 12BB AD8C  E259 92BA 3F17 56C2 7D99
uid  Benoît SÉRIE <bserie@evolix.fr>
--------------------------------------------------------------------------------

050  [ ] Fingerprint OK        [ ] ID OK
pub   rsa4096 2009-05-10 [SC]
      0C01 6D3B D119 5D30 1058  37CC 4497 5278 B861 2B5D
uid  Gregory Colpart <reg@evolix.ca>
uid  Gregory Colpart <reg@gcolpart.com>
uid  Gregory Colpart (Evolix) <reg@evolix.fr>
uid  Gregory Colpart <reg@debian.org>
--------------------------------------------------------------------------------

051  [ ] Fingerprint OK        [ ] ID OK
pub   rsa4096 2017-08-20 [SC] [expires: 2021-08-20]
      08CD 972A 9475 DCF8 125D  CFBE B888 FBB1 5121 A895
uid  Roberto Franceschini <franceschini.roberto@gmail.com>
uid  [jpeg image of size 184530]
--------------------------------------------------------------------------------

052  [ ] Fingerprint OK        [ ] ID OK
pub   rsa4096 2018-01-08 [SC] [expires: 2022-01-07]
      77F4 2A7A 3441 EE51 2FD0  85E7 905C F2C4 2A40 664D
uid  Remus CURSARU <remus.cm@gmail.com>
--------------------------------------------------------------------------------

053  [ ] Fingerprint OK        [ ] ID OK
pub   rsa4096 2016-07-07 [SC] [expires: 2019-07-07]
      A034 8002 3348 2A63 1C44  E885 9303 85BC 018D 15F1
uid  Haris Sehic <hsehic@suse.com>
uid  Haris Sehic <hsehic@suse.de>
--------------------------------------------------------------------------------

054  [ ] Fingerprint OK        [ ] ID OK
pub   rsa4096 2016-06-20 [SC] [expires: 2019-06-20]
      58EE 4C81 08AD 737B 3E7F  E272 DD06 EEE9 F65F B20A
uid  Haris Sehic <haris@sehic.de>
--------------------------------------------------------------------------------

055  [ ] Fingerprint OK        [ ] ID OK
pub   rsa4096 2016-01-24 [SC]
      6E2C EED7 8082 C59F 2F97  3CF0 5F6A B448 2F2F A8AF
uid  Jens Stomber <jens.stomber@mailbox.org>
uid  Jens Stomber <zombb@fsfe.org>
uid  Jens Stomber <jens.stomber@piratenpartei.de>
--------------------------------------------------------------------------------

056  [ ] Fingerprint OK        [ ] ID OK
pub   rsa4096 2013-02-04 [SC]
      BD84 DE71 F493 DF68 14B0  1672 54ED C916 09BC 9183
uid  Christian Hesse <Christi@n-Hes.se>
uid  Christian Hesse <mail@eworm.de>
--------------------------------------------------------------------------------

057  [ ] Fingerprint OK        [ ] ID OK
pub   rsa2048 2011-08-12 [SC]
      02FD 1C7A 934E 6145 4584  9F19 A623 4074 498E 9CEE
uid  Christian Hesse (Arch Linux Package Signing) <arch@eworm.de>
--------------------------------------------------------------------------------

058  [ ] Fingerprint OK        [ ] ID OK
pub   rsa4096 2009-09-22 [SC]
      9DDB 6CAD 455D 6311 2CAD  26D8 CA49 9C41 0B3C 3354
uid  Simon Eisenmann <simon@longsleep.org>
uid  Simon Eisenmann <s.eisenmann@kopano.com>
uid  Simon Eisenmann <longsleep@gmail.com>
--------------------------------------------------------------------------------

059  [ ] Fingerprint OK        [ ] ID OK
pub   rsa8192 2015-11-08 [C] [expires: 2023-01-01]
      4D17 3ABF 35A8 1741 B7B0  3BEB 1941 9BFA 96F4 D0E8
uid  Selene Rabea Feigl <kontakt@selene-feigl.de>
--------------------------------------------------------------------------------

060  [ ] Fingerprint OK        [ ] ID OK
pub   rsa4096 2017-11-10 [SCEA]
      522B E547 59BD 6BFF 47C8  BB97 DABB 2E09 892A 9CF2
uid  Vladimir Eremin (aka yottatsa) <me@yottatsa.name>
uid  Vladimir Eremin <yottatsa@keybase.io>
uid  [jpeg image of size 4665]
--------------------------------------------------------------------------------

061  [ ] Fingerprint OK        [ ] ID OK
pub   rsa4096 2009-05-10 [SC]
      4CB7 FE1E 280E CC90 F29A  597E 6E60 8B63 7D89 67E9
uid  Miguel Landaeta <miguel@miguel.cc>
uid  Miguel Landaeta <nomadium@gmail.com>
uid  Miguel Landaeta (LDC) <miguel@ldc.usb.ve>
uid  Miguel Landaeta (Debian) <nomadium@debian.org>
--------------------------------------------------------------------------------

062  [ ] Fingerprint OK        [ ] ID OK
pub   rsa4096 2011-06-20 [SC]
      A8ED BE99 50EC 1F96 7F33  60CB FB3D 2583 3B6A AFF8
uid  Miguel Landaeta <miguel@miguel.cc>
--------------------------------------------------------------------------------

063  [ ] Fingerprint OK        [ ] ID OK
pub   rsa4096 2017-03-05 [SC] [expires: 2019-03-05]
      C680 7B57 665D 3F42 1AFA  03DA 3F7E 192B 1349 B484
uid  Vojtech Myslivec <vojtech@xmyslivec.cz>
uid  Vojtech Myslivec (Logicworks) <vojtech.myslivec@logicworks.cz>
uid  Vojtech Myslivec (CZ.NIC, z.s.p.o.) <vojtech.myslivec@nic.cz>
uid  Vojtech Myslivec (SUMA spol. s r.o.) <vojtech.myslivec@sumanet.cz>
--------------------------------------------------------------------------------

064  [ ] Fingerprint OK        [ ] ID OK
pub   rsa4096 2017-01-03 [C] [expires: 2019-12-31]
      DB44 2DE1 CC36 212A 8455  2FB9 4C57 F4A6 ABDE 823C
uid  Mesar Hameed
uid  Mesar Hameed <mesar.hameed@gmail.com>
uid  Mesar Hameed <m.m.hameed@bath.ac.uk>
--------------------------------------------------------------------------------

065  [ ] Fingerprint OK        [ ] ID OK
pub   rsa4096 2016-07-06 [SC] [expires: 2019-01-10]
      EA33 8528 809E 9749 E2C3  0643 79E9 24EB EDA7 F3FD
uid  Alexander John Fisher <alex@linfratech.co.uk>
--------------------------------------------------------------------------------

066  [ ] Fingerprint OK        [ ] ID OK
pub   rsa4096 2016-01-24 [SC] [expires: 2020-01-23]
      CF9B 1408 4750 916C 4D8F  CACC 39E4 5FB6 0141 31E4
uid  Justin W. Flory <me@justinwflory.com>
uid  Justin W. Flory <jflory7@gmail.com>
uid  Justin W. Flory (CrystalCraftMC) <admin@crystalcraftmc.com>
uid  Justin W. Flory (SpigotMC) <jflory7@spigotmc.org>
uid  Justin W. Flory (Fedora Project) <jflory7@fedoraproject.org>
uid  Justin W. Flory <jflory@me.com>
uid  Justin W. Flory (git) <git@jwf.io>
uid  Justin W. Flory (Fedora Project) <jwf@fedoraproject.org>
uid  Justin W. Flory (Opensource.com) <jflory@opensource.com>
uid  Justin W. Flory (Rochester Institute of Technology) <jwf@mail.rit.edu>
--------------------------------------------------------------------------------

067  [ ] Fingerprint OK        [ ] ID OK
pub   rsa4096 2018-01-10 [SC] [expires: 2020-01-10]
      4C0B 4907 0B14 035A 0E0F  8515 8D9E 7BF2 7CBC 2AA1
uid  Justin W. Flory (UNICEF) <jflory@unicef.org>
--------------------------------------------------------------------------------

068  [ ] Fingerprint OK        [ ] ID OK
pub   rsa4096 2012-09-28 [SC]
      B839 FA60 3D8D FD4E 90C7  FFF0 9E21 1F1F 89F4 CE7B
uid  Ismael Olea (Main address) <ismael@olea.org>
uid  Ismael Olea <ismael.olea@gmail.com>
uid  [jpeg image of size 5347]
uid  keybase.io/olea <olea@keybase.io>
uid  Ismael Olea <ismael@olea.es>
uid  Ismael Olea <ismael.olea@grupoadarve.es>
uid  Ismael Olea <olea@gnome.org>
uid  Ismael Olea <olea@fedoraproject.org>
uid  Ismael Olea <ismael.olea@cacharreo.club>
--------------------------------------------------------------------------------

069  [ ] Fingerprint OK        [ ] ID OK
pub   rsa4096 2014-02-08 [SC] [expires: 2020-01-11]
      F42D 259A 35AD BDC8 5D9B  FF3E 555F 5B15 CCC6 6677
uid  Stéphane Bortzmeyer (Main key) <stephane@bortzmeyer.org>
uid  Stéphane Bortzmeyer (Work address) <bortzmeyer@nic.fr>
uid  Stéphane Bortzmeyer <stephane@sources.org>
uid  TextSecure fingerprint (05 d6 3b dc b7 e4 d7 69 2f f6 24 d5 51 31 88 2f a5 59 ae 96 e0 fb a5 75 ab e6 6c 64 ca e9 bb 6a 77) <BdY73Lfk12kv9iTVUTGIL6VZrpbg+6V1q+ZsZMrpu2p3@base64>
--------------------------------------------------------------------------------

070  [ ] Fingerprint OK        [ ] ID OK
pub   rsa4096 2018-01-10 [SC] [expires: 2019-07-04]
      EEC0 DB85 8E66 C0DA 7062  0AC0 7DBD 6AC7 4DE2 9324
uid  Andreas Kemnade <akemnade@t-online.de>
uid  Andreas Kemnade <andreas@kemnade.info>
--------------------------------------------------------------------------------

071  [ ] Fingerprint OK        [ ] ID OK
pub   rsa4096 2014-01-29 [SC] [expires: 2071-01-30]
      27F3 EA26 8A97 867E AF0B  D05C 0F38 6284 C03A 1162
uid  Philip Estes <estesp@gmail.com>
uid  [jpeg image of size 52640]
uid  Phil Estes <estesp@linux.vnet.ibm.com>
uid  Phil Estes <estesp@us.ibm.com>
--------------------------------------------------------------------------------

072  [ ] Fingerprint OK        [ ] ID OK
pub   rsa4096 2018-01-11 [SCEA] [expires: 2028-01-09]
      2271 8795 79C2 9A50 DF1E  61EC 4D71 0A40 7C10 ABC9
uid  Federico Campoli <4thdoctor.gallifrey@gmail.com>
--------------------------------------------------------------------------------

073  [ ] Fingerprint OK        [ ] ID OK
pub   rsa4096 2013-08-17 [SC]
      E5FD A3CE 1B3F 9DFA 2AD4  7FB3 2423 7D62 9F47 395D
uid  Vittorio Roberto Alfieri <me@rebtoor.com>
uid  [jpeg image of size 6298]
uid  Vittorio Roberto Alfieri <roberto@alfieri.eu>
--------------------------------------------------------------------------------

074  [ ] Fingerprint OK        [ ] ID OK
pub   rsa4096 2016-12-21 [SC]
      79F7 3086 7D16 F2DB ADA7  CD86 6FDC E487 2985 F845
uid  Alexandre Badalo <alexandre.badalo@sapo.pt>
uid  Alexandre Badalo <alexandre9099@gmail.com>
--------------------------------------------------------------------------------

075  [ ] Fingerprint OK        [ ] ID OK
pub   rsa2048 2014-06-16 [SCA] [expires: 2019-06-15]
      4110 045E E7A4 32D6 7AFA  C8C8 5403 C546 4810 BC26
uid  Max Inden <max.inden@coreos.com>
uid  Max Inden <IndenML@gmail.com>
--------------------------------------------------------------------------------

076  [ ] Fingerprint OK        [ ] ID OK
pub   rsa4096 2017-09-04 [SCA] [expires: 2022-09-03]
      1A30 1C09 6F76 B635 92F2  1E33 D05B 1689 2058 BCF8
uid  Babis Chalios <bchalios@lillyput.xyz>
--------------------------------------------------------------------------------

077  [ ] Fingerprint OK        [ ] ID OK
pub   rsa4096 2016-11-18 [SC]
      84B1 4ED3 D687 655A 8EF8  233A 6957 14BD 1BBC 5F4C
uid  Igor Gnatenko <i.gnatenko.brain@gmail.com>
uid  Igor Gnatenko (Red Hat) <ignatenko@redhat.com>
uid  Igor Gnatenko (Fedora Project) <ignatenkobrain@fedoraproject.org>
uid  Igor Gnatenko (GNOME Foundation) <ignatenko@gnome.org>
uid  [jpeg image of size 5236]
uid  [jpeg image of size 4841]
--------------------------------------------------------------------------------

078  [ ] Fingerprint OK        [ ] ID OK
pub   rsa4096 2011-09-18 [C]
      9B68 6F14 144D 2B08 9B10  F2AD 98AA B6E3 1A01 FA1B
uid  Andreas Sewe (born on 1980-12-30 in Twistringen, DE)
uid  Andreas Sewe <sewe@st.informatik.tu-darmstadt.de>
uid  Andreas Sewe <andreas.sewe@codetrails.com>
uid  Andreas Sewe <andreas.sewe@cs.tu-darmstadt.de>
--------------------------------------------------------------------------------

079  [ ] Fingerprint OK        [ ] ID OK
pub   rsa4096 2014-08-03 [SC]
      FB8A CFA7 8C72 6089 C38A  D026 9605 A109 8C63 B92A
uid  Edward Betts <edward@4angle.com>
uid  Edward Betts <edwardbetts@gmail.com>
uid  Edward Betts <edward@debian.org>
--------------------------------------------------------------------------------

080  [ ] Fingerprint OK        [ ] ID OK
pub   rsa4096 2017-04-19 [SC] [expires: 2032-04-15]
      65A5 F311 1F45 12B5 67A6  09B4 A508 F1DB 325E E1C0
uid  Simon Leinen (SWITCH) <simon.leinen@switch.ch>
uid  Simon Leinen <simon@leinen.ch>
uid  Simon Leinen <simon.leinen@gmail.com>
--------------------------------------------------------------------------------

081  [ ] Fingerprint OK        [ ] ID OK
pub   rsa4096 2018-01-14 [SC]
      91D7 7B9B 1C48 35A3 76CE  105A 6ECE F086 2AA7 E758
uid  Alexander Schremmer <alex@alexanderweb.de>
--------------------------------------------------------------------------------

082  [ ] Fingerprint OK        [ ] ID OK
pub   dsa1024 2003-03-19 [SCA]
      9770 C138 6D1E DC4E C6F3  CC01 69E4 6276 4FC5 9E44
uid  Alexander Schremmer <alex@alexanderweb.de>
--------------------------------------------------------------------------------

083  [ ] Fingerprint OK        [ ] ID OK
pub   rsa2048 2013-12-11 [SC] [expires: 2018-12-31]
      542A 1CCE DE53 3981 1386  54E2 130B C150 4141 B72C
uid  Peter Wuyts <wuytsp@gmail.com>
--------------------------------------------------------------------------------

084  [ ] Fingerprint OK        [ ] ID OK
pub   rsa4096 2018-01-08 [SC]
      1420 74F4 9FC4 D464 43CD  4D94 B40F 31A4 0000 29BA
uid  Peter Wuyts <wuytsp@gmail.com>
--------------------------------------------------------------------------------

085  [ ] Fingerprint OK        [ ] ID OK
pub   rsa4096 2015-08-07 [SCE] [expires: 2018-08-22]
      6FCA F653 253A C2FB 2997  ED7E 1C12 6034 BC5B 9BDA
uid  Ruben Maes <ruben@janmaes.com>
--------------------------------------------------------------------------------

086  [ ] Fingerprint OK        [ ] ID OK
pub   rsa4096 2011-05-07 [SC] [expires: 2019-01-15]
      77DD A1B6 8D04 792A 8F85  D855 235E 5C8C F5E8 DFFB
uid  Marcel van der Boom (HS-Development BV) <marcel@hsdev.com>
uid  Marcel van der Boom (Backup email address, for special circumstances) <mvanderboom@gmail.com>
uid  [jpeg image of size 3720]
--------------------------------------------------------------------------------

087  [ ] Fingerprint OK        [ ] ID OK
pub   rsa4096 2013-10-08 [SC] [expires: 2018-07-14]
      A28B F40C 3E55 1372 662D  14F7 41AA E7DC CA3D 8351
uid  Efraim Flashner <efraim@flashner.co.il>
uid  William Flashner <themillak@gmail.com>
uid  Efraim Flashner <efraim.flashner@gmail.com>
--------------------------------------------------------------------------------

088  [ ] Fingerprint OK        [ ] ID OK
pub   rsa2048 2015-01-01 [SC] [expires: 2020-01-01]
      8FCE 4A83 176F 30DF F26C  6AE3 26CA 0FA4 3D67 FCB1
uid  François Cartegnie <fcartegnie@free.fr>
uid  François Cartegnie (VideoLAN) <fcvlcdev@free.fr>
uid  Francois Cartegnie <fcartegnie@free.fr>
uid  François Cartegnie (VideoLAN) <fcartegnie@videolan.org>
--------------------------------------------------------------------------------

089  [ ] Fingerprint OK        [ ] ID OK
pub   rsa4096 2017-01-22 [SC] [expires: 2019-01-22]
      6731 DDC2 8357 BEC3 8E34  2AAF BF33 4213 F5C5 CA03
uid  Alessandro Menti <alessandro.menti@alessandromenti.it>
uid  Alessandro Menti <alessandro.menti@hotmail.it>
uid  [jpeg image of size 5165]
--------------------------------------------------------------------------------

090  [ ] Fingerprint OK        [ ] ID OK
pub   rsa2048 2016-07-16 [SC]
      F9FA 8E38 CA9E E0AA 3E50  5ABE 950B 0EE1 3825 6E78
uid  Gwan-gyeong Mun <elongbug@gmail.com>
--------------------------------------------------------------------------------

091  [ ] Fingerprint OK        [ ] ID OK
pub   rsa4096 2017-01-06 [SC] [expires: 2020-01-06]
      6210 3B84 8B58 4372 0E1A  19B5 60FD E28C 0B52 A622
uid  Ben Companjen <ben@companjen.name>
uid  Ben Companjen <b.a.companjen@alumnus.utwente.nl>
--------------------------------------------------------------------------------

092  [ ] Fingerprint OK        [ ] ID OK
pub   rsa4096 2018-01-04 [C] [expires: 2019-01-04]
      838C A1A8 DA31 C8B4 829A  1D68 0A80 9342 4B5A 021A
uid  Matthieu Foré <dmesgrep@perso.be>
--------------------------------------------------------------------------------

093  [ ] Fingerprint OK        [ ] ID OK
pub   rsa4096 2016-12-08 [SC]
      B88F 1697 9A97 8812 8193  4559 113E 24A4 E399 AF1A
uid  Remi Voirin <remi@lags.is>
uid  Remi Voirin <remi.voirin@cern.ch>
--------------------------------------------------------------------------------

094  [ ] Fingerprint OK        [ ] ID OK
pub   rsa4096 2009-07-01 [SC]
      C331 BA3F 75FB 723B 5873  785B 06EA A066 E397 832F
uid  Luca Capello <luca@pca.it>
uid  Luca Capello <gismo@debian.org>
uid  Luca Capello <luca.capello@infomaniak.ch>
uid  Luca Capello <luca.capello@infomaniak.com>
--------------------------------------------------------------------------------

095  [ ] Fingerprint OK        [ ] ID OK
pub   rsa4096 2015-01-12 [SC]
      7C4A FD61 D8AA E757 0796  A517 2209 D690 2F96 9C95
uid  Marcus Meißner (german spelling) <meissner@suse.de>
uid  Marcus Meissner (SUSE) <meissner@suse.com>
uid  Marcus Meissner (SUSE) <meissner@suse.de>
--------------------------------------------------------------------------------

096  [ ] Fingerprint OK        [ ] ID OK
pub   rsa4096 2016-05-29 [SCA] [expires: 2022-05-28]
      DF01 2247 BFC6 5501 AFF2  8445 0C24 B841 C7DD BAAF
uid  Moritz Schlarb <moschlar@metalabs.de>
uid  Moritz Schlarb <mail@moritz-schlarb.de>
uid  Moritz Schlarb <moschlar@keybase.io>
uid  Moritz Schlarb <schlarbm@uni-mainz.de>
uid  [jpeg image of size 23783]
--------------------------------------------------------------------------------

097  [ ] Fingerprint OK        [ ] ID OK
pub   rsa4096 2017-12-21 [SC] [expires: 2020-12-20]
      0136 3E28 572B 32D1 CC33  E6F7 5FCB B28C 9233 3B00
uid  Stefan Potyra <Stefan.Potyra@elektrobit.com>
uid  [jpeg image of size 2761]
--------------------------------------------------------------------------------

098  [ ] Fingerprint OK        [ ] ID OK
pub   rsa4096 2014-03-03 [SC] [expires: 2020-05-05]
      84E7 2432 A5B1 6E9C 1ACE  8D24 1DB9 77CD CF06 650F
uid  Stefan Potyra <stefan@potyra.de>
--------------------------------------------------------------------------------

099  [ ] Fingerprint OK        [ ] ID OK
pub   rsa2048 2015-05-28 [SC] [expires: 2020-01-18]
      4175 ABAA 8AF0 F167 1877  8E40 81B7 761D 894E 59A9
uid  Bart De Roy <de.roy.bart@gmail.com>
--------------------------------------------------------------------------------

100  [ ] Fingerprint OK        [ ] ID OK
pub   rsa4096 2013-10-09 [SC]
      E456 CE03 C478 05C3 DC5A  9364 EDC8 C824 0F68 8E68
uid  Héctor Romojaro Gómez <hector.romojaro@gmail.com>
--------------------------------------------------------------------------------

101  [ ] Fingerprint OK        [ ] ID OK
pub   rsa4096 2016-12-10 [SC]
      0E02 3ECF 628E 6F76 110B  4425 98A3 FEE4 1FCA 0620
uid  Francesco <francesco.pan001@gmail.com>
uid  fmount <fmount9@autistici.org>
--------------------------------------------------------------------------------

102  [ ] Fingerprint OK        [ ] ID OK
pub   rsa4096 2016-10-11 [SC] [expires: 2026-10-09]
      2EA9 731D DF60 0EF5 2A53  AD48 2A56 2388 20F5 F22E
uid  Roman Sokolkov (My Giant Swarm email) <roman@giantswarm.io>
uid  Roman Sokolkov <rsokolkov@gmail.com>
--------------------------------------------------------------------------------

103  [ ] Fingerprint OK        [ ] ID OK
pub   rsa2048 2011-11-20 [SC]
      0597 57A3 E3FB BD98 336F  944C 9BFA 6C18 7B2D 8E8A
uid  Gustav Eek <gustav.eek@fripost.org>
uid  Gustav Eek <gustav@fripost.org>
--------------------------------------------------------------------------------

104  [ ] Fingerprint OK        [ ] ID OK
pub   rsa4096 2016-01-21 [SC] [expires: 2018-04-11]
      CFD6 EEC8 DFAB 9857 3AE8  246E 06CE D38F 7CB0 E046
uid  Maxime Lareo <maxime.lareo@infomaniak.com>
uid  Maxime Lareo <maxime@lareo.fr>
uid  Maxime Lareo <max.lareo@gmail.com>
--------------------------------------------------------------------------------

105  [ ] Fingerprint OK        [ ] ID OK
pub   rsa4096 2018-01-20 [SC]
      F7DA A58E 032A EEE7 05AA  1A74 46E5 F1FC 2D0E BD8F
uid  Fayez ALSEDLAH <fyzymn@gmail.com>
--------------------------------------------------------------------------------

106  [ ] Fingerprint OK        [ ] ID OK
pub   rsa4096 2010-02-24 [SC] [expires: 2018-04-22]
      82D1 19A8 40C6 EFCA 6F5A  F945 9EDC C991 D9AB 457E
uid  Giovanni Mascellani <gio@debian.org>
uid  Giovanni Mascellani <g.mascellani@gmail.com>
uid  Giovanni Mascellani <giovanni.mascellani@sns.it>
uid  Giovanni Mascellani <mascellani@mail.dm.unipi.it>
uid  Giovanni Mascellani <mascellani@poisson.phc.unipi.it>
uid  Giovanni Mascellani <mascellani@poisson.phc.dm.unipi.it>
uid  Giovanni Mascellani
uid  Giovanni Mascellani <giovanni.mascellani@ulb.ac.be>
--------------------------------------------------------------------------------

107  [ ] Fingerprint OK        [ ] ID OK
pub   rsa4096 2011-06-18 [C] [expires: 2018-04-22]
      0CD1 1750 42C3 8BB1 10EF  8AFE E274 A9FC B0A1 D182
uid  Giovanni Mascellani <gio@debian.org>
uid  Giovanni Mascellani <mascellani@poisson.phc.unipi.it>
uid  Giovanni Mascellani
uid  Giovanni Mascellani <g.mascellani@gmail.com>
uid  Giovanni Mascellani <giovanni.mascellani@sns.it>
uid  Giovanni Mascellani <mascellani@mail.dm.unipi.it>
uid  Giovanni Mascellani <mascellani@poisson.phc.dm.unipi.it>
uid  Giovanni Mascellani <giovanni.mascellani@ulb.ac.be>
--------------------------------------------------------------------------------

108  [ ] Fingerprint OK        [ ] ID OK
pub   rsa4096 2015-07-11 [SC] [expires: 2020-07-09]
      8DE2 4BD1 0CAA 892B 8C2B  FC75 37F5 9AA0 7D92 D5AF
uid  Christoph Moench-Tegeder <cmt@burggraben.net>
uid  Christoph Moench-Tegeder <cmt@freebsd.org>
--------------------------------------------------------------------------------

109  [ ] Fingerprint OK        [ ] ID OK
pub   rsa4096 2014-09-29 [SC] [expires: 2018-11-13]
      9F54 0F7B 6D13 F750 A5BB  2E9D 56EA A757 2C2B 49FE
uid  Christoph Moench-Tegeder <christoph@2ndquadrant.de>
uid  Christoph Moench-Tegeder <cmt@2ndquadrant.de>
uid  Christoph Moench-Tegeder <christoph@2ndquadrant.com>
uid  Christoph Moench-Tegeder <christoph.moench-tegeder@2ndquadrant.com>
--------------------------------------------------------------------------------

110  [ ] Fingerprint OK        [ ] ID OK
pub   rsa4096 2014-10-05 [SC]
      1AD8 1F78 5B52 6959 9D64  9393 2D03 7DDC D7F4 AC1E
uid  Samuel Bächler <lozsui@gmail.com>
uid  Samuel Bächler <baechler@boeser.ch>
--------------------------------------------------------------------------------

111  [ ] Fingerprint OK        [ ] ID OK
pub   rsa4096 2017-12-29 [SC] [expires: 2019-12-29]
      727A 0D4D DB9E D9F6 039B  ECEF 847F 5E37 90CE 0977
uid  Maciej S. Szmigiero <mail@maciej.szmigiero.name>
--------------------------------------------------------------------------------

112  [ ] Fingerprint OK        [ ] ID OK
pub   rsa4096 2017-08-08 [SC]
      FBA2 6E3D 38D3 6F1E 3BF6  8DCE 5ADE 5BD4 696B FBA5
uid  Pavel Begunkov (silence) <asml.silence@gmail.com>
--------------------------------------------------------------------------------

113  [ ] Fingerprint OK        [ ] ID OK
pub   rsa4096 2017-11-10 [SC]
      D9ED D41A 1AB1 7E4A 2FE3  69D8 035F D953 9EE0 15A2
uid  iText Software (Community) <community@itextpdf.com>
--------------------------------------------------------------------------------

114  [ ] Fingerprint OK        [ ] ID OK
pub   rsa2048 2015-07-08 [SC]
      F1EB BC8B 70AF BC11 305B  E50C 1329 5657 E604 25BA
uid  Amedee Van Gasse (iText Software) <amedee.vangasse@itextpdf.com>
--------------------------------------------------------------------------------

115  [ ] Fingerprint OK        [ ] ID OK
pub   rsa4096 2016-03-07 [SCEA] [expires: 2021-03-06]
      B5FA EF4C 1830 3715 DCFA  074D 5852 B949 3EB2 94E0
uid  Eugenio Severi <eugies93@gmail.com>
uid  Eugenio Severi
--------------------------------------------------------------------------------

116  [ ] Fingerprint OK        [ ] ID OK
pub   rsa4096 2017-06-02 [SCA] [expires: 2022-06-01]
      A9CE 616D FB91 B143 5B96  E28E EA73 E619 3988 0E0E
uid  Uwe Herrmann <uwe.herrmann@posteo.de>
--------------------------------------------------------------------------------

117  [ ] Fingerprint OK        [ ] ID OK
pub   rsa4096 2018-01-22 [SC]
      C78B 4EAA A6D6 8304 1057  913D 7435 87BC 9946 2791
uid  Uwe Herrmann <uwe@herrmannuwe.de>
--------------------------------------------------------------------------------

118  [ ] Fingerprint OK        [ ] ID OK
pub   rsa4096 2015-03-23 [SC]
      A76E 2B6E D71B 4DB3 75DB  C27E 4637 5C8A 6134 A079
uid  Mario Abajo Duran <marioabajo@gmail.com>
--------------------------------------------------------------------------------

119  [ ] Fingerprint OK        [ ] ID OK
pub   rsa4096 2012-12-09 [SCA] [expires: 2020-12-31]
      CA84 63DD 0C39 1573 B4C9  834F AEED 6158 020E AFFF
uid  James Cowgill <jcowgill@jcowgill.uk>
uid  James Cowgill <james410@cowgill.org.uk>
uid  James Cowgill <jcowgill@debian.org>
uid  James Cowgill <james.cowgill@mips.com>
--------------------------------------------------------------------------------

120  [ ] Fingerprint OK        [ ] ID OK
pub   rsa4096 2018-01-14 [SCA]
      D310 920C 4FE5 0D9E F45F  D521 4EB2 CD39 9718 83F1
uid  Adam Ryczkowski <adam@statystyka.net>
uid  Adam Ryczkowski <adam.ryczkowski@statystyka.net>
uid  [jpeg image of size 41688]
--------------------------------------------------------------------------------

121  [ ] Fingerprint OK        [ ] ID OK
pub   rsa2048 2016-11-23 [SC]
      18EA 83C4 0BC7 C778 126C  EC19 5659 5203 DCAB CC52
uid  Jeff Abrahamson <jeff@purple.com>
--------------------------------------------------------------------------------

122  [ ] Fingerprint OK        [ ] ID OK
pub   rsa4096 2018-01-23 [SC]
      7FE6 764A 1C83 070E E1BD  8ABC 9F9C 8F70 752E C64C
uid  Bjørn Gilstad <bjorn@gilstad.io>
--------------------------------------------------------------------------------

123  [ ] Fingerprint OK        [ ] ID OK
pub   rsa4096 2016-11-16 [C] [expires: 2022-12-12]
      CE9B 611E 3647 C37E A3C9  7EC1 74B1 2098 8872 70AB
uid  Martijn van Dijk <martijn@martijnvandijk.net>
--------------------------------------------------------------------------------

124  [ ] Fingerprint OK        [ ] ID OK
pub   rsa4096 2013-02-18 [SC] [expires: 2018-04-27]
      2CB2 2CBB 75F4 ACB7 4ECA  56D9 E158 BD79 4823 BEF3
uid  Mike H <mikeh@csits.net>
--------------------------------------------------------------------------------

125  [ ] Fingerprint OK        [ ] ID OK
pub   rsa4096 2017-08-07 [SC]
      BD0B F5B1 7435 DE81 E35D  5EAF A530 708A 1261 E1CC
uid  Petre Tudor <petre.tudor@dorkfarm.com>
--------------------------------------------------------------------------------

126  [ ] Fingerprint OK        [ ] ID OK
pub   rsa4096 2018-01-23 [SC] [expires: 2023-01-23]
      DABF 7CAC 18A3 A36C 528E  0BC2 555A 73A3 1F44 F22C
uid  Matthias Adler (GPG Email) <matthias@bitshaker.net>
--------------------------------------------------------------------------------

127  [ ] Fingerprint OK        [ ] ID OK
pub   dsa3072 2009-07-02 [SCA]
      DCB3 281F 38B0 711A 41C0  DC20 EE8D 363D 1687 9738
uid  Markus Reichelt <mr@mareichelt.com>
uid  markus reichelt <mr@kleingeschrieben.de>
uid  [jpeg image of size 15158]
uid  Markus Reichelt <reichelt@antaris-organics.com>
--------------------------------------------------------------------------------

128  [ ] Fingerprint OK        [ ] ID OK
pub   rsa4096 2014-08-21 [SC]
      5F2D 2D85 F0E5 482E 49BE  9533 1F06 AF99 7E25 1EE3
uid  Markus Reichelt <mr@mareichelt.com>
--------------------------------------------------------------------------------

129  [ ] Fingerprint OK        [ ] ID OK
pub   ed25519 2018-01-20 [SC]
      4D51 9000 D629 CC54 5700  09B7 0703 C05C 83A2 205B
uid  Markus Reichelt <mr@mareichelt.com>
--------------------------------------------------------------------------------

130  [ ] Fingerprint OK        [ ] ID OK
pub   rsa2048 2017-11-24 [SC]
      F7A9 1B42 B867 B7C9 668A  E6DE 55BF 9C86 1307 9D95
uid  Bas Kraai <bas.kraai@hu.nl>
--------------------------------------------------------------------------------

131  [ ] Fingerprint OK        [ ] ID OK
pub   rsa2048 2017-11-24 [SC]
      D52C 94FF E30D 8730 6D04  EF73 1D6E 696E 24DD AAC6
uid  Bas Kraai <bas@familiekraai.nl>
--------------------------------------------------------------------------------

132  [ ] Fingerprint OK        [ ] ID OK
pub   rsa2048 2017-11-24 [SC]
      6710 1DC9 6A0F 2AF2 E60D  9DF4 03FA 0463 F07A F318
uid  Bas Kraai <bas.kraai@student.hu.nl>
--------------------------------------------------------------------------------

133  [ ] Fingerprint OK        [ ] ID OK
pub   rsa4096 2012-12-07 [SC] [expires: 2019-01-21]
      19D8 011C 8189 1778 7A19  86DC 28E8 567F DAA2 6AC4
uid  vincent <vincent@autistici.org>
uid  vinc3nt <vinc3nt@riseup.net>
uid  vincent <vincent@inventati.org>
uid  vincent <vincent@bazinga.land>
uid  [jpeg image of size 4974]
uid  [jpeg image of size 6231]
--------------------------------------------------------------------------------

134  [ ] Fingerprint OK        [ ] ID OK
pub   rsa4096 2013-11-29 [SC] [expires: 2019-01-31]
      B100 5DC4 9686 BE64 87E9  0E22 44C3 983F A762 9DE8
uid  Mathias Bauer-Rohrbeck
uid  Mathias Bauer-Rohrbeck <mbauer@mailbox.org>
--------------------------------------------------------------------------------

135  [ ] Fingerprint OK        [ ] ID OK
pub   rsa4096 2018-01-14 [SC] [expires: 2019-01-31]
      2AF9 F48A 2795 D440 E3B6  22DE F6FA F5FC A6D7 0829
uid  Mathias Bauer-Rohrbeck
uid  Mathias Bauer-Rohrbeck <mathias.bauer@mailbox.org>
--------------------------------------------------------------------------------

136  [ ] Fingerprint OK        [ ] ID OK
pub   rsa4096 2012-05-25 [SC] [expires: 2018-10-07]
      7BA6 70E9 8956 0990 0610  812C 3671 93A4 DBF4 7F74
uid  GRIVEAUX Alexandre <gnegrala@gmail.com>
uid  GRIVEAUX Alexandre <alex@deutnet.info>
uid  GRIVEAUX Alexandre <agriveaux@deutnet.info>
--------------------------------------------------------------------------------

137  [ ] Fingerprint OK        [ ] ID OK
pub   rsa4096 2018-01-23 [SCA] [expires: 2023-01-22]
      231D 54C5 49A2 53AA 5DFF  DAD1 44B6 B4C7 F108 3AA7
uid  Andrew Reid East <andrew@andreweast.net>
uid  Andrew Reid East <reideast@gmail.com>
uid  [jpeg image of size 22776]
--------------------------------------------------------------------------------

138  [ ] Fingerprint OK        [ ] ID OK
pub   rsa4096 2018-01-23 [SCA] [expires: 2023-01-22]
      DE93 88B4 485B 686E D068  B2E4 2ADF 4A0C 0516 EA46
uid  Alphonsos Pangas <alfon@pobox.com>
--------------------------------------------------------------------------------

139  [ ] Fingerprint OK        [ ] ID OK
pub   rsa4096 2018-01-24 [SC]
      92BF F25A 70A5 D4A2 CD4B  90DA 5950 55CC 5E3F A51C
uid  Jan Haan <jan@nonsenseinc.org>
uid  Jan Haan <jan@ggaming.de>
uid  Jan Haan <jan@sinnfrei.xyz>
uid  Jan Haan <jan.haan@stud.uni-due.de>
uid  Jan Haan <jan@medipee.com>
uid  Jan Haan <jan.haan@thw-moers.de>
uid  Jan Haan <jan.haan@yahoo.de>
uid  Jan Haan <jhaan@outlook.de>
--------------------------------------------------------------------------------

140  [ ] Fingerprint OK        [ ] ID OK
pub   rsa4096 2018-01-24 [SC] [expires: 2023-01-24]
      9EAA 95B4 E973 1B6B 757A  CD62 9229 692B 9A5D 205A
uid  Dashamir Hoxha <dashohoxha@gmail.com>
--------------------------------------------------------------------------------

141  [ ] Fingerprint OK        [ ] ID OK
pub   rsa4096 2015-05-27 [SCA] [expires: 2020-12-25]
      847F C5C4 337D 9CDB D473  B7A6 0967 FD25 8D64 14F9
uid  Dashamir Hoxha <dashohoxha@gmail.com>
uid  keybase.io/dashohoxha <dashohoxha@keybase.io>
uid  [jpeg image of size 9123]
--------------------------------------------------------------------------------

142  [ ] Fingerprint OK        [ ] ID OK
pub   rsa4096 2018-01-24 [SC] [expires: 2034-01-20]
      1893 1AB4 720C 1EA3 C28B  95B3 775F B44C 0C6A D08D
uid  Dashamir Hoxha <dashohoxha@gmail.com>
uid  Dashamir Hoxha <dashohoxha@keybase.io>
--------------------------------------------------------------------------------

143  [ ] Fingerprint OK        [ ] ID OK
pub   rsa4096 2017-02-05 [SC] [expires: 2019-02-05]
      BE5C 2320 9ACD DACE B20D  B0A2 8C81 89F1 988C 2166
uid  Daniel Kiper <dkiper@net-space.pl>
--------------------------------------------------------------------------------

144  [ ] Fingerprint OK        [ ] ID OK
pub   rsa2048 2018-01-24 [SC] [expires: 2020-01-24]
      96CF 0493 9865 DFBC EC06  8804 65DE 99E3 0488 1C11
uid  Alberto Ognibene <alberto.ognibene@gmail.com>
--------------------------------------------------------------------------------

145  [ ] Fingerprint OK        [ ] ID OK
pub   rsa2048 2018-01-23 [SC]
      C572 DBCE ECD1 3295 D68F  6142 59D1 1350 1CE2 F300
uid  Jutta Horstmann <j.horstmann@eyeo.com>
--------------------------------------------------------------------------------

146  [ ] Fingerprint OK        [ ] ID OK
pub   rsa2048 2015-11-01 [SC] [expires: 2019-06-01]
      2E5F 330E AC3E 95F2 4266  48BD 086D C2A6 D40B 9D04
uid  Janos Farkas <chexum+dev@gmail.com>
--------------------------------------------------------------------------------

147  [ ] Fingerprint OK        [ ] ID OK
pub   rsa3072 2013-02-15 [SC] [expires: 2019-02-15]
      C797 490A C93E DB00 0615  680A FC1C 1CB6 8079 85E6
uid  Sergi Blanch-Torné <sergi@calcurco.cat>
uid  Sergi Blanch-Torné <srgblnch@gmail.com>
uid  Sergi Blanch-Torné <srgblnchtrn@fsfe.org>
uid  Sergi Blanch-Torné <srgblnchtrn@gmail.com>
uid  Sergi Blanch-Torné <sblanch@alumnes.udl.cat>
uid  Sergi Blanch-Torné <srgblnchtrn@protonmail.ch>
--------------------------------------------------------------------------------

148  [ ] Fingerprint OK        [ ] ID OK
pub   rsa2048 2017-12-14 [SC]
      BF07 5B37 144F 9682 5A9C  A836 5A66 FC21 E697 BBF7
uid  Dima Kuznetsov <dmitrykuzn@gmail.com>
--------------------------------------------------------------------------------

149  [ ] Fingerprint OK        [ ] ID OK
pub   rsa4096 2018-01-24 [SC]
      5393 ED37 7577 DE46 3420  D291 99F3 5785 F535 9B54
uid  Dmitry Kuznetsov <dmitrykuzn@gmail.com>
--------------------------------------------------------------------------------

150  [ ] Fingerprint OK        [ ] ID OK
pub   rsa4096 2017-12-21 [SC] [expires: 2033-12-17]
      E2A9 187E 641A 57C8 E309  E659 75E5 4258 A457 5AC6
uid  Benjamin Lipp <blipp@mailbox.org>
uid  Benjamin Lipp <benjamin.lipp@etudiant.univ-rennes1.fr>
uid  Benjamin Lipp <benjamin.lipp@inria.fr>
uid  Benjamin Lipp <beni@fachschaft.physik.kit.edu>
uid  Benjamin Lipp <mail@benjaminlipp.de>
uid  Benjamin Lipp <benjamin.lipp@student.kit.edu>
--------------------------------------------------------------------------------

151  [ ] Fingerprint OK        [ ] ID OK
pub   rsa4096 2013-10-16 [SC]
      C80A F2D1 C44C 143A 23F6  6FD9 CAFA 5D3D 74FF 0269
uid  Jan Tomko <jtomko@redhat.com>
--------------------------------------------------------------------------------

152  [ ] Fingerprint OK        [ ] ID OK
pub   rsa4096 2018-01-24 [SC] [expires: 2019-07-18]
      21F2 2208 336D 3C26 431D  028A DBD7 1F45 5255 2D44
uid  Pierre-Louis Bonicoli (Pilou) <pierre-louis.bonicoli@libregerbil.fr>
uid  Pierre-Louis Bonicoli <pierre-louis.bonicoli@gmx.fr>
--------------------------------------------------------------------------------

153  [ ] Fingerprint OK        [ ] ID OK
pub   rsa4096 2018-01-24 [C] [expires: 2019-01-24]
      5D6D F513 5FB3 5DCC F1BA  AB3B 06F2 8694 E01D 17D2
uid  Martijn van der Kleijn <martijn@vanderkleijn.net>
--------------------------------------------------------------------------------

154  [ ] Fingerprint OK        [ ] ID OK
pub   rsa4096 2018-01-22 [SC] [expires: 2023-01-21]
      2496 D0B5 A2F8 4EC8 978B  600B 866E 542C F742 41B1
uid  Albert Bogdanowicz <albertbogdanowicz@albertbogdanowicz.pl>
--------------------------------------------------------------------------------

155  [ ] Fingerprint OK        [ ] ID OK
pub   rsa4096 2016-09-24 [C] [expires: 2018-09-24]
      1FAF 045F 9B8F 8B3E BF27  FC7D 3C41 07E6 826C 40E4
uid  Valentin Vidic <Valentin.Vidic@CARNet.hr>
uid  Valentin Vidić <vvidic@valentin-vidic.from.hr>
--------------------------------------------------------------------------------

156  [ ] Fingerprint OK        [ ] ID OK
pub   rsa4096 2014-06-27 [SCE]
      993B 7D7E 8E41 3809 828F  0F29 EB55 9C7C 54DD D393
uid  VeraCrypt Team <veracrypt@idrix.fr>
--------------------------------------------------------------------------------

157  [ ] Fingerprint OK        [ ] ID OK
pub   rsa2048 2016-11-07 [SC] [expires: 2021-11-10]
      3EF3 FD1C 0099 AA81 5634  77A5 3877 AD05 D158 2CDB
uid  Dr. Andreas Johannes Herbert Hausmann (Dipl.Phys, IT Consultant) <ajh.hausmann@gmail.com>
uid  [jpeg image of size 6694]
uid  Dr. Andreas Johannes Herbert Hausmann (Dipl.Phys, IT Consultant) <ajh.hausmann@posteo.de>
--------------------------------------------------------------------------------

158  [ ] Fingerprint OK        [ ] ID OK
pub   rsa2048 2017-01-26 [SC] [expires: 2022-01-25]
      7EE1 300B D2C8 94BA 91DA  4AE6 4ECF FECC 9E76 9147
uid  Dr. Andreas Johannes Herbert Hausmann (Owner and maintainer of TigerGammon) <andreas@tigergammon.com>
uid  Dr. Andreas Johannes Herbert Hausmann (Nick of owner on TigerGammon) <hannes@tigergammon.com>
uid  [jpeg image of size 6694]
--------------------------------------------------------------------------------

159  [ ] Fingerprint OK        [ ] ID OK
pub   rsa4096 2018-01-24 [SC]
      D02C 2301 CB5B C192 E189  DF5F 5F57 FEC1 E825 4E57
uid  Andrei Cristian Petcu <andrei@ceata.org>
--------------------------------------------------------------------------------

160  [ ] Fingerprint OK        [ ] ID OK
pub   rsa4096 2016-12-09 [SC] [expires: 2021-12-08]
      5DD7 47D6 27FC 17E0 D54A  8ACD 8ABA 5B33 9695 B6B1
uid  Jasper Spaans <jasper@startmail.com>
--------------------------------------------------------------------------------

161  [ ] Fingerprint OK        [ ] ID OK
pub   rsa8192 2015-01-09 [SC] [expires: 2025-01-06]
      3777 9041 41FC A92A BFBC  6B13 D84E F7E7 2ABE AD61
uid  Jasper Spaans <j@jasper.es>
uid  Jasper Spaans <spaans@gmail.com>
--------------------------------------------------------------------------------

162  [ ] Fingerprint OK        [ ] ID OK
pub   rsa4096 2016-11-17 [SC]
      EE27 143F D4C1 C95A 86B4  D83D 8065 39FA 8D18 CA37
uid  Axel Tripier-Mondancin--Delion <axel@tripier.fr>
uid  [jpeg image of size 5147]
uid  Axel Tripier-Mondancin--Delion <axel.tripier@gmail.com>
--------------------------------------------------------------------------------

163  [ ] Fingerprint OK        [ ] ID OK
pub   rsa2048 2018-01-24 [SC]
      4BF4 0FC1 3F36 055D 04E5  52B4 6057 F90A 15F8 082B
uid  Uwe Geuder <gpg2-ugeuder@snkmail.com>
--------------------------------------------------------------------------------

164  [ ] Fingerprint OK        [ ] ID OK
pub   rsa2048 2018-01-24 [SC]
      CFAF ED4E DD16 8D1B 3CEF  B5D4 CF26 5D1F 1566 31D3
uid  Raffael Krebs <raffael.krebs@protonmail.ch>
--------------------------------------------------------------------------------

165  [ ] Fingerprint OK        [ ] ID OK
pub   rsa2048 2018-01-24 [SC]
      2336 EFA8 01D2 D890 B34D  A0C8 F702 F92E 7B9C A79E
uid  Raffael Krebs <raffael.krebs@gmail.com>
--------------------------------------------------------------------------------

166  [ ] Fingerprint OK        [ ] ID OK
pub   rsa2048 2018-01-24 [SC]
      53E6 4F81 EE8D 91CD 8620  7C93 02BC 271B 8394 D1A9
uid  Raffael Krebs <kreba@gmx.ch>
--------------------------------------------------------------------------------

167  [ ] Fingerprint OK        [ ] ID OK
pub   rsa4096 2018-01-24 [SC] [expires: 2020-01-24]
      31D9 5CAB 6D80 D262 244A  1750 A476 20E8 01E4 7E95
uid  David Seifert <soap@gentoo.org>
--------------------------------------------------------------------------------

168  [ ] Fingerprint OK        [ ] ID OK
pub   rsa2048 2018-01-25 [SC]
      F146 E0E7 D3DC 3264 26F7  FB7D CF11 09EA 6A95 B618
uid  Xingzhou He <derekhe@gmail.com>
--------------------------------------------------------------------------------

169  [ ] Fingerprint OK        [ ] ID OK
pub   rsa4096 2015-03-26 [SC]
      39DB 4432 FEC7 7A41 7818  894D 8C4F E52B 55B8 1946
uid  Luis Zas de Uña <dalues@gmail.com>
--------------------------------------------------------------------------------

170  [ ] Fingerprint OK        [ ] ID OK
pub   rsa4096 2018-01-10 [SCA] [expires: 2023-01-09]
      B990 94B7 62B0 670B 1039  4A97 3B0A 03F5 3D13 66A1
uid  roberttamba <roberttamba@riseup.net>
--------------------------------------------------------------------------------

171  [ ] Fingerprint OK        [ ] ID OK
pub   rsa4096 2014-11-08 [SC] [expires: 2020-07-19]
      E523 5F5B 9415 A2BB 760B  BF18 5791 D0FA CE0A F03C
uid  Jack Henschel <jack.henschel@mailbox.org>
uid  Jack Henschel (Development) <jackdev@mailbox.org>
uid  Jack Henschel (Business) <jacksgt@mailbox.org>
uid  Jack Henschel <jack.henschel@fau.de>

-----END KEY LIST-----
