{
     "Транспорт": {
      "100": {
        "question": "plane",
        "answer": "самолет",
        "asked": false
      },
      "200": {
        "question": "train",
        "answer": "поезд",
        "asked": false
      },
      "300": {
        "question": "ship",
        "answer": "лодка",
        "asked": false
      }
    },
    "Страны": {
      "100": {
        "question": "Что открыл Колумб",
        "answer": "Америка",
        "asked": false
      },
      "200": {
        "question": "Островная страна",
        "answer": "Австралия",
        "asked": false
      },
      "300": {
        "question": "Родина Олимпа",
        "answer": "Греция",
        "asked": false
      }
    },
    "Люди": {
      "100": {
        "question": "Лучший химик",
        "answer": "Менделеев",
        "asked": false
      },
      "200": {
        "question": "Лучший физик",
        "answer": "Эйнштейн",
        "asked": false
      },
      "300": {
        "question": "Лучший математик",
        "answer": "Вийе",
        "asked": false
      }
    }
  }

