(['D:\\Python\\pyqt6\\workersv2.py'],
 ['D:\\Python\\pyqt6'],
 ['codecs'],
 ['D:\\Python\\rvrkcbot\\venv\\lib\\site-packages\\_pyinstaller_hooks_contrib\\hooks\\stdhooks',
  'D:\\Python\\rvrkcbot\\venv\\lib\\site-packages\\_pyinstaller_hooks_contrib\\hooks\\stdhooks\\__pycache__',
  'D:\\Python\\rvrkcbot\\venv\\lib\\site-packages\\_pyinstaller_hooks_contrib\\hooks\\rthooks',
  'D:\\Python\\rvrkcbot\\venv\\lib\\site-packages\\_pyinstaller_hooks_contrib\\hooks\\rthooks\\__pycache__',
  'D:\\Python\\rvrkcbot\\venv\\lib\\site-packages\\_pyinstaller_hooks_contrib\\hooks',
  'D:\\Python\\rvrkcbot\\venv\\lib\\site-packages\\qdarktheme\\__pyinstaller'],
 {},
 [],
 [],
 False,
 False,
 False,
 {},
 '3.10.2 (tags/v3.10.2:a58ebcc, Jan 17 2022, 14:12:15) [MSC v.1929 64 bit '
 '(AMD64)]',
 [('pyi_rth_inspect',
   'D:\\Python\\rvrkcbot\\venv\\Lib\\site-packages\\PyInstaller\\hooks\\rthooks\\pyi_rth_inspect.py',
   'PYSOURCE'),
  ('pyi_rth_subprocess',
   'D:\\Python\\rvrkcbot\\venv\\Lib\\site-packages\\PyInstaller\\hooks\\rthooks\\pyi_rth_subprocess.py',
   'PYSOURCE'),
  ('pyi_rth_pyqt6',
   'D:\\Python\\rvrkcbot\\venv\\Lib\\site-packages\\PyInstaller\\hooks\\rthooks\\pyi_rth_pyqt6.py',
   'PYSOURCE'),
  ('pyi_rth_pkgutil',
   'D:\\Python\\rvrkcbot\\venv\\Lib\\site-packages\\PyInstaller\\hooks\\rthooks\\pyi_rth_pkgutil.py',
   'PYSOURCE'),
  ('workersv2', 'D:\\Python\\pyqt6\\workersv2.py', 'PYSOURCE')],
 [('pkgutil',
   'C:\\Users\\nidxegg.RKC\\AppData\\Local\\Programs\\Python\\Python310\\lib\\pkgutil.py',
   'PYMODULE'),
  ('zipimport',
   'C:\\Users\\nidxegg.RKC\\AppData\\Local\\Programs\\Python\\Python310\\lib\\zipimport.py',
   'PYMODULE'),
  ('importlib.readers',
   'C:\\Users\\nidxegg.RKC\\AppData\\Local\\Programs\\Python\\Python310\\lib\\importlib\\readers.py',
   'PYMODULE'),
  ('importlib.abc',
   'C:\\Users\\nidxegg.RKC\\AppData\\Local\\Programs\\Python\\Python310\\lib\\importlib\\abc.py',
   'PYMODULE'),
  ('typing',
   'C:\\Users\\nidxegg.RKC\\AppData\\Local\\Programs\\Python\\Python310\\lib\\typing.py',
   'PYMODULE'),
  ('contextlib',
   'C:\\Users\\nidxegg.RKC\\AppData\\Local\\Programs\\Python\\Python310\\lib\\contextlib.py',
   'PYMODULE'),
  ('importlib._abc',
   'C:\\Users\\nidxegg.RKC\\AppData\\Local\\Programs\\Python\\Python310\\lib\\importlib\\_abc.py',
   'PYMODULE'),
  ('importlib._bootstrap',
   'C:\\Users\\nidxegg.RKC\\AppData\\Local\\Programs\\Python\\Python310\\lib\\importlib\\_bootstrap.py',
   'PYMODULE'),
  ('importlib._bootstrap_external',
   'C:\\Users\\nidxegg.RKC\\AppData\\Local\\Programs\\Python\\Python310\\lib\\importlib\\_bootstrap_external.py',
   'PYMODULE'),
  ('importlib.metadata',
   'C:\\Users\\nidxegg.RKC\\AppData\\Local\\Programs\\Python\\Python310\\lib\\importlib\\metadata\\__init__.py',
   'PYMODULE'),
  ('importlib.metadata._itertools',
   'C:\\Users\\nidxegg.RKC\\AppData\\Local\\Programs\\Python\\Python310\\lib\\importlib\\metadata\\_itertools.py',
   'PYMODULE'),
  ('importlib.metadata._functools',
   'C:\\Users\\nidxegg.RKC\\AppData\\Local\\Programs\\Python\\Python310\\lib\\importlib\\metadata\\_functools.py',
   'PYMODULE'),
  ('importlib.metadata._collections',
   'C:\\Users\\nidxegg.RKC\\AppData\\Local\\Programs\\Python\\Python310\\lib\\importlib\\metadata\\_collections.py',
   'PYMODULE'),
  ('importlib.metadata._meta',
   'C:\\Users\\nidxegg.RKC\\AppData\\Local\\Programs\\Python\\Python310\\lib\\importlib\\metadata\\_meta.py',
   'PYMODULE'),
  ('importlib.metadata._adapters',
   'C:\\Users\\nidxegg.RKC\\AppData\\Local\\Programs\\Python\\Python310\\lib\\importlib\\metadata\\_adapters.py',
   'PYMODULE'),
  ('importlib.metadata._text',
   'C:\\Users\\nidxegg.RKC\\AppData\\Local\\Programs\\Python\\Python310\\lib\\importlib\\metadata\\_text.py',
   'PYMODULE'),
  ('email.message',
   'C:\\Users\\nidxegg.RKC\\AppData\\Local\\Programs\\Python\\Python310\\lib\\email\\message.py',
   'PYMODULE'),
  ('email.policy',
   'C:\\Users\\nidxegg.RKC\\AppData\\Local\\Programs\\Python\\Python310\\lib\\email\\policy.py',
   'PYMODULE'),
  ('email.contentmanager',
   'C:\\Users\\nidxegg.RKC\\AppData\\Local\\Programs\\Python\\Python310\\lib\\email\\contentmanager.py',
   'PYMODULE'),
  ('email.quoprimime',
   'C:\\Users\\nidxegg.RKC\\AppData\\Local\\Programs\\Python\\Python310\\lib\\email\\quoprimime.py',
   'PYMODULE'),
  ('string',
   'C:\\Users\\nidxegg.RKC\\AppData\\Local\\Programs\\Python\\Python310\\lib\\string.py',
   'PYMODULE'),
  ('email.headerregistry',
   'C:\\Users\\nidxegg.RKC\\AppData\\Local\\Programs\\Python\\Python310\\lib\\email\\headerregistry.py',
   'PYMODULE'),
  ('email._header_value_parser',
   'C:\\Users\\nidxegg.RKC\\AppData\\Local\\Programs\\Python\\Python310\\lib\\email\\_header_value_parser.py',
   'PYMODULE'),
  ('email.iterators',
   'C:\\Users\\nidxegg.RKC\\AppData\\Local\\Programs\\Python\\Python310\\lib\\email\\iterators.py',
   'PYMODULE'),
  ('email.generator',
   'C:\\Users\\nidxegg.RKC\\AppData\\Local\\Programs\\Python\\Python310\\lib\\email\\generator.py',
   'PYMODULE'),
  ('copy',
   'C:\\Users\\nidxegg.RKC\\AppData\\Local\\Programs\\Python\\Python310\\lib\\copy.py',
   'PYMODULE'),
  ('random',
   'C:\\Users\\nidxegg.RKC\\AppData\\Local\\Programs\\Python\\Python310\\lib\\random.py',
   'PYMODULE'),
  ('statistics',
   'C:\\Users\\nidxegg.RKC\\AppData\\Local\\Programs\\Python\\Python310\\lib\\statistics.py',
   'PYMODULE'),
  ('decimal',
   'C:\\Users\\nidxegg.RKC\\AppData\\Local\\Programs\\Python\\Python310\\lib\\decimal.py',
   'PYMODULE'),
  ('_pydecimal',
   'C:\\Users\\nidxegg.RKC\\AppData\\Local\\Programs\\Python\\Python310\\lib\\_pydecimal.py',
   'PYMODULE'),
  ('contextvars',
   'C:\\Users\\nidxegg.RKC\\AppData\\Local\\Programs\\Python\\Python310\\lib\\contextvars.py',
   'PYMODULE'),
  ('fractions',
   'C:\\Users\\nidxegg.RKC\\AppData\\Local\\Programs\\Python\\Python310\\lib\\fractions.py',
   'PYMODULE'),
  ('numbers',
   'C:\\Users\\nidxegg.RKC\\AppData\\Local\\Programs\\Python\\Python310\\lib\\numbers.py',
   'PYMODULE'),
  ('hashlib',
   'C:\\Users\\nidxegg.RKC\\AppData\\Local\\Programs\\Python\\Python310\\lib\\hashlib.py',
   'PYMODULE'),
  ('logging',
   'C:\\Users\\nidxegg.RKC\\AppData\\Local\\Programs\\Python\\Python310\\lib\\logging\\__init__.py',
   'PYMODULE'),
  ('pickle',
   'C:\\Users\\nidxegg.RKC\\AppData\\Local\\Programs\\Python\\Python310\\lib\\pickle.py',
   'PYMODULE'),
  ('pprint',
   'C:\\Users\\nidxegg.RKC\\AppData\\Local\\Programs\\Python\\Python310\\lib\\pprint.py',
   'PYMODULE'),
  ('dataclasses',
   'C:\\Users\\nidxegg.RKC\\AppData\\Local\\Programs\\Python\\Python310\\lib\\dataclasses.py',
   'PYMODULE'),
  ('_compat_pickle',
   'C:\\Users\\nidxegg.RKC\\AppData\\Local\\Programs\\Python\\Python310\\lib\\_compat_pickle.py',
   'PYMODULE'),
  ('struct',
   'C:\\Users\\nidxegg.RKC\\AppData\\Local\\Programs\\Python\\Python310\\lib\\struct.py',
   'PYMODULE'),
  ('threading',
   'C:\\Users\\nidxegg.RKC\\AppData\\Local\\Programs\\Python\\Python310\\lib\\threading.py',
   'PYMODULE'),
  ('_threading_local',
   'C:\\Users\\nidxegg.RKC\\AppData\\Local\\Programs\\Python\\Python310\\lib\\_threading_local.py',
   'PYMODULE'),
  ('bisect',
   'C:\\Users\\nidxegg.RKC\\AppData\\Local\\Programs\\Python\\Python310\\lib\\bisect.py',
   'PYMODULE'),
  ('email._encoded_words',
   'C:\\Users\\nidxegg.RKC\\AppData\\Local\\Programs\\Python\\Python310\\lib\\email\\_encoded_words.py',
   'PYMODULE'),
  ('base64',
   'C:\\Users\\nidxegg.RKC\\AppData\\Local\\Programs\\Python\\Python310\\lib\\base64.py',
   'PYMODULE'),
  ('getopt',
   'C:\\Users\\nidxegg.RKC\\AppData\\Local\\Programs\\Python\\Python310\\lib\\getopt.py',
   'PYMODULE'),
  ('gettext',
   'C:\\Users\\nidxegg.RKC\\AppData\\Local\\Programs\\Python\\Python310\\lib\\gettext.py',
   'PYMODULE'),
  ('email.charset',
   'C:\\Users\\nidxegg.RKC\\AppData\\Local\\Programs\\Python\\Python310\\lib\\email\\charset.py',
   'PYMODULE'),
  ('email.encoders',
   'C:\\Users\\nidxegg.RKC\\AppData\\Local\\Programs\\Python\\Python310\\lib\\email\\encoders.py',
   'PYMODULE'),
  ('email.base64mime',
   'C:\\Users\\nidxegg.RKC\\AppData\\Local\\Programs\\Python\\Python310\\lib\\email\\base64mime.py',
   'PYMODULE'),
  ('email._policybase',
   'C:\\Users\\nidxegg.RKC\\AppData\\Local\\Programs\\Python\\Python310\\lib\\email\\_policybase.py',
   'PYMODULE'),
  ('email.header',
   'C:\\Users\\nidxegg.RKC\\AppData\\Local\\Programs\\Python\\Python310\\lib\\email\\header.py',
   'PYMODULE'),
  ('email.errors',
   'C:\\Users\\nidxegg.RKC\\AppData\\Local\\Programs\\Python\\Python310\\lib\\email\\errors.py',
   'PYMODULE'),
  ('email.utils',
   'C:\\Users\\nidxegg.RKC\\AppData\\Local\\Programs\\Python\\Python310\\lib\\email\\utils.py',
   'PYMODULE'),
  ('email._parseaddr',
   'C:\\Users\\nidxegg.RKC\\AppData\\Local\\Programs\\Python\\Python310\\lib\\email\\_parseaddr.py',
   'PYMODULE'),
  ('calendar',
   'C:\\Users\\nidxegg.RKC\\AppData\\Local\\Programs\\Python\\Python310\\lib\\calendar.py',
   'PYMODULE'),
  ('argparse',
   'C:\\Users\\nidxegg.RKC\\AppData\\Local\\Programs\\Python\\Python310\\lib\\argparse.py',
   'PYMODULE'),
  ('shutil',
   'C:\\Users\\nidxegg.RKC\\AppData\\Local\\Programs\\Python\\Python310\\lib\\shutil.py',
   'PYMODULE'),
  ('tarfile',
   'C:\\Users\\nidxegg.RKC\\AppData\\Local\\Programs\\Python\\Python310\\lib\\tarfile.py',
   'PYMODULE'),
  ('gzip',
   'C:\\Users\\nidxegg.RKC\\AppData\\Local\\Programs\\Python\\Python310\\lib\\gzip.py',
   'PYMODULE'),
  ('_compression',
   'C:\\Users\\nidxegg.RKC\\AppData\\Local\\Programs\\Python\\Python310\\lib\\_compression.py',
   'PYMODULE'),
  ('lzma',
   'C:\\Users\\nidxegg.RKC\\AppData\\Local\\Programs\\Python\\Python310\\lib\\lzma.py',
   'PYMODULE'),
  ('bz2',
   'C:\\Users\\nidxegg.RKC\\AppData\\Local\\Programs\\Python\\Python310\\lib\\bz2.py',
   'PYMODULE'),
  ('datetime',
   'C:\\Users\\nidxegg.RKC\\AppData\\Local\\Programs\\Python\\Python310\\lib\\datetime.py',
   'PYMODULE'),
  ('_strptime',
   'C:\\Users\\nidxegg.RKC\\AppData\\Local\\Programs\\Python\\Python310\\lib\\_strptime.py',
   'PYMODULE'),
  ('socket',
   'C:\\Users\\nidxegg.RKC\\AppData\\Local\\Programs\\Python\\Python310\\lib\\socket.py',
   'PYMODULE'),
  ('selectors',
   'C:\\Users\\nidxegg.RKC\\AppData\\Local\\Programs\\Python\\Python310\\lib\\selectors.py',
   'PYMODULE'),
  ('quopri',
   'C:\\Users\\nidxegg.RKC\\AppData\\Local\\Programs\\Python\\Python310\\lib\\quopri.py',
   'PYMODULE'),
  ('uu',
   'C:\\Users\\nidxegg.RKC\\AppData\\Local\\Programs\\Python\\Python310\\lib\\uu.py',
   'PYMODULE'),
  ('optparse',
   'C:\\Users\\nidxegg.RKC\\AppData\\Local\\Programs\\Python\\Python310\\lib\\optparse.py',
   'PYMODULE'),
  ('textwrap',
   'C:\\Users\\nidxegg.RKC\\AppData\\Local\\Programs\\Python\\Python310\\lib\\textwrap.py',
   'PYMODULE'),
  ('email',
   'C:\\Users\\nidxegg.RKC\\AppData\\Local\\Programs\\Python\\Python310\\lib\\email\\__init__.py',
   'PYMODULE'),
  ('email.parser',
   'C:\\Users\\nidxegg.RKC\\AppData\\Local\\Programs\\Python\\Python310\\lib\\email\\parser.py',
   'PYMODULE'),
  ('email.feedparser',
   'C:\\Users\\nidxegg.RKC\\AppData\\Local\\Programs\\Python\\Python310\\lib\\email\\feedparser.py',
   'PYMODULE'),
  ('csv',
   'C:\\Users\\nidxegg.RKC\\AppData\\Local\\Programs\\Python\\Python310\\lib\\csv.py',
   'PYMODULE'),
  ('zipfile',
   'C:\\Users\\nidxegg.RKC\\AppData\\Local\\Programs\\Python\\Python310\\lib\\zipfile.py',
   'PYMODULE'),
  ('py_compile',
   'C:\\Users\\nidxegg.RKC\\AppData\\Local\\Programs\\Python\\Python310\\lib\\py_compile.py',
   'PYMODULE'),
  ('inspect',
   'C:\\Users\\nidxegg.RKC\\AppData\\Local\\Programs\\Python\\Python310\\lib\\inspect.py',
   'PYMODULE'),
  ('dis',
   'C:\\Users\\nidxegg.RKC\\AppData\\Local\\Programs\\Python\\Python310\\lib\\dis.py',
   'PYMODULE'),
  ('opcode',
   'C:\\Users\\nidxegg.RKC\\AppData\\Local\\Programs\\Python\\Python310\\lib\\opcode.py',
   'PYMODULE'),
  ('ast',
   'C:\\Users\\nidxegg.RKC\\AppData\\Local\\Programs\\Python\\Python310\\lib\\ast.py',
   'PYMODULE'),
  ('importlib.machinery',
   'C:\\Users\\nidxegg.RKC\\AppData\\Local\\Programs\\Python\\Python310\\lib\\importlib\\machinery.py',
   'PYMODULE'),
  ('importlib.util',
   'C:\\Users\\nidxegg.RKC\\AppData\\Local\\Programs\\Python\\Python310\\lib\\importlib\\util.py',
   'PYMODULE'),
  ('importlib',
   'C:\\Users\\nidxegg.RKC\\AppData\\Local\\Programs\\Python\\Python310\\lib\\importlib\\__init__.py',
   'PYMODULE'),
  ('subprocess',
   'C:\\Users\\nidxegg.RKC\\AppData\\Local\\Programs\\Python\\Python310\\lib\\subprocess.py',
   'PYMODULE'),
  ('signal',
   'C:\\Users\\nidxegg.RKC\\AppData\\Local\\Programs\\Python\\Python310\\lib\\signal.py',
   'PYMODULE'),
  ('_py_abc',
   'C:\\Users\\nidxegg.RKC\\AppData\\Local\\Programs\\Python\\Python310\\lib\\_py_abc.py',
   'PYMODULE'),
  ('tracemalloc',
   'C:\\Users\\nidxegg.RKC\\AppData\\Local\\Programs\\Python\\Python310\\lib\\tracemalloc.py',
   'PYMODULE'),
  ('tempfile',
   'C:\\Users\\nidxegg.RKC\\AppData\\Local\\Programs\\Python\\Python310\\lib\\tempfile.py',
   'PYMODULE'),
  ('getpass',
   'C:\\Users\\nidxegg.RKC\\AppData\\Local\\Programs\\Python\\Python310\\lib\\getpass.py',
   'PYMODULE'),
  ('nturl2path',
   'C:\\Users\\nidxegg.RKC\\AppData\\Local\\Programs\\Python\\Python310\\lib\\nturl2path.py',
   'PYMODULE'),
  ('ftplib',
   'C:\\Users\\nidxegg.RKC\\AppData\\Local\\Programs\\Python\\Python310\\lib\\ftplib.py',
   'PYMODULE'),
  ('netrc',
   'C:\\Users\\nidxegg.RKC\\AppData\\Local\\Programs\\Python\\Python310\\lib\\netrc.py',
   'PYMODULE'),
  ('shlex',
   'C:\\Users\\nidxegg.RKC\\AppData\\Local\\Programs\\Python\\Python310\\lib\\shlex.py',
   'PYMODULE'),
  ('mimetypes',
   'C:\\Users\\nidxegg.RKC\\AppData\\Local\\Programs\\Python\\Python310\\lib\\mimetypes.py',
   'PYMODULE'),
  ('http.cookiejar',
   'C:\\Users\\nidxegg.RKC\\AppData\\Local\\Programs\\Python\\Python310\\lib\\http\\cookiejar.py',
   'PYMODULE'),
  ('http',
   'C:\\Users\\nidxegg.RKC\\AppData\\Local\\Programs\\Python\\Python310\\lib\\http\\__init__.py',
   'PYMODULE'),
  ('ssl',
   'C:\\Users\\nidxegg.RKC\\AppData\\Local\\Programs\\Python\\Python310\\lib\\ssl.py',
   'PYMODULE'),
  ('http.client',
   'C:\\Users\\nidxegg.RKC\\AppData\\Local\\Programs\\Python\\Python310\\lib\\http\\client.py',
   'PYMODULE'),
  ('stringprep',
   'C:\\Users\\nidxegg.RKC\\AppData\\Local\\Programs\\Python\\Python310\\lib\\stringprep.py',
   'PYMODULE'),
  ('PyQt6',
   'D:\\Python\\rvrkcbot\\venv\\lib\\site-packages\\PyQt6\\__init__.py',
   'PYMODULE'),
  ('qdarktheme',
   'D:\\Python\\rvrkcbot\\venv\\lib\\site-packages\\qdarktheme\\__init__.py',
   'PYMODULE'),
  ('qdarktheme.main',
   'D:\\Python\\rvrkcbot\\venv\\lib\\site-packages\\qdarktheme\\main.py',
   'PYMODULE'),
  ('qdarktheme.themes.light.palette',
   'D:\\Python\\rvrkcbot\\venv\\lib\\site-packages\\qdarktheme\\themes\\light\\palette.py',
   'PYMODULE'),
  ('qdarktheme.qtpy.QtGui',
   'D:\\Python\\rvrkcbot\\venv\\lib\\site-packages\\qdarktheme\\qtpy\\QtGui\\__init__.py',
   'PYMODULE'),
  ('qdarktheme.themes.dark.palette',
   'D:\\Python\\rvrkcbot\\venv\\lib\\site-packages\\qdarktheme\\themes\\dark\\palette.py',
   'PYMODULE'),
  ('qdarktheme.themes.light.stylesheet',
   'D:\\Python\\rvrkcbot\\venv\\lib\\site-packages\\qdarktheme\\themes\\light\\stylesheet.py',
   'PYMODULE'),
  ('qdarktheme.themes.dark.stylesheet',
   'D:\\Python\\rvrkcbot\\venv\\lib\\site-packages\\qdarktheme\\themes\\dark\\stylesheet.py',
   'PYMODULE'),
  ('qdarktheme.themes.light.rc_icons',
   'D:\\Python\\rvrkcbot\\venv\\lib\\site-packages\\qdarktheme\\themes\\light\\rc_icons.py',
   'PYMODULE'),
  ('qdarktheme.qtpy.QtCore',
   'D:\\Python\\rvrkcbot\\venv\\lib\\site-packages\\qdarktheme\\qtpy\\QtCore\\__init__.py',
   'PYMODULE'),
  ('qdarktheme.themes.light',
   'D:\\Python\\rvrkcbot\\venv\\lib\\site-packages\\qdarktheme\\themes\\light\\__init__.py',
   'PYMODULE'),
  ('qdarktheme.themes.dark.rc_icons',
   'D:\\Python\\rvrkcbot\\venv\\lib\\site-packages\\qdarktheme\\themes\\dark\\rc_icons.py',
   'PYMODULE'),
  ('qdarktheme.themes.dark',
   'D:\\Python\\rvrkcbot\\venv\\lib\\site-packages\\qdarktheme\\themes\\dark\\__init__.py',
   'PYMODULE'),
  ('qdarktheme.themes',
   'D:\\Python\\rvrkcbot\\venv\\lib\\site-packages\\qdarktheme\\themes\\__init__.py',
   'PYMODULE'),
  ('qdarktheme.util',
   'D:\\Python\\rvrkcbot\\venv\\lib\\site-packages\\qdarktheme\\util.py',
   'PYMODULE'),
  ('qdarktheme.qtpy.qt_compat',
   'D:\\Python\\rvrkcbot\\venv\\lib\\site-packages\\qdarktheme\\qtpy\\qt_compat.py',
   'PYMODULE'),
  ('qdarktheme.qtpy',
   'D:\\Python\\rvrkcbot\\venv\\lib\\site-packages\\qdarktheme\\qtpy\\__init__.py',
   'PYMODULE'),
  ('qdarktheme.qtpy.QtWidgets',
   'D:\\Python\\rvrkcbot\\venv\\lib\\site-packages\\qdarktheme\\qtpy\\QtWidgets\\__init__.py',
   'PYMODULE'),
  ('qdarktheme.qtpy.QtSvg',
   'D:\\Python\\rvrkcbot\\venv\\lib\\site-packages\\qdarktheme\\qtpy\\QtSvg\\__init__.py',
   'PYMODULE'),
  ('qdarktheme.qtpy.qt_version',
   'D:\\Python\\rvrkcbot\\venv\\lib\\site-packages\\qdarktheme\\qtpy\\qt_version.py',
   'PYMODULE'),
  ('platform',
   'C:\\Users\\nidxegg.RKC\\AppData\\Local\\Programs\\Python\\Python310\\lib\\platform.py',
   'PYMODULE'),
  ('json',
   'C:\\Users\\nidxegg.RKC\\AppData\\Local\\Programs\\Python\\Python310\\lib\\json\\__init__.py',
   'PYMODULE'),
  ('json.encoder',
   'C:\\Users\\nidxegg.RKC\\AppData\\Local\\Programs\\Python\\Python310\\lib\\json\\encoder.py',
   'PYMODULE'),
  ('json.decoder',
   'C:\\Users\\nidxegg.RKC\\AppData\\Local\\Programs\\Python\\Python310\\lib\\json\\decoder.py',
   'PYMODULE'),
  ('json.scanner',
   'C:\\Users\\nidxegg.RKC\\AppData\\Local\\Programs\\Python\\Python310\\lib\\json\\scanner.py',
   'PYMODULE'),
  ('__future__',
   'C:\\Users\\nidxegg.RKC\\AppData\\Local\\Programs\\Python\\Python310\\lib\\__future__.py',
   'PYMODULE'),
  ('pypyodbc',
   'D:\\Python\\rvrkcbot\\venv\\lib\\site-packages\\pypyodbc.py',
   'PYMODULE'),
  ('ctypes.util',
   'C:\\Users\\nidxegg.RKC\\AppData\\Local\\Programs\\Python\\Python310\\lib\\ctypes\\util.py',
   'PYMODULE'),
  ('ctypes._aix',
   'C:\\Users\\nidxegg.RKC\\AppData\\Local\\Programs\\Python\\Python310\\lib\\ctypes\\_aix.py',
   'PYMODULE'),
  ('ctypes.macholib.dyld',
   'C:\\Users\\nidxegg.RKC\\AppData\\Local\\Programs\\Python\\Python310\\lib\\ctypes\\macholib\\dyld.py',
   'PYMODULE'),
  ('ctypes.macholib',
   'C:\\Users\\nidxegg.RKC\\AppData\\Local\\Programs\\Python\\Python310\\lib\\ctypes\\macholib\\__init__.py',
   'PYMODULE'),
  ('ctypes.macholib.dylib',
   'C:\\Users\\nidxegg.RKC\\AppData\\Local\\Programs\\Python\\Python310\\lib\\ctypes\\macholib\\dylib.py',
   'PYMODULE'),
  ('ctypes.macholib.framework',
   'C:\\Users\\nidxegg.RKC\\AppData\\Local\\Programs\\Python\\Python310\\lib\\ctypes\\macholib\\framework.py',
   'PYMODULE'),
  ('ctypes',
   'C:\\Users\\nidxegg.RKC\\AppData\\Local\\Programs\\Python\\Python310\\lib\\ctypes\\__init__.py',
   'PYMODULE'),
  ('ctypes._endian',
   'C:\\Users\\nidxegg.RKC\\AppData\\Local\\Programs\\Python\\Python310\\lib\\ctypes\\_endian.py',
   'PYMODULE')],
 [('python310.dll',
   'C:\\Users\\nidxegg.RKC\\AppData\\Local\\Programs\\Python\\Python310\\python310.dll',
   'BINARY'),
  ('VCRUNTIME140.dll',
   'C:\\Users\\nidxegg.RKC\\AppData\\Local\\Programs\\Python\\Python310\\VCRUNTIME140.dll',
   'BINARY'),
  ('PyQt6\\Qt6\\plugins\\imageformats\\qtga.dll',
   'D:\\Python\\rvrkcbot\\venv\\lib\\site-packages\\PyQt6\\Qt6\\plugins\\imageformats\\qtga.dll',
   'BINARY'),
  ('PyQt6\\Qt6\\plugins\\imageformats\\qico.dll',
   'D:\\Python\\rvrkcbot\\venv\\lib\\site-packages\\PyQt6\\Qt6\\plugins\\imageformats\\qico.dll',
   'BINARY'),
  ('PyQt6\\Qt6\\plugins\\iconengines\\qsvgicon.dll',
   'D:\\Python\\rvrkcbot\\venv\\lib\\site-packages\\PyQt6\\Qt6\\plugins\\iconengines\\qsvgicon.dll',
   'BINARY'),
  ('PyQt6\\Qt6\\plugins\\imageformats\\qgif.dll',
   'D:\\Python\\rvrkcbot\\venv\\lib\\site-packages\\PyQt6\\Qt6\\plugins\\imageformats\\qgif.dll',
   'BINARY'),
  ('PyQt6\\Qt6\\plugins\\imageformats\\qicns.dll',
   'D:\\Python\\rvrkcbot\\venv\\lib\\site-packages\\PyQt6\\Qt6\\plugins\\imageformats\\qicns.dll',
   'BINARY'),
  ('PyQt6\\Qt6\\plugins\\imageformats\\qsvg.dll',
   'D:\\Python\\rvrkcbot\\venv\\lib\\site-packages\\PyQt6\\Qt6\\plugins\\imageformats\\qsvg.dll',
   'BINARY'),
  ('PyQt6\\Qt6\\plugins\\platforms\\qwindows.dll',
   'D:\\Python\\rvrkcbot\\venv\\lib\\site-packages\\PyQt6\\Qt6\\plugins\\platforms\\qwindows.dll',
   'BINARY'),
  ('PyQt6\\Qt6\\plugins\\imageformats\\qjpeg.dll',
   'D:\\Python\\rvrkcbot\\venv\\lib\\site-packages\\PyQt6\\Qt6\\plugins\\imageformats\\qjpeg.dll',
   'BINARY'),
  ('PyQt6\\Qt6\\plugins\\imageformats\\qwbmp.dll',
   'D:\\Python\\rvrkcbot\\venv\\lib\\site-packages\\PyQt6\\Qt6\\plugins\\imageformats\\qwbmp.dll',
   'BINARY'),
  ('PyQt6\\Qt6\\plugins\\platforms\\qminimal.dll',
   'D:\\Python\\rvrkcbot\\venv\\lib\\site-packages\\PyQt6\\Qt6\\plugins\\platforms\\qminimal.dll',
   'BINARY'),
  ('PyQt6\\Qt6\\plugins\\styles\\qwindowsvistastyle.dll',
   'D:\\Python\\rvrkcbot\\venv\\lib\\site-packages\\PyQt6\\Qt6\\plugins\\styles\\qwindowsvistastyle.dll',
   'BINARY'),
  ('PyQt6\\Qt6\\plugins\\platforms\\qoffscreen.dll',
   'D:\\Python\\rvrkcbot\\venv\\lib\\site-packages\\PyQt6\\Qt6\\plugins\\platforms\\qoffscreen.dll',
   'BINARY'),
  ('opengl32sw.dll',
   'D:\\Python\\rvrkcbot\\venv\\lib\\site-packages\\PyQt6\\Qt6\\bin\\opengl32sw.dll',
   'BINARY'),
  ('PyQt6\\Qt6\\plugins\\imageformats\\qwebp.dll',
   'D:\\Python\\rvrkcbot\\venv\\lib\\site-packages\\PyQt6\\Qt6\\plugins\\imageformats\\qwebp.dll',
   'BINARY'),
  ('PyQt6\\Qt6\\plugins\\imageformats\\qtiff.dll',
   'D:\\Python\\rvrkcbot\\venv\\lib\\site-packages\\PyQt6\\Qt6\\plugins\\imageformats\\qtiff.dll',
   'BINARY'),
  ('_decimal',
   'C:\\Users\\nidxegg.RKC\\AppData\\Local\\Programs\\Python\\Python310\\DLLs\\_decimal.pyd',
   'EXTENSION'),
  ('_hashlib',
   'C:\\Users\\nidxegg.RKC\\AppData\\Local\\Programs\\Python\\Python310\\DLLs\\_hashlib.pyd',
   'EXTENSION'),
  ('_lzma',
   'C:\\Users\\nidxegg.RKC\\AppData\\Local\\Programs\\Python\\Python310\\DLLs\\_lzma.pyd',
   'EXTENSION'),
  ('_bz2',
   'C:\\Users\\nidxegg.RKC\\AppData\\Local\\Programs\\Python\\Python310\\DLLs\\_bz2.pyd',
   'EXTENSION'),
  ('select',
   'C:\\Users\\nidxegg.RKC\\AppData\\Local\\Programs\\Python\\Python310\\DLLs\\select.pyd',
   'EXTENSION'),
  ('_socket',
   'C:\\Users\\nidxegg.RKC\\AppData\\Local\\Programs\\Python\\Python310\\DLLs\\_socket.pyd',
   'EXTENSION'),
  ('_ssl',
   'C:\\Users\\nidxegg.RKC\\AppData\\Local\\Programs\\Python\\Python310\\DLLs\\_ssl.pyd',
   'EXTENSION'),
  ('unicodedata',
   'C:\\Users\\nidxegg.RKC\\AppData\\Local\\Programs\\Python\\Python310\\DLLs\\unicodedata.pyd',
   'EXTENSION'),
  ('PyQt6.QtWidgets',
   'D:\\Python\\rvrkcbot\\venv\\lib\\site-packages\\PyQt6\\QtWidgets.pyd',
   'EXTENSION'),
  ('PyQt6.QtGui',
   'D:\\Python\\rvrkcbot\\venv\\lib\\site-packages\\PyQt6\\QtGui.pyd',
   'EXTENSION'),
  ('PyQt6.QtCore',
   'D:\\Python\\rvrkcbot\\venv\\lib\\site-packages\\PyQt6\\QtCore.pyd',
   'EXTENSION'),
  ('PyQt6.sip',
   'D:\\Python\\rvrkcbot\\venv\\lib\\site-packages\\PyQt6\\sip.cp310-win_amd64.pyd',
   'EXTENSION'),
  ('PyQt6.QtSvg',
   'D:\\Python\\rvrkcbot\\venv\\lib\\site-packages\\PyQt6\\QtSvg.pyd',
   'EXTENSION'),
  ('_ctypes',
   'C:\\Users\\nidxegg.RKC\\AppData\\Local\\Programs\\Python\\Python310\\DLLs\\_ctypes.pyd',
   'EXTENSION'),
  ('Qt6Gui.dll',
   'D:\\Python\\rvrkcbot\\venv\\lib\\site-packages\\PyQt6\\Qt6\\bin\\Qt6Gui.dll',
   'BINARY'),
  ('Qt6Core.dll',
   'D:\\Python\\rvrkcbot\\venv\\lib\\site-packages\\PyQt6\\Qt6\\bin\\Qt6Core.dll',
   'BINARY'),
  ('Qt6Svg.dll',
   'D:\\Python\\rvrkcbot\\venv\\lib\\site-packages\\PyQt6\\Qt6\\bin\\Qt6Svg.dll',
   'BINARY'),
  ('VCRUNTIME140_1.dll',
   'C:\\Users\\nidxegg.RKC\\AppData\\Local\\Programs\\Python\\Python310\\VCRUNTIME140_1.dll',
   'BINARY'),
  ('MSVCP140.dll', 'C:\\Windows\\system32\\MSVCP140.dll', 'BINARY'),
  ('Qt6Widgets.dll',
   'D:\\Python\\rvrkcbot\\venv\\lib\\site-packages\\PyQt6\\Qt6\\bin\\Qt6Widgets.dll',
   'BINARY'),
  ('libcrypto-1_1.dll',
   'C:\\Users\\nidxegg.RKC\\AppData\\Local\\Programs\\Python\\Python310\\DLLs\\libcrypto-1_1.dll',
   'BINARY'),
  ('libssl-1_1.dll',
   'C:\\Users\\nidxegg.RKC\\AppData\\Local\\Programs\\Python\\Python310\\DLLs\\libssl-1_1.dll',
   'BINARY'),
  ('python3.dll',
   'C:\\Users\\nidxegg.RKC\\AppData\\Local\\Programs\\Python\\Python310\\python3.dll',
   'BINARY'),
  ('MSVCP140_2.dll', 'C:\\Windows\\system32\\MSVCP140_2.dll', 'BINARY'),
  ('libffi-7.dll',
   'C:\\Users\\nidxegg.RKC\\AppData\\Local\\Programs\\Python\\Python310\\DLLs\\libffi-7.dll',
   'BINARY'),
  ('MSVCP140_1.dll',
   'D:\\Python\\rvrkcbot\\venv\\lib\\site-packages\\PyQt6\\Qt6\\bin\\MSVCP140_1.dll',
   'BINARY')],
 [],
 [],
 [('base_library.zip',
   'D:\\Python\\pyqt6\\build\\Workers_rkc\\base_library.zip',
   'DATA'),
  ('qdarktheme\\themes\\light\\svg\\arrow_drop_up__icon-foreground-disabled__rotate-180.svg',
   'D:\\Python\\rvrkcbot\\venv\\lib\\site-packages\\qdarktheme\\themes\\light\\svg\\arrow_drop_up__icon-foreground-disabled__rotate-180.svg',
   'DATA'),
  ('qdarktheme\\themes\\light\\svg\\arrow_drop_up__scrollbar-handle-pressed__rotate-270.svg',
   'D:\\Python\\rvrkcbot\\venv\\lib\\site-packages\\qdarktheme\\themes\\light\\svg\\arrow_drop_up__scrollbar-handle-pressed__rotate-270.svg',
   'DATA'),
  ('qdarktheme\\themes\\light\\svg\\chevron_right__icon-foreground.svg',
   'D:\\Python\\rvrkcbot\\venv\\lib\\site-packages\\qdarktheme\\themes\\light\\svg\\chevron_right__icon-foreground.svg',
   'DATA'),
  ('PyQt6\\Qt6\\translations\\qtbase_zh_CN.qm',
   'D:\\Python\\rvrkcbot\\venv\\lib\\site-packages\\PyQt6\\Qt6\\translations\\qtbase_zh_CN.qm',
   'DATA'),
  ('qdarktheme\\themes\\dark\\svg\\vertical_line__icon-foreground-disabled.svg',
   'D:\\Python\\rvrkcbot\\venv\\lib\\site-packages\\qdarktheme\\themes\\dark\\svg\\vertical_line__icon-foreground-disabled.svg',
   'DATA'),
  ('qdarktheme\\themes\\dark\\svg\\expand_less__icon-foreground-disabled__rotate-180.svg',
   'D:\\Python\\rvrkcbot\\venv\\lib\\site-packages\\qdarktheme\\themes\\dark\\svg\\expand_less__icon-foreground-disabled__rotate-180.svg',
   'DATA'),
  ('qdarktheme\\themes\\dark\\svg\\drag_indicator_horizontal__icon-foreground.svg',
   'D:\\Python\\rvrkcbot\\venv\\lib\\site-packages\\qdarktheme\\themes\\dark\\svg\\drag_indicator_horizontal__icon-foreground.svg',
   'DATA'),
  ('qdarktheme\\themes\\light\\svg\\check_box_outline_blank__icon-foreground.svg',
   'D:\\Python\\rvrkcbot\\venv\\lib\\site-packages\\qdarktheme\\themes\\light\\svg\\check_box_outline_blank__icon-foreground.svg',
   'DATA'),
  ('qdarktheme\\themes\\dark\\svg\\horizontal_rule__icon-foreground__rotate-90.svg',
   'D:\\Python\\rvrkcbot\\venv\\lib\\site-packages\\qdarktheme\\themes\\dark\\svg\\horizontal_rule__icon-foreground__rotate-90.svg',
   'DATA'),
  ('qdarktheme\\themes\\light\\svg\\chevron_right__icon-foreground-disabled.svg',
   'D:\\Python\\rvrkcbot\\venv\\lib\\site-packages\\qdarktheme\\themes\\light\\svg\\chevron_right__icon-foreground-disabled.svg',
   'DATA'),
  ('qdarktheme\\themes\\light\\svg\\check_circle__icon-foreground.svg',
   'D:\\Python\\rvrkcbot\\venv\\lib\\site-packages\\qdarktheme\\themes\\light\\svg\\check_circle__icon-foreground.svg',
   'DATA'),
  ('qdarktheme\\themes\\dark\\svg\\cancel__icon-foreground.svg',
   'D:\\Python\\rvrkcbot\\venv\\lib\\site-packages\\qdarktheme\\themes\\dark\\svg\\cancel__icon-foreground.svg',
   'DATA'),
  ('qdarktheme\\themes\\dark\\svg\\delete__icon-foreground.svg',
   'D:\\Python\\rvrkcbot\\venv\\lib\\site-packages\\qdarktheme\\themes\\dark\\svg\\delete__icon-foreground.svg',
   'DATA'),
  ('qdarktheme\\themes\\light\\svg\\folder_open__icon-foreground.svg',
   'D:\\Python\\rvrkcbot\\venv\\lib\\site-packages\\qdarktheme\\themes\\light\\svg\\folder_open__icon-foreground.svg',
   'DATA'),
  ('qdarktheme\\themes\\dark\\svg\\arrow_drop_up__scrollbar-disabled.svg',
   'D:\\Python\\rvrkcbot\\venv\\lib\\site-packages\\qdarktheme\\themes\\dark\\svg\\arrow_drop_up__scrollbar-disabled.svg',
   'DATA'),
  ('qdarktheme\\themes\\dark\\svg\\arrow_drop_up__scrollbar-handle-pressed__rotate-270.svg',
   'D:\\Python\\rvrkcbot\\venv\\lib\\site-packages\\qdarktheme\\themes\\dark\\svg\\arrow_drop_up__scrollbar-handle-pressed__rotate-270.svg',
   'DATA'),
  ('qdarktheme\\themes\\light\\svg\\check_box__icon-foreground-disabled.svg',
   'D:\\Python\\rvrkcbot\\venv\\lib\\site-packages\\qdarktheme\\themes\\light\\svg\\check_box__icon-foreground-disabled.svg',
   'DATA'),
  ('qdarktheme\\themes\\dark\\svg\\arrow_drop_up__scrollbar-disabled__rotate-180.svg',
   'D:\\Python\\rvrkcbot\\venv\\lib\\site-packages\\qdarktheme\\themes\\dark\\svg\\arrow_drop_up__scrollbar-disabled__rotate-180.svg',
   'DATA'),
  ('PyQt6\\Qt6\\translations\\qtbase_en.qm',
   'D:\\Python\\rvrkcbot\\venv\\lib\\site-packages\\PyQt6\\Qt6\\translations\\qtbase_en.qm',
   'DATA'),
  ('qdarktheme\\themes\\dark\\svg\\calendar_today__icon-foreground.svg',
   'D:\\Python\\rvrkcbot\\venv\\lib\\site-packages\\qdarktheme\\themes\\dark\\svg\\calendar_today__icon-foreground.svg',
   'DATA'),
  ('qdarktheme\\themes\\dark\\svg\\help__icon-foreground.svg',
   'D:\\Python\\rvrkcbot\\venv\\lib\\site-packages\\qdarktheme\\themes\\dark\\svg\\help__icon-foreground.svg',
   'DATA'),
  ('qdarktheme\\themes\\light\\svg\\flip_to_front__icon-foreground.svg',
   'D:\\Python\\rvrkcbot\\venv\\lib\\site-packages\\qdarktheme\\themes\\light\\svg\\flip_to_front__icon-foreground.svg',
   'DATA'),
  ('qdarktheme\\themes\\dark\\svg\\check_box__highlight.svg',
   'D:\\Python\\rvrkcbot\\venv\\lib\\site-packages\\qdarktheme\\themes\\dark\\svg\\check_box__highlight.svg',
   'DATA'),
  ('qdarktheme\\themes\\light\\svg\\restart_alt__icon-foreground.svg',
   'D:\\Python\\rvrkcbot\\venv\\lib\\site-packages\\qdarktheme\\themes\\light\\svg\\restart_alt__icon-foreground.svg',
   'DATA'),
  ('PyQt6\\Qt6\\translations\\qtbase_lv.qm',
   'D:\\Python\\rvrkcbot\\venv\\lib\\site-packages\\PyQt6\\Qt6\\translations\\qtbase_lv.qm',
   'DATA'),
  ('PyQt6\\Qt6\\translations\\qtbase_zh_TW.qm',
   'D:\\Python\\rvrkcbot\\venv\\lib\\site-packages\\PyQt6\\Qt6\\translations\\qtbase_zh_TW.qm',
   'DATA'),
  ('qdarktheme\\themes\\light\\svg\\close__icon-foreground-disabled.svg',
   'D:\\Python\\rvrkcbot\\venv\\lib\\site-packages\\qdarktheme\\themes\\light\\svg\\close__icon-foreground-disabled.svg',
   'DATA'),
  ('qdarktheme\\themes\\light\\svg\\arrow_upward__icon-foreground.svg',
   'D:\\Python\\rvrkcbot\\venv\\lib\\site-packages\\qdarktheme\\themes\\light\\svg\\arrow_upward__icon-foreground.svg',
   'DATA'),
  ('qdarktheme\\themes\\light\\svg\\arrow_drop_up__icon-foreground__rotate-180.svg',
   'D:\\Python\\rvrkcbot\\venv\\lib\\site-packages\\qdarktheme\\themes\\light\\svg\\arrow_drop_up__icon-foreground__rotate-180.svg',
   'DATA'),
  ('PyQt6\\Qt6\\translations\\qtbase_gd.qm',
   'D:\\Python\\rvrkcbot\\venv\\lib\\site-packages\\PyQt6\\Qt6\\translations\\qtbase_gd.qm',
   'DATA'),
  ('qdarktheme\\themes\\light\\svg\\double_arrow__icon-foreground.svg',
   'D:\\Python\\rvrkcbot\\venv\\lib\\site-packages\\qdarktheme\\themes\\light\\svg\\double_arrow__icon-foreground.svg',
   'DATA'),
  ('qdarktheme\\themes\\dark\\svg\\expand_less__icon-foreground-disabled.svg',
   'D:\\Python\\rvrkcbot\\venv\\lib\\site-packages\\qdarktheme\\themes\\dark\\svg\\expand_less__icon-foreground-disabled.svg',
   'DATA'),
  ('qdarktheme\\themes\\dark\\svg\\horizontal_rule__icon-foreground-disabled.svg',
   'D:\\Python\\rvrkcbot\\venv\\lib\\site-packages\\qdarktheme\\themes\\dark\\svg\\horizontal_rule__icon-foreground-disabled.svg',
   'DATA'),
  ('qdarktheme\\themes\\dark\\svg\\arrow_upward__icon-foreground.svg',
   'D:\\Python\\rvrkcbot\\venv\\lib\\site-packages\\qdarktheme\\themes\\dark\\svg\\arrow_upward__icon-foreground.svg',
   'DATA'),
  ('qdarktheme\\themes\\light\\svg\\east__highlight.svg',
   'D:\\Python\\rvrkcbot\\venv\\lib\\site-packages\\qdarktheme\\themes\\light\\svg\\east__highlight.svg',
   'DATA'),
  ('qdarktheme\\themes\\dark\\svg\\arrow_upward__icon-foreground__rotate-90.svg',
   'D:\\Python\\rvrkcbot\\venv\\lib\\site-packages\\qdarktheme\\themes\\dark\\svg\\arrow_upward__icon-foreground__rotate-90.svg',
   'DATA'),
  ('qdarktheme\\themes\\light\\svg\\arrow_drop_up__scrollbar-handle.svg',
   'D:\\Python\\rvrkcbot\\venv\\lib\\site-packages\\qdarktheme\\themes\\light\\svg\\arrow_drop_up__scrollbar-handle.svg',
   'DATA'),
  ('PyQt6\\Qt6\\translations\\qtbase_ja.qm',
   'D:\\Python\\rvrkcbot\\venv\\lib\\site-packages\\PyQt6\\Qt6\\translations\\qtbase_ja.qm',
   'DATA'),
  ('qdarktheme\\themes\\dark\\svg\\check__icon-foreground.svg',
   'D:\\Python\\rvrkcbot\\venv\\lib\\site-packages\\qdarktheme\\themes\\dark\\svg\\check__icon-foreground.svg',
   'DATA'),
  ('PyQt6\\Qt6\\translations\\qtbase_ko.qm',
   'D:\\Python\\rvrkcbot\\venv\\lib\\site-packages\\PyQt6\\Qt6\\translations\\qtbase_ko.qm',
   'DATA'),
  ('qdarktheme\\themes\\dark\\svg\\arrow_drop_up__scrollbar-disabled__rotate-90.svg',
   'D:\\Python\\rvrkcbot\\venv\\lib\\site-packages\\qdarktheme\\themes\\dark\\svg\\arrow_drop_up__scrollbar-disabled__rotate-90.svg',
   'DATA'),
  ('qdarktheme\\themes\\dark\\svg\\expand_less__icon-foreground.svg',
   'D:\\Python\\rvrkcbot\\venv\\lib\\site-packages\\qdarktheme\\themes\\dark\\svg\\expand_less__icon-foreground.svg',
   'DATA'),
  ('qdarktheme\\themes\\dark\\svg\\radio_button_checked__highlight.svg',
   'D:\\Python\\rvrkcbot\\venv\\lib\\site-packages\\qdarktheme\\themes\\dark\\svg\\radio_button_checked__highlight.svg',
   'DATA'),
  ('qdarktheme\\themes\\light\\svg\\radio_button_checked__highlight.svg',
   'D:\\Python\\rvrkcbot\\venv\\lib\\site-packages\\qdarktheme\\themes\\light\\svg\\radio_button_checked__highlight.svg',
   'DATA'),
  ('qdarktheme\\themes\\dark\\svg\\arrow_drop_up__scrollbar-handle-pressed.svg',
   'D:\\Python\\rvrkcbot\\venv\\lib\\site-packages\\qdarktheme\\themes\\dark\\svg\\arrow_drop_up__scrollbar-handle-pressed.svg',
   'DATA'),
  ('qdarktheme\\themes\\dark\\svg\\drag_indicator_horizontal__icon-foreground__rotate-90.svg',
   'D:\\Python\\rvrkcbot\\venv\\lib\\site-packages\\qdarktheme\\themes\\dark\\svg\\drag_indicator_horizontal__icon-foreground__rotate-90.svg',
   'DATA'),
  ('PyQt6\\Qt6\\translations\\qtbase_hr.qm',
   'D:\\Python\\rvrkcbot\\venv\\lib\\site-packages\\PyQt6\\Qt6\\translations\\qtbase_hr.qm',
   'DATA'),
  ('qdarktheme\\themes\\dark\\svg\\chevron_right__icon-foreground.svg',
   'D:\\Python\\rvrkcbot\\venv\\lib\\site-packages\\qdarktheme\\themes\\dark\\svg\\chevron_right__icon-foreground.svg',
   'DATA'),
  ('qdarktheme\\themes\\dark\\svg\\horizontal_rule__icon-foreground.svg',
   'D:\\Python\\rvrkcbot\\venv\\lib\\site-packages\\qdarktheme\\themes\\dark\\svg\\horizontal_rule__icon-foreground.svg',
   'DATA'),
  ('qdarktheme\\themes\\light\\svg\\arrow_drop_up__scrollbar-disabled__rotate-270.svg',
   'D:\\Python\\rvrkcbot\\venv\\lib\\site-packages\\qdarktheme\\themes\\light\\svg\\arrow_drop_up__scrollbar-disabled__rotate-270.svg',
   'DATA'),
  ('qdarktheme\\themes\\dark\\svg\\radio_button_checked__icon-foreground-disabled.svg',
   'D:\\Python\\rvrkcbot\\venv\\lib\\site-packages\\qdarktheme\\themes\\dark\\svg\\radio_button_checked__icon-foreground-disabled.svg',
   'DATA'),
  ('qdarktheme\\themes\\dark\\svg\\check_circle__icon-foreground.svg',
   'D:\\Python\\rvrkcbot\\venv\\lib\\site-packages\\qdarktheme\\themes\\dark\\svg\\check_circle__icon-foreground.svg',
   'DATA'),
  ('qdarktheme\\themes\\dark\\svg\\arrow_drop_up__icon-foreground.svg',
   'D:\\Python\\rvrkcbot\\venv\\lib\\site-packages\\qdarktheme\\themes\\dark\\svg\\arrow_drop_up__icon-foreground.svg',
   'DATA'),
  ('qdarktheme\\themes\\dark\\svg\\arrow_drop_up__icon-foreground__rotate-180.svg',
   'D:\\Python\\rvrkcbot\\venv\\lib\\site-packages\\qdarktheme\\themes\\dark\\svg\\arrow_drop_up__icon-foreground__rotate-180.svg',
   'DATA'),
  ('qdarktheme\\themes\\dark\\svg\\check_box_outline_blank__icon-foreground-disabled.svg',
   'D:\\Python\\rvrkcbot\\venv\\lib\\site-packages\\qdarktheme\\themes\\dark\\svg\\check_box_outline_blank__icon-foreground-disabled.svg',
   'DATA'),
  ('PyQt6\\Qt6\\translations\\qtbase_pt_BR.qm',
   'D:\\Python\\rvrkcbot\\venv\\lib\\site-packages\\PyQt6\\Qt6\\translations\\qtbase_pt_BR.qm',
   'DATA'),
  ('qdarktheme\\themes\\light\\svg\\radio_button_unchecked__icon-foreground-disabled.svg',
   'D:\\Python\\rvrkcbot\\venv\\lib\\site-packages\\qdarktheme\\themes\\light\\svg\\radio_button_unchecked__icon-foreground-disabled.svg',
   'DATA'),
  ('qdarktheme\\themes\\dark\\svg\\check_box_outline_blank__icon-foreground.svg',
   'D:\\Python\\rvrkcbot\\venv\\lib\\site-packages\\qdarktheme\\themes\\dark\\svg\\check_box_outline_blank__icon-foreground.svg',
   'DATA'),
  ('qdarktheme\\themes\\light\\svg\\horizontal_rule__icon-foreground-disabled.svg',
   'D:\\Python\\rvrkcbot\\venv\\lib\\site-packages\\qdarktheme\\themes\\light\\svg\\horizontal_rule__icon-foreground-disabled.svg',
   'DATA'),
  ('PyQt6\\Qt6\\translations\\qtbase_tr.qm',
   'D:\\Python\\rvrkcbot\\venv\\lib\\site-packages\\PyQt6\\Qt6\\translations\\qtbase_tr.qm',
   'DATA'),
  ('qdarktheme\\themes\\light\\svg\\radio_button_unchecked__icon-foreground.svg',
   'D:\\Python\\rvrkcbot\\venv\\lib\\site-packages\\qdarktheme\\themes\\light\\svg\\radio_button_unchecked__icon-foreground.svg',
   'DATA'),
  ('qdarktheme\\themes\\dark\\svg\\arrow_drop_up__scrollbar-handle.svg',
   'D:\\Python\\rvrkcbot\\venv\\lib\\site-packages\\qdarktheme\\themes\\dark\\svg\\arrow_drop_up__scrollbar-handle.svg',
   'DATA'),
  ('qdarktheme\\themes\\dark\\svg\\close__icon-foreground.svg',
   'D:\\Python\\rvrkcbot\\venv\\lib\\site-packages\\qdarktheme\\themes\\dark\\svg\\close__icon-foreground.svg',
   'DATA'),
  ('qdarktheme\\themes\\dark\\svg\\arrow_drop_up__scrollbar-handle__rotate-90.svg',
   'D:\\Python\\rvrkcbot\\venv\\lib\\site-packages\\qdarktheme\\themes\\dark\\svg\\arrow_drop_up__scrollbar-handle__rotate-90.svg',
   'DATA'),
  ('PyQt6\\Qt6\\translations\\qtbase_fi.qm',
   'D:\\Python\\rvrkcbot\\venv\\lib\\site-packages\\PyQt6\\Qt6\\translations\\qtbase_fi.qm',
   'DATA'),
  ('qdarktheme\\themes\\light\\svg\\arrow_drop_up__icon-foreground.svg',
   'D:\\Python\\rvrkcbot\\venv\\lib\\site-packages\\qdarktheme\\themes\\light\\svg\\arrow_drop_up__icon-foreground.svg',
   'DATA'),
  ('qdarktheme\\themes\\dark\\svg\\indeterminate_check_box__highlight.svg',
   'D:\\Python\\rvrkcbot\\venv\\lib\\site-packages\\qdarktheme\\themes\\dark\\svg\\indeterminate_check_box__highlight.svg',
   'DATA'),
  ('qdarktheme\\themes\\light\\svg\\arrow_drop_up__scrollbar-handle-pressed__rotate-90.svg',
   'D:\\Python\\rvrkcbot\\venv\\lib\\site-packages\\qdarktheme\\themes\\light\\svg\\arrow_drop_up__scrollbar-handle-pressed__rotate-90.svg',
   'DATA'),
  ('qdarktheme\\themes\\dark\\svg\\check_box__icon-foreground-disabled.svg',
   'D:\\Python\\rvrkcbot\\venv\\lib\\site-packages\\qdarktheme\\themes\\dark\\svg\\check_box__icon-foreground-disabled.svg',
   'DATA'),
  ('PyQt6\\Qt6\\translations\\qtbase_cs.qm',
   'D:\\Python\\rvrkcbot\\venv\\lib\\site-packages\\PyQt6\\Qt6\\translations\\qtbase_cs.qm',
   'DATA'),
  ('qdarktheme\\themes\\light\\svg\\arrow_upward__icon-foreground__rotate-90.svg',
   'D:\\Python\\rvrkcbot\\venv\\lib\\site-packages\\qdarktheme\\themes\\light\\svg\\arrow_upward__icon-foreground__rotate-90.svg',
   'DATA'),
  ('qdarktheme\\themes\\dark\\svg\\chevron_right__icon-foreground-disabled.svg',
   'D:\\Python\\rvrkcbot\\venv\\lib\\site-packages\\qdarktheme\\themes\\dark\\svg\\chevron_right__icon-foreground-disabled.svg',
   'DATA'),
  ('qdarktheme\\themes\\light\\svg\\close__icon-foreground.svg',
   'D:\\Python\\rvrkcbot\\venv\\lib\\site-packages\\qdarktheme\\themes\\light\\svg\\close__icon-foreground.svg',
   'DATA'),
  ('qdarktheme\\themes\\light\\svg\\drag_indicator_horizontal__icon-foreground__rotate-90.svg',
   'D:\\Python\\rvrkcbot\\venv\\lib\\site-packages\\qdarktheme\\themes\\light\\svg\\drag_indicator_horizontal__icon-foreground__rotate-90.svg',
   'DATA'),
  ('PyQt6\\Qt6\\translations\\qtbase_he.qm',
   'D:\\Python\\rvrkcbot\\venv\\lib\\site-packages\\PyQt6\\Qt6\\translations\\qtbase_he.qm',
   'DATA'),
  ('qdarktheme\\themes\\light\\svg\\arrow_drop_up__scrollbar-handle-pressed__rotate-180.svg',
   'D:\\Python\\rvrkcbot\\venv\\lib\\site-packages\\qdarktheme\\themes\\light\\svg\\arrow_drop_up__scrollbar-handle-pressed__rotate-180.svg',
   'DATA'),
  ('PyQt6\\Qt6\\translations\\qtbase_nn.qm',
   'D:\\Python\\rvrkcbot\\venv\\lib\\site-packages\\PyQt6\\Qt6\\translations\\qtbase_nn.qm',
   'DATA'),
  ('qdarktheme\\themes\\dark\\svg\\vertical_line__guides-stroke-inactive.svg',
   'D:\\Python\\rvrkcbot\\venv\\lib\\site-packages\\qdarktheme\\themes\\dark\\svg\\vertical_line__guides-stroke-inactive.svg',
   'DATA'),
  ('qdarktheme\\themes\\dark\\svg\\expand_less__icon-foreground__rotate-180.svg',
   'D:\\Python\\rvrkcbot\\venv\\lib\\site-packages\\qdarktheme\\themes\\dark\\svg\\expand_less__icon-foreground__rotate-180.svg',
   'DATA'),
  ('PyQt6\\Qt6\\translations\\qtbase_da.qm',
   'D:\\Python\\rvrkcbot\\venv\\lib\\site-packages\\PyQt6\\Qt6\\translations\\qtbase_da.qm',
   'DATA'),
  ('qdarktheme\\themes\\dark\\svg\\restart_alt__icon-foreground.svg',
   'D:\\Python\\rvrkcbot\\venv\\lib\\site-packages\\qdarktheme\\themes\\dark\\svg\\restart_alt__icon-foreground.svg',
   'DATA'),
  ('qdarktheme\\themes\\dark\\svg\\radio_button_unchecked__icon-foreground.svg',
   'D:\\Python\\rvrkcbot\\venv\\lib\\site-packages\\qdarktheme\\themes\\dark\\svg\\radio_button_unchecked__icon-foreground.svg',
   'DATA'),
  ('qdarktheme\\themes\\dark\\svg\\close__tabbar-button-inselected.svg',
   'D:\\Python\\rvrkcbot\\venv\\lib\\site-packages\\qdarktheme\\themes\\dark\\svg\\close__tabbar-button-inselected.svg',
   'DATA'),
  ('qdarktheme\\themes\\dark\\svg\\double_arrow__icon-foreground.svg',
   'D:\\Python\\rvrkcbot\\venv\\lib\\site-packages\\qdarktheme\\themes\\dark\\svg\\double_arrow__icon-foreground.svg',
   'DATA'),
  ('qdarktheme\\themes\\dark\\svg\\double_arrow__icon-foreground-disabled.svg',
   'D:\\Python\\rvrkcbot\\venv\\lib\\site-packages\\qdarktheme\\themes\\dark\\svg\\double_arrow__icon-foreground-disabled.svg',
   'DATA'),
  ('qdarktheme\\themes\\dark\\svg\\indeterminate_check_box__icon-foreground-disabled.svg',
   'D:\\Python\\rvrkcbot\\venv\\lib\\site-packages\\qdarktheme\\themes\\dark\\svg\\indeterminate_check_box__icon-foreground-disabled.svg',
   'DATA'),
  ('PyQt6\\Qt6\\translations\\qtbase_ar.qm',
   'D:\\Python\\rvrkcbot\\venv\\lib\\site-packages\\PyQt6\\Qt6\\translations\\qtbase_ar.qm',
   'DATA'),
  ('qdarktheme\\themes\\light\\svg\\cancel__icon-foreground.svg',
   'D:\\Python\\rvrkcbot\\venv\\lib\\site-packages\\qdarktheme\\themes\\light\\svg\\cancel__icon-foreground.svg',
   'DATA'),
  ('PyQt6\\Qt6\\translations\\qtbase_pl.qm',
   'D:\\Python\\rvrkcbot\\venv\\lib\\site-packages\\PyQt6\\Qt6\\translations\\qtbase_pl.qm',
   'DATA'),
  ('qdarktheme\\themes\\light\\svg\\calendar_today__icon-foreground-disabled.svg',
   'D:\\Python\\rvrkcbot\\venv\\lib\\site-packages\\qdarktheme\\themes\\light\\svg\\calendar_today__icon-foreground-disabled.svg',
   'DATA'),
  ('qdarktheme\\themes\\dark\\svg\\create_new_folder__icon-foreground.svg',
   'D:\\Python\\rvrkcbot\\venv\\lib\\site-packages\\qdarktheme\\themes\\dark\\svg\\create_new_folder__icon-foreground.svg',
   'DATA'),
  ('qdarktheme\\themes\\dark\\svg\\arrow_drop_up__icon-foreground-disabled.svg',
   'D:\\Python\\rvrkcbot\\venv\\lib\\site-packages\\qdarktheme\\themes\\dark\\svg\\arrow_drop_up__icon-foreground-disabled.svg',
   'DATA'),
  ('qdarktheme\\themes\\dark\\svg\\calendar_today__icon-foreground-disabled.svg',
   'D:\\Python\\rvrkcbot\\venv\\lib\\site-packages\\qdarktheme\\themes\\dark\\svg\\calendar_today__icon-foreground-disabled.svg',
   'DATA'),
  ('PyQt6\\Qt6\\translations\\qtbase_hu.qm',
   'D:\\Python\\rvrkcbot\\venv\\lib\\site-packages\\PyQt6\\Qt6\\translations\\qtbase_hu.qm',
   'DATA'),
  ('qdarktheme\\themes\\light\\svg\\arrow_drop_up__scrollbar-handle__rotate-270.svg',
   'D:\\Python\\rvrkcbot\\venv\\lib\\site-packages\\qdarktheme\\themes\\light\\svg\\arrow_drop_up__scrollbar-handle__rotate-270.svg',
   'DATA'),
  ('qdarktheme\\themes\\light\\svg\\expand_less__icon-foreground-disabled.svg',
   'D:\\Python\\rvrkcbot\\venv\\lib\\site-packages\\qdarktheme\\themes\\light\\svg\\expand_less__icon-foreground-disabled.svg',
   'DATA'),
  ('qdarktheme\\themes\\light\\svg\\horizontal_rule__icon-foreground.svg',
   'D:\\Python\\rvrkcbot\\venv\\lib\\site-packages\\qdarktheme\\themes\\light\\svg\\horizontal_rule__icon-foreground.svg',
   'DATA'),
  ('qdarktheme\\themes\\light\\svg\\arrow_drop_up__scrollbar-handle__rotate-90.svg',
   'D:\\Python\\rvrkcbot\\venv\\lib\\site-packages\\qdarktheme\\themes\\light\\svg\\arrow_drop_up__scrollbar-handle__rotate-90.svg',
   'DATA'),
  ('qdarktheme\\themes\\dark\\svg\\save__icon-foreground.svg',
   'D:\\Python\\rvrkcbot\\venv\\lib\\site-packages\\qdarktheme\\themes\\dark\\svg\\save__icon-foreground.svg',
   'DATA'),
  ('PyQt6\\Qt6\\translations\\qtbase_es.qm',
   'D:\\Python\\rvrkcbot\\venv\\lib\\site-packages\\PyQt6\\Qt6\\translations\\qtbase_es.qm',
   'DATA'),
  ('PyQt6\\Qt6\\translations\\qtbase_it.qm',
   'D:\\Python\\rvrkcbot\\venv\\lib\\site-packages\\PyQt6\\Qt6\\translations\\qtbase_it.qm',
   'DATA'),
  ('qdarktheme\\themes\\dark\\svg\\radio_button_unchecked__icon-foreground-disabled.svg',
   'D:\\Python\\rvrkcbot\\venv\\lib\\site-packages\\qdarktheme\\themes\\dark\\svg\\radio_button_unchecked__icon-foreground-disabled.svg',
   'DATA'),
  ('PyQt6\\Qt6\\translations\\qtbase_ru.qm',
   'D:\\Python\\rvrkcbot\\venv\\lib\\site-packages\\PyQt6\\Qt6\\translations\\qtbase_ru.qm',
   'DATA'),
  ('qdarktheme\\themes\\dark\\svg\\arrow_drop_up__scrollbar-handle-pressed__rotate-180.svg',
   'D:\\Python\\rvrkcbot\\venv\\lib\\site-packages\\qdarktheme\\themes\\dark\\svg\\arrow_drop_up__scrollbar-handle-pressed__rotate-180.svg',
   'DATA'),
  ('qdarktheme\\themes\\light\\svg\\expand_less__icon-foreground__rotate-180.svg',
   'D:\\Python\\rvrkcbot\\venv\\lib\\site-packages\\qdarktheme\\themes\\light\\svg\\expand_less__icon-foreground__rotate-180.svg',
   'DATA'),
  ('qdarktheme\\themes\\light\\svg\\arrow_drop_up__scrollbar-handle-pressed.svg',
   'D:\\Python\\rvrkcbot\\venv\\lib\\site-packages\\qdarktheme\\themes\\light\\svg\\arrow_drop_up__scrollbar-handle-pressed.svg',
   'DATA'),
  ('qdarktheme\\themes\\dark\\svg\\arrow_drop_up__scrollbar-handle__rotate-270.svg',
   'D:\\Python\\rvrkcbot\\venv\\lib\\site-packages\\qdarktheme\\themes\\dark\\svg\\arrow_drop_up__scrollbar-handle__rotate-270.svg',
   'DATA'),
  ('qdarktheme\\themes\\dark\\svg\\arrow_drop_up__scrollbar-handle-pressed__rotate-90.svg',
   'D:\\Python\\rvrkcbot\\venv\\lib\\site-packages\\qdarktheme\\themes\\dark\\svg\\arrow_drop_up__scrollbar-handle-pressed__rotate-90.svg',
   'DATA'),
  ('qdarktheme\\themes\\light\\svg\\arrow_drop_up__icon-foreground-disabled.svg',
   'D:\\Python\\rvrkcbot\\venv\\lib\\site-packages\\qdarktheme\\themes\\light\\svg\\arrow_drop_up__icon-foreground-disabled.svg',
   'DATA'),
  ('qdarktheme\\themes\\light\\svg\\check_box__highlight.svg',
   'D:\\Python\\rvrkcbot\\venv\\lib\\site-packages\\qdarktheme\\themes\\light\\svg\\check_box__highlight.svg',
   'DATA'),
  ('qdarktheme\\themes\\light\\svg\\arrow_drop_up__scrollbar-disabled__rotate-90.svg',
   'D:\\Python\\rvrkcbot\\venv\\lib\\site-packages\\qdarktheme\\themes\\light\\svg\\arrow_drop_up__scrollbar-disabled__rotate-90.svg',
   'DATA'),
  ('qdarktheme\\themes\\light\\svg\\check_box_outline_blank__icon-foreground-disabled.svg',
   'D:\\Python\\rvrkcbot\\venv\\lib\\site-packages\\qdarktheme\\themes\\light\\svg\\check_box_outline_blank__icon-foreground-disabled.svg',
   'DATA'),
  ('qdarktheme\\themes\\light\\svg\\close__tabbar-button-inselected.svg',
   'D:\\Python\\rvrkcbot\\venv\\lib\\site-packages\\qdarktheme\\themes\\light\\svg\\close__tabbar-button-inselected.svg',
   'DATA'),
  ('PyQt6\\Qt6\\translations\\qtbase_de.qm',
   'D:\\Python\\rvrkcbot\\venv\\lib\\site-packages\\PyQt6\\Qt6\\translations\\qtbase_de.qm',
   'DATA'),
  ('qdarktheme\\themes\\light\\svg\\expand_less__icon-foreground.svg',
   'D:\\Python\\rvrkcbot\\venv\\lib\\site-packages\\qdarktheme\\themes\\light\\svg\\expand_less__icon-foreground.svg',
   'DATA'),
  ('qdarktheme\\themes\\light\\svg\\indeterminate_check_box__highlight.svg',
   'D:\\Python\\rvrkcbot\\venv\\lib\\site-packages\\qdarktheme\\themes\\light\\svg\\indeterminate_check_box__highlight.svg',
   'DATA'),
  ('qdarktheme\\themes\\light\\svg\\indeterminate_check_box__icon-foreground-disabled.svg',
   'D:\\Python\\rvrkcbot\\venv\\lib\\site-packages\\qdarktheme\\themes\\light\\svg\\indeterminate_check_box__icon-foreground-disabled.svg',
   'DATA'),
  ('qdarktheme\\themes\\light\\svg\\vertical_line__icon-foreground.svg',
   'D:\\Python\\rvrkcbot\\venv\\lib\\site-packages\\qdarktheme\\themes\\light\\svg\\vertical_line__icon-foreground.svg',
   'DATA'),
  ('qdarktheme\\themes\\light\\svg\\arrow_drop_up__scrollbar-disabled__rotate-180.svg',
   'D:\\Python\\rvrkcbot\\venv\\lib\\site-packages\\qdarktheme\\themes\\light\\svg\\arrow_drop_up__scrollbar-disabled__rotate-180.svg',
   'DATA'),
  ('qdarktheme\\themes\\light\\svg\\help__icon-foreground.svg',
   'D:\\Python\\rvrkcbot\\venv\\lib\\site-packages\\qdarktheme\\themes\\light\\svg\\help__icon-foreground.svg',
   'DATA'),
  ('PyQt6\\Qt6\\translations\\qtbase_sk.qm',
   'D:\\Python\\rvrkcbot\\venv\\lib\\site-packages\\PyQt6\\Qt6\\translations\\qtbase_sk.qm',
   'DATA'),
  ('PyQt6\\Qt6\\translations\\qtbase_fa.qm',
   'D:\\Python\\rvrkcbot\\venv\\lib\\site-packages\\PyQt6\\Qt6\\translations\\qtbase_fa.qm',
   'DATA'),
  ('qdarktheme\\themes\\dark\\svg\\east__highlight.svg',
   'D:\\Python\\rvrkcbot\\venv\\lib\\site-packages\\qdarktheme\\themes\\dark\\svg\\east__highlight.svg',
   'DATA'),
  ('qdarktheme\\themes\\light\\svg\\calendar_today__icon-foreground.svg',
   'D:\\Python\\rvrkcbot\\venv\\lib\\site-packages\\qdarktheme\\themes\\light\\svg\\calendar_today__icon-foreground.svg',
   'DATA'),
  ('qdarktheme\\themes\\light\\svg\\delete__icon-foreground.svg',
   'D:\\Python\\rvrkcbot\\venv\\lib\\site-packages\\qdarktheme\\themes\\light\\svg\\delete__icon-foreground.svg',
   'DATA'),
  ('qdarktheme\\themes\\dark\\svg\\flip_to_front__icon-foreground.svg',
   'D:\\Python\\rvrkcbot\\venv\\lib\\site-packages\\qdarktheme\\themes\\dark\\svg\\flip_to_front__icon-foreground.svg',
   'DATA'),
  ('qdarktheme\\themes\\dark\\svg\\folder_open__icon-foreground.svg',
   'D:\\Python\\rvrkcbot\\venv\\lib\\site-packages\\qdarktheme\\themes\\dark\\svg\\folder_open__icon-foreground.svg',
   'DATA'),
  ('qdarktheme\\themes\\light\\svg\\arrow_upward__icon-foreground__rotate-270.svg',
   'D:\\Python\\rvrkcbot\\venv\\lib\\site-packages\\qdarktheme\\themes\\light\\svg\\arrow_upward__icon-foreground__rotate-270.svg',
   'DATA'),
  ('qdarktheme\\themes\\light\\svg\\create_new_folder__icon-foreground.svg',
   'D:\\Python\\rvrkcbot\\venv\\lib\\site-packages\\qdarktheme\\themes\\light\\svg\\create_new_folder__icon-foreground.svg',
   'DATA'),
  ('qdarktheme\\themes\\dark\\svg\\vertical_line__icon-foreground.svg',
   'D:\\Python\\rvrkcbot\\venv\\lib\\site-packages\\qdarktheme\\themes\\dark\\svg\\vertical_line__icon-foreground.svg',
   'DATA'),
  ('qdarktheme\\themes\\light\\svg\\expand_less__icon-foreground-disabled__rotate-180.svg',
   'D:\\Python\\rvrkcbot\\venv\\lib\\site-packages\\qdarktheme\\themes\\light\\svg\\expand_less__icon-foreground-disabled__rotate-180.svg',
   'DATA'),
  ('qdarktheme\\themes\\light\\svg\\horizontal_rule__icon-foreground__rotate-90.svg',
   'D:\\Python\\rvrkcbot\\venv\\lib\\site-packages\\qdarktheme\\themes\\light\\svg\\horizontal_rule__icon-foreground__rotate-90.svg',
   'DATA'),
  ('qdarktheme\\themes\\dark\\svg\\arrow_drop_up__scrollbar-handle__rotate-180.svg',
   'D:\\Python\\rvrkcbot\\venv\\lib\\site-packages\\qdarktheme\\themes\\dark\\svg\\arrow_drop_up__scrollbar-handle__rotate-180.svg',
   'DATA'),
  ('qdarktheme\\themes\\light\\svg\\arrow_drop_up__scrollbar-disabled.svg',
   'D:\\Python\\rvrkcbot\\venv\\lib\\site-packages\\qdarktheme\\themes\\light\\svg\\arrow_drop_up__scrollbar-disabled.svg',
   'DATA'),
  ('qdarktheme\\themes\\dark\\svg\\horizontal_rule__icon-foreground-disabled__rotate-90.svg',
   'D:\\Python\\rvrkcbot\\venv\\lib\\site-packages\\qdarktheme\\themes\\dark\\svg\\horizontal_rule__icon-foreground-disabled__rotate-90.svg',
   'DATA'),
  ('qdarktheme\\themes\\dark\\svg\\close__icon-foreground-disabled.svg',
   'D:\\Python\\rvrkcbot\\venv\\lib\\site-packages\\qdarktheme\\themes\\dark\\svg\\close__icon-foreground-disabled.svg',
   'DATA'),
  ('qdarktheme\\themes\\light\\svg\\horizontal_rule__icon-foreground-disabled__rotate-90.svg',
   'D:\\Python\\rvrkcbot\\venv\\lib\\site-packages\\qdarktheme\\themes\\light\\svg\\horizontal_rule__icon-foreground-disabled__rotate-90.svg',
   'DATA'),
  ('qdarktheme\\themes\\dark\\svg\\arrow_upward__icon-foreground__rotate-270.svg',
   'D:\\Python\\rvrkcbot\\venv\\lib\\site-packages\\qdarktheme\\themes\\dark\\svg\\arrow_upward__icon-foreground__rotate-270.svg',
   'DATA'),
  ('PyQt6\\Qt6\\translations\\qtbase_fr.qm',
   'D:\\Python\\rvrkcbot\\venv\\lib\\site-packages\\PyQt6\\Qt6\\translations\\qtbase_fr.qm',
   'DATA'),
  ('qdarktheme\\themes\\light\\svg\\arrow_drop_up__scrollbar-handle__rotate-180.svg',
   'D:\\Python\\rvrkcbot\\venv\\lib\\site-packages\\qdarktheme\\themes\\light\\svg\\arrow_drop_up__scrollbar-handle__rotate-180.svg',
   'DATA'),
  ('qdarktheme\\themes\\light\\svg\\drag_indicator_horizontal__icon-foreground.svg',
   'D:\\Python\\rvrkcbot\\venv\\lib\\site-packages\\qdarktheme\\themes\\light\\svg\\drag_indicator_horizontal__icon-foreground.svg',
   'DATA'),
  ('qdarktheme\\themes\\light\\svg\\vertical_line__guides-stroke-inactive.svg',
   'D:\\Python\\rvrkcbot\\venv\\lib\\site-packages\\qdarktheme\\themes\\light\\svg\\vertical_line__guides-stroke-inactive.svg',
   'DATA'),
  ('PyQt6\\Qt6\\translations\\qtbase_uk.qm',
   'D:\\Python\\rvrkcbot\\venv\\lib\\site-packages\\PyQt6\\Qt6\\translations\\qtbase_uk.qm',
   'DATA'),
  ('PyQt6\\Qt6\\translations\\qtbase_nl.qm',
   'D:\\Python\\rvrkcbot\\venv\\lib\\site-packages\\PyQt6\\Qt6\\translations\\qtbase_nl.qm',
   'DATA'),
  ('qdarktheme\\themes\\light\\svg\\save__icon-foreground.svg',
   'D:\\Python\\rvrkcbot\\venv\\lib\\site-packages\\qdarktheme\\themes\\light\\svg\\save__icon-foreground.svg',
   'DATA'),
  ('PyQt6\\Qt6\\translations\\qtbase_ca.qm',
   'D:\\Python\\rvrkcbot\\venv\\lib\\site-packages\\PyQt6\\Qt6\\translations\\qtbase_ca.qm',
   'DATA'),
  ('qdarktheme\\themes\\light\\svg\\double_arrow__icon-foreground-disabled.svg',
   'D:\\Python\\rvrkcbot\\venv\\lib\\site-packages\\qdarktheme\\themes\\light\\svg\\double_arrow__icon-foreground-disabled.svg',
   'DATA'),
  ('PyQt6\\Qt6\\translations\\qtbase_bg.qm',
   'D:\\Python\\rvrkcbot\\venv\\lib\\site-packages\\PyQt6\\Qt6\\translations\\qtbase_bg.qm',
   'DATA'),
  ('qdarktheme\\themes\\light\\svg\\radio_button_checked__icon-foreground-disabled.svg',
   'D:\\Python\\rvrkcbot\\venv\\lib\\site-packages\\qdarktheme\\themes\\light\\svg\\radio_button_checked__icon-foreground-disabled.svg',
   'DATA'),
  ('qdarktheme\\themes\\dark\\svg\\arrow_drop_up__scrollbar-disabled__rotate-270.svg',
   'D:\\Python\\rvrkcbot\\venv\\lib\\site-packages\\qdarktheme\\themes\\dark\\svg\\arrow_drop_up__scrollbar-disabled__rotate-270.svg',
   'DATA'),
  ('qdarktheme\\themes\\dark\\svg\\arrow_drop_up__icon-foreground-disabled__rotate-180.svg',
   'D:\\Python\\rvrkcbot\\venv\\lib\\site-packages\\qdarktheme\\themes\\dark\\svg\\arrow_drop_up__icon-foreground-disabled__rotate-180.svg',
   'DATA'),
  ('qdarktheme\\themes\\light\\svg\\check__icon-foreground.svg',
   'D:\\Python\\rvrkcbot\\venv\\lib\\site-packages\\qdarktheme\\themes\\light\\svg\\check__icon-foreground.svg',
   'DATA'),
  ('qdarktheme\\themes\\light\\svg\\vertical_line__icon-foreground-disabled.svg',
   'D:\\Python\\rvrkcbot\\venv\\lib\\site-packages\\qdarktheme\\themes\\light\\svg\\vertical_line__icon-foreground-disabled.svg',
   'DATA')],
 [])
