('D:\\Python\\pyqt6\\dist\\workers.exe',
 False,
 False,
 False,
 'D:\\Python\\rvrkcbot\\venv\\lib\\site-packages\\PyInstaller\\bootloader\\images\\icon-windowed.ico',
 None,
 False,
 False,
 '<?xml version="1.0" encoding="UTF-8" standalone="yes"?><assembly xmlns="urn:schemas-microsoft-com:asm.v1" manifestVersion="1.0"><assemblyIdentity type="win32" name="workers" processorArchitecture="amd64" version="1.0.0.0"/><trustInfo xmlns="urn:schemas-microsoft-com:asm.v3"><security><requestedPrivileges><requestedExecutionLevel level="asInvoker" uiAccess="false"/></requestedPrivileges></security></trustInfo><dependency><dependentAssembly><assemblyIdentity type="win32" name="Microsoft.Windows.Common-Controls" language="*" processorArchitecture="*" version="6.0.0.0" publicKeyToken="6595b64144ccf1df"/></dependentAssembly></dependency><compatibility xmlns="urn:schemas-microsoft-com:compatibility.v1"><application><supportedOS Id="{e2011457-1546-43c5-a5fe-008deee3d3f0}"/><supportedOS Id="{35138b9a-5d96-4fbd-8e2d-a2440225f93a}"/><supportedOS Id="{4a2f28e3-53b9-4441-ba9c-d69d4a4a6e38}"/><supportedOS Id="{1f676c76-80e1-4239-95bb-83d0f6d0da78}"/><supportedOS Id="{8e0f7a12-bfb3-4fe8-b9a5-48fd50a15a9a}"/></application></compatibility><application xmlns="urn:schemas-microsoft-com:asm.v3"><windowsSettings><longPathAware xmlns="http://schemas.microsoft.com/SMI/2016/WindowsSettings">true</longPathAware></windowsSettings></application></assembly>',
 True,
 True,
 False,
 None,
 None,
 None,
 'D:\\Python\\pyqt6\\build\\workers\\workers.pkg',
 [('PYZ-00.pyz', 'D:\\Python\\pyqt6\\build\\workers\\PYZ-00.pyz', 'PYZ'),
  ('struct',
   'D:\\Python\\pyqt6\\build\\workers\\localpycs\\struct.pyc',
   'PYMODULE'),
  ('pyimod01_archive',
   'D:\\Python\\pyqt6\\build\\workers\\localpycs\\pyimod01_archive.pyc',
   'PYMODULE'),
  ('pyimod02_importers',
   'D:\\Python\\pyqt6\\build\\workers\\localpycs\\pyimod02_importers.pyc',
   'PYMODULE'),
  ('pyimod03_ctypes',
   'D:\\Python\\pyqt6\\build\\workers\\localpycs\\pyimod03_ctypes.pyc',
   'PYMODULE'),
  ('pyiboot01_bootstrap',
   'D:\\Python\\rvrkcbot\\venv\\lib\\site-packages\\PyInstaller\\loader\\pyiboot01_bootstrap.py',
   'PYSOURCE'),
  ('pyi_rth_inspect',
   'D:\\Python\\rvrkcbot\\venv\\Lib\\site-packages\\PyInstaller\\hooks\\rthooks\\pyi_rth_inspect.py',
   'PYSOURCE'),
  ('pyi_rth_subprocess',
   'D:\\Python\\rvrkcbot\\venv\\Lib\\site-packages\\PyInstaller\\hooks\\rthooks\\pyi_rth_subprocess.py',
   'PYSOURCE'),
  ('pyi_rth_pyqt6',
   'D:\\Python\\rvrkcbot\\venv\\Lib\\site-packages\\PyInstaller\\hooks\\rthooks\\pyi_rth_pyqt6.py',
   'PYSOURCE'),
  ('pyi_rth_pkgutil',
   'D:\\Python\\rvrkcbot\\venv\\Lib\\site-packages\\PyInstaller\\hooks\\rthooks\\pyi_rth_pkgutil.py',
   'PYSOURCE'),
  ('workers', 'D:\\Python\\pyqt6\\workers.py', 'PYSOURCE'),
  ('python310.dll',
   'C:\\Users\\nidxegg.RKC\\AppData\\Local\\Programs\\Python\\Python310\\python310.dll',
   'BINARY'),
  ('VCRUNTIME140.dll',
   'C:\\Users\\nidxegg.RKC\\AppData\\Local\\Programs\\Python\\Python310\\VCRUNTIME140.dll',
   'BINARY'),
  ('PyQt6\\Qt6\\plugins\\imageformats\\qico.dll',
   'D:\\Python\\rvrkcbot\\venv\\lib\\site-packages\\PyQt6\\Qt6\\plugins\\imageformats\\qico.dll',
   'BINARY'),
  ('PyQt6\\Qt6\\plugins\\styles\\qwindowsvistastyle.dll',
   'D:\\Python\\rvrkcbot\\venv\\lib\\site-packages\\PyQt6\\Qt6\\plugins\\styles\\qwindowsvistastyle.dll',
   'BINARY'),
  ('PyQt6\\Qt6\\plugins\\imageformats\\qjpeg.dll',
   'D:\\Python\\rvrkcbot\\venv\\lib\\site-packages\\PyQt6\\Qt6\\plugins\\imageformats\\qjpeg.dll',
   'BINARY'),
  ('PyQt6\\Qt6\\plugins\\platforms\\qoffscreen.dll',
   'D:\\Python\\rvrkcbot\\venv\\lib\\site-packages\\PyQt6\\Qt6\\plugins\\platforms\\qoffscreen.dll',
   'BINARY'),
  ('PyQt6\\Qt6\\plugins\\imageformats\\qicns.dll',
   'D:\\Python\\rvrkcbot\\venv\\lib\\site-packages\\PyQt6\\Qt6\\plugins\\imageformats\\qicns.dll',
   'BINARY'),
  ('PyQt6\\Qt6\\plugins\\imageformats\\qtga.dll',
   'D:\\Python\\rvrkcbot\\venv\\lib\\site-packages\\PyQt6\\Qt6\\plugins\\imageformats\\qtga.dll',
   'BINARY'),
  ('opengl32sw.dll',
   'D:\\Python\\rvrkcbot\\venv\\lib\\site-packages\\PyQt6\\Qt6\\bin\\opengl32sw.dll',
   'BINARY'),
  ('PyQt6\\Qt6\\plugins\\imageformats\\qsvg.dll',
   'D:\\Python\\rvrkcbot\\venv\\lib\\site-packages\\PyQt6\\Qt6\\plugins\\imageformats\\qsvg.dll',
   'BINARY'),
  ('PyQt6\\Qt6\\plugins\\imageformats\\qwbmp.dll',
   'D:\\Python\\rvrkcbot\\venv\\lib\\site-packages\\PyQt6\\Qt6\\plugins\\imageformats\\qwbmp.dll',
   'BINARY'),
  ('PyQt6\\Qt6\\plugins\\iconengines\\qsvgicon.dll',
   'D:\\Python\\rvrkcbot\\venv\\lib\\site-packages\\PyQt6\\Qt6\\plugins\\iconengines\\qsvgicon.dll',
   'BINARY'),
  ('PyQt6\\Qt6\\plugins\\platforms\\qminimal.dll',
   'D:\\Python\\rvrkcbot\\venv\\lib\\site-packages\\PyQt6\\Qt6\\plugins\\platforms\\qminimal.dll',
   'BINARY'),
  ('PyQt6\\Qt6\\plugins\\imageformats\\qgif.dll',
   'D:\\Python\\rvrkcbot\\venv\\lib\\site-packages\\PyQt6\\Qt6\\plugins\\imageformats\\qgif.dll',
   'BINARY'),
  ('PyQt6\\Qt6\\plugins\\imageformats\\qwebp.dll',
   'D:\\Python\\rvrkcbot\\venv\\lib\\site-packages\\PyQt6\\Qt6\\plugins\\imageformats\\qwebp.dll',
   'BINARY'),
  ('PyQt6\\Qt6\\plugins\\platforms\\qwindows.dll',
   'D:\\Python\\rvrkcbot\\venv\\lib\\site-packages\\PyQt6\\Qt6\\plugins\\platforms\\qwindows.dll',
   'BINARY'),
  ('PyQt6\\Qt6\\plugins\\imageformats\\qtiff.dll',
   'D:\\Python\\rvrkcbot\\venv\\lib\\site-packages\\PyQt6\\Qt6\\plugins\\imageformats\\qtiff.dll',
   'BINARY'),
  ('_decimal',
   'C:\\Users\\nidxegg.RKC\\AppData\\Local\\Programs\\Python\\Python310\\DLLs\\_decimal.pyd',
   'EXTENSION'),
  ('_hashlib',
   'C:\\Users\\nidxegg.RKC\\AppData\\Local\\Programs\\Python\\Python310\\DLLs\\_hashlib.pyd',
   'EXTENSION'),
  ('_lzma',
   'C:\\Users\\nidxegg.RKC\\AppData\\Local\\Programs\\Python\\Python310\\DLLs\\_lzma.pyd',
   'EXTENSION'),
  ('_bz2',
   'C:\\Users\\nidxegg.RKC\\AppData\\Local\\Programs\\Python\\Python310\\DLLs\\_bz2.pyd',
   'EXTENSION'),
  ('select',
   'C:\\Users\\nidxegg.RKC\\AppData\\Local\\Programs\\Python\\Python310\\DLLs\\select.pyd',
   'EXTENSION'),
  ('_socket',
   'C:\\Users\\nidxegg.RKC\\AppData\\Local\\Programs\\Python\\Python310\\DLLs\\_socket.pyd',
   'EXTENSION'),
  ('unicodedata',
   'C:\\Users\\nidxegg.RKC\\AppData\\Local\\Programs\\Python\\Python310\\DLLs\\unicodedata.pyd',
   'EXTENSION'),
  ('_ssl',
   'C:\\Users\\nidxegg.RKC\\AppData\\Local\\Programs\\Python\\Python310\\DLLs\\_ssl.pyd',
   'EXTENSION'),
  ('_ctypes',
   'C:\\Users\\nidxegg.RKC\\AppData\\Local\\Programs\\Python\\Python310\\DLLs\\_ctypes.pyd',
   'EXTENSION'),
  ('PyQt6.QtWidgets',
   'D:\\Python\\rvrkcbot\\venv\\lib\\site-packages\\PyQt6\\QtWidgets.pyd',
   'EXTENSION'),
  ('PyQt6.QtGui',
   'D:\\Python\\rvrkcbot\\venv\\lib\\site-packages\\PyQt6\\QtGui.pyd',
   'EXTENSION'),
  ('PyQt6.QtCore',
   'D:\\Python\\rvrkcbot\\venv\\lib\\site-packages\\PyQt6\\QtCore.pyd',
   'EXTENSION'),
  ('PyQt6.sip',
   'D:\\Python\\rvrkcbot\\venv\\lib\\site-packages\\PyQt6\\sip.cp310-win_amd64.pyd',
   'EXTENSION'),
  ('PyQt6.QtSvg',
   'D:\\Python\\rvrkcbot\\venv\\lib\\site-packages\\PyQt6\\QtSvg.pyd',
   'EXTENSION'),
  ('Qt6Gui.dll',
   'D:\\Python\\rvrkcbot\\venv\\lib\\site-packages\\PyQt6\\Qt6\\bin\\Qt6Gui.dll',
   'BINARY'),
  ('Qt6Core.dll',
   'D:\\Python\\rvrkcbot\\venv\\lib\\site-packages\\PyQt6\\Qt6\\bin\\Qt6Core.dll',
   'BINARY'),
  ('Qt6Widgets.dll',
   'D:\\Python\\rvrkcbot\\venv\\lib\\site-packages\\PyQt6\\Qt6\\bin\\Qt6Widgets.dll',
   'BINARY'),
  ('VCRUNTIME140_1.dll',
   'C:\\Users\\nidxegg.RKC\\AppData\\Local\\Programs\\Python\\Python310\\VCRUNTIME140_1.dll',
   'BINARY'),
  ('Qt6Svg.dll',
   'D:\\Python\\rvrkcbot\\venv\\lib\\site-packages\\PyQt6\\Qt6\\bin\\Qt6Svg.dll',
   'BINARY'),
  ('MSVCP140.dll', 'C:\\Windows\\system32\\MSVCP140.dll', 'BINARY'),
  ('libcrypto-1_1.dll',
   'C:\\Users\\nidxegg.RKC\\AppData\\Local\\Programs\\Python\\Python310\\DLLs\\libcrypto-1_1.dll',
   'BINARY'),
  ('libssl-1_1.dll',
   'C:\\Users\\nidxegg.RKC\\AppData\\Local\\Programs\\Python\\Python310\\DLLs\\libssl-1_1.dll',
   'BINARY'),
  ('libffi-7.dll',
   'C:\\Users\\nidxegg.RKC\\AppData\\Local\\Programs\\Python\\Python310\\DLLs\\libffi-7.dll',
   'BINARY'),
  ('python3.dll',
   'C:\\Users\\nidxegg.RKC\\AppData\\Local\\Programs\\Python\\Python310\\python3.dll',
   'BINARY'),
  ('MSVCP140_2.dll', 'C:\\Windows\\system32\\MSVCP140_2.dll', 'BINARY'),
  ('MSVCP140_1.dll',
   'D:\\Python\\rvrkcbot\\venv\\lib\\site-packages\\PyQt6\\Qt6\\bin\\MSVCP140_1.dll',
   'BINARY'),
  ('base_library.zip',
   'D:\\Python\\pyqt6\\build\\workers\\base_library.zip',
   'DATA'),
  ('qdarktheme\\themes\\light\\svg\\calendar_today__icon-foreground.svg',
   'D:\\Python\\rvrkcbot\\venv\\lib\\site-packages\\qdarktheme\\themes\\light\\svg\\calendar_today__icon-foreground.svg',
   'DATA'),
  ('PyQt6\\Qt6\\translations\\qtbase_lv.qm',
   'D:\\Python\\rvrkcbot\\venv\\lib\\site-packages\\PyQt6\\Qt6\\translations\\qtbase_lv.qm',
   'DATA'),
  ('qdarktheme\\themes\\light\\svg\\close__icon-foreground-disabled.svg',
   'D:\\Python\\rvrkcbot\\venv\\lib\\site-packages\\qdarktheme\\themes\\light\\svg\\close__icon-foreground-disabled.svg',
   'DATA'),
  ('qdarktheme\\themes\\light\\svg\\check_box__icon-foreground-disabled.svg',
   'D:\\Python\\rvrkcbot\\venv\\lib\\site-packages\\qdarktheme\\themes\\light\\svg\\check_box__icon-foreground-disabled.svg',
   'DATA'),
  ('qdarktheme\\themes\\dark\\svg\\folder_open__icon-foreground.svg',
   'D:\\Python\\rvrkcbot\\venv\\lib\\site-packages\\qdarktheme\\themes\\dark\\svg\\folder_open__icon-foreground.svg',
   'DATA'),
  ('qdarktheme\\themes\\dark\\svg\\help__icon-foreground.svg',
   'D:\\Python\\rvrkcbot\\venv\\lib\\site-packages\\qdarktheme\\themes\\dark\\svg\\help__icon-foreground.svg',
   'DATA'),
  ('qdarktheme\\themes\\light\\svg\\expand_less__icon-foreground.svg',
   'D:\\Python\\rvrkcbot\\venv\\lib\\site-packages\\qdarktheme\\themes\\light\\svg\\expand_less__icon-foreground.svg',
   'DATA'),
  ('qdarktheme\\themes\\dark\\svg\\chevron_right__icon-foreground.svg',
   'D:\\Python\\rvrkcbot\\venv\\lib\\site-packages\\qdarktheme\\themes\\dark\\svg\\chevron_right__icon-foreground.svg',
   'DATA'),
  ('qdarktheme\\themes\\light\\svg\\arrow_drop_up__scrollbar-handle-pressed.svg',
   'D:\\Python\\rvrkcbot\\venv\\lib\\site-packages\\qdarktheme\\themes\\light\\svg\\arrow_drop_up__scrollbar-handle-pressed.svg',
   'DATA'),
  ('PyQt6\\Qt6\\translations\\qtbase_de.qm',
   'D:\\Python\\rvrkcbot\\venv\\lib\\site-packages\\PyQt6\\Qt6\\translations\\qtbase_de.qm',
   'DATA'),
  ('qdarktheme\\themes\\dark\\svg\\radio_button_unchecked__icon-foreground-disabled.svg',
   'D:\\Python\\rvrkcbot\\venv\\lib\\site-packages\\qdarktheme\\themes\\dark\\svg\\radio_button_unchecked__icon-foreground-disabled.svg',
   'DATA'),
  ('PyQt6\\Qt6\\translations\\qtbase_ru.qm',
   'D:\\Python\\rvrkcbot\\venv\\lib\\site-packages\\PyQt6\\Qt6\\translations\\qtbase_ru.qm',
   'DATA'),
  ('qdarktheme\\themes\\light\\svg\\check_box_outline_blank__icon-foreground.svg',
   'D:\\Python\\rvrkcbot\\venv\\lib\\site-packages\\qdarktheme\\themes\\light\\svg\\check_box_outline_blank__icon-foreground.svg',
   'DATA'),
  ('qdarktheme\\themes\\dark\\svg\\arrow_upward__icon-foreground.svg',
   'D:\\Python\\rvrkcbot\\venv\\lib\\site-packages\\qdarktheme\\themes\\dark\\svg\\arrow_upward__icon-foreground.svg',
   'DATA'),
  ('PyQt6\\Qt6\\translations\\qtbase_nl.qm',
   'D:\\Python\\rvrkcbot\\venv\\lib\\site-packages\\PyQt6\\Qt6\\translations\\qtbase_nl.qm',
   'DATA'),
  ('qdarktheme\\themes\\light\\svg\\indeterminate_check_box__icon-foreground-disabled.svg',
   'D:\\Python\\rvrkcbot\\venv\\lib\\site-packages\\qdarktheme\\themes\\light\\svg\\indeterminate_check_box__icon-foreground-disabled.svg',
   'DATA'),
  ('qdarktheme\\themes\\dark\\svg\\delete__icon-foreground.svg',
   'D:\\Python\\rvrkcbot\\venv\\lib\\site-packages\\qdarktheme\\themes\\dark\\svg\\delete__icon-foreground.svg',
   'DATA'),
  ('qdarktheme\\themes\\dark\\svg\\check_box_outline_blank__icon-foreground-disabled.svg',
   'D:\\Python\\rvrkcbot\\venv\\lib\\site-packages\\qdarktheme\\themes\\dark\\svg\\check_box_outline_blank__icon-foreground-disabled.svg',
   'DATA'),
  ('qdarktheme\\themes\\light\\svg\\arrow_drop_up__icon-foreground-disabled__rotate-180.svg',
   'D:\\Python\\rvrkcbot\\venv\\lib\\site-packages\\qdarktheme\\themes\\light\\svg\\arrow_drop_up__icon-foreground-disabled__rotate-180.svg',
   'DATA'),
  ('qdarktheme\\themes\\light\\svg\\radio_button_checked__highlight.svg',
   'D:\\Python\\rvrkcbot\\venv\\lib\\site-packages\\qdarktheme\\themes\\light\\svg\\radio_button_checked__highlight.svg',
   'DATA'),
  ('qdarktheme\\themes\\dark\\svg\\radio_button_unchecked__icon-foreground.svg',
   'D:\\Python\\rvrkcbot\\venv\\lib\\site-packages\\qdarktheme\\themes\\dark\\svg\\radio_button_unchecked__icon-foreground.svg',
   'DATA'),
  ('qdarktheme\\themes\\light\\svg\\double_arrow__icon-foreground.svg',
   'D:\\Python\\rvrkcbot\\venv\\lib\\site-packages\\qdarktheme\\themes\\light\\svg\\double_arrow__icon-foreground.svg',
   'DATA'),
  ('qdarktheme\\themes\\dark\\svg\\arrow_drop_up__scrollbar-handle__rotate-180.svg',
   'D:\\Python\\rvrkcbot\\venv\\lib\\site-packages\\qdarktheme\\themes\\dark\\svg\\arrow_drop_up__scrollbar-handle__rotate-180.svg',
   'DATA'),
  ('qdarktheme\\themes\\dark\\svg\\calendar_today__icon-foreground.svg',
   'D:\\Python\\rvrkcbot\\venv\\lib\\site-packages\\qdarktheme\\themes\\dark\\svg\\calendar_today__icon-foreground.svg',
   'DATA'),
  ('qdarktheme\\themes\\light\\svg\\expand_less__icon-foreground-disabled.svg',
   'D:\\Python\\rvrkcbot\\venv\\lib\\site-packages\\qdarktheme\\themes\\light\\svg\\expand_less__icon-foreground-disabled.svg',
   'DATA'),
  ('qdarktheme\\themes\\light\\svg\\horizontal_rule__icon-foreground-disabled.svg',
   'D:\\Python\\rvrkcbot\\venv\\lib\\site-packages\\qdarktheme\\themes\\light\\svg\\horizontal_rule__icon-foreground-disabled.svg',
   'DATA'),
  ('qdarktheme\\themes\\dark\\svg\\chevron_right__icon-foreground-disabled.svg',
   'D:\\Python\\rvrkcbot\\venv\\lib\\site-packages\\qdarktheme\\themes\\dark\\svg\\chevron_right__icon-foreground-disabled.svg',
   'DATA'),
  ('PyQt6\\Qt6\\translations\\qtbase_ar.qm',
   'D:\\Python\\rvrkcbot\\venv\\lib\\site-packages\\PyQt6\\Qt6\\translations\\qtbase_ar.qm',
   'DATA'),
  ('qdarktheme\\themes\\light\\svg\\arrow_drop_up__scrollbar-disabled__rotate-180.svg',
   'D:\\Python\\rvrkcbot\\venv\\lib\\site-packages\\qdarktheme\\themes\\light\\svg\\arrow_drop_up__scrollbar-disabled__rotate-180.svg',
   'DATA'),
  ('qdarktheme\\themes\\dark\\svg\\arrow_drop_up__scrollbar-handle-pressed__rotate-90.svg',
   'D:\\Python\\rvrkcbot\\venv\\lib\\site-packages\\qdarktheme\\themes\\dark\\svg\\arrow_drop_up__scrollbar-handle-pressed__rotate-90.svg',
   'DATA'),
  ('qdarktheme\\themes\\light\\svg\\radio_button_checked__icon-foreground-disabled.svg',
   'D:\\Python\\rvrkcbot\\venv\\lib\\site-packages\\qdarktheme\\themes\\light\\svg\\radio_button_checked__icon-foreground-disabled.svg',
   'DATA'),
  ('PyQt6\\Qt6\\translations\\qtbase_bg.qm',
   'D:\\Python\\rvrkcbot\\venv\\lib\\site-packages\\PyQt6\\Qt6\\translations\\qtbase_bg.qm',
   'DATA'),
  ('qdarktheme\\themes\\light\\svg\\calendar_today__icon-foreground-disabled.svg',
   'D:\\Python\\rvrkcbot\\venv\\lib\\site-packages\\qdarktheme\\themes\\light\\svg\\calendar_today__icon-foreground-disabled.svg',
   'DATA'),
  ('qdarktheme\\themes\\light\\svg\\arrow_drop_up__scrollbar-handle-pressed__rotate-270.svg',
   'D:\\Python\\rvrkcbot\\venv\\lib\\site-packages\\qdarktheme\\themes\\light\\svg\\arrow_drop_up__scrollbar-handle-pressed__rotate-270.svg',
   'DATA'),
  ('qdarktheme\\themes\\light\\svg\\check_circle__icon-foreground.svg',
   'D:\\Python\\rvrkcbot\\venv\\lib\\site-packages\\qdarktheme\\themes\\light\\svg\\check_circle__icon-foreground.svg',
   'DATA'),
  ('PyQt6\\Qt6\\translations\\qtbase_da.qm',
   'D:\\Python\\rvrkcbot\\venv\\lib\\site-packages\\PyQt6\\Qt6\\translations\\qtbase_da.qm',
   'DATA'),
  ('PyQt6\\Qt6\\translations\\qtbase_hr.qm',
   'D:\\Python\\rvrkcbot\\venv\\lib\\site-packages\\PyQt6\\Qt6\\translations\\qtbase_hr.qm',
   'DATA'),
  ('PyQt6\\Qt6\\translations\\qtbase_es.qm',
   'D:\\Python\\rvrkcbot\\venv\\lib\\site-packages\\PyQt6\\Qt6\\translations\\qtbase_es.qm',
   'DATA'),
  ('qdarktheme\\themes\\light\\svg\\arrow_drop_up__icon-foreground-disabled.svg',
   'D:\\Python\\rvrkcbot\\venv\\lib\\site-packages\\qdarktheme\\themes\\light\\svg\\arrow_drop_up__icon-foreground-disabled.svg',
   'DATA'),
  ('PyQt6\\Qt6\\translations\\qtbase_pt_BR.qm',
   'D:\\Python\\rvrkcbot\\venv\\lib\\site-packages\\PyQt6\\Qt6\\translations\\qtbase_pt_BR.qm',
   'DATA'),
  ('qdarktheme\\themes\\dark\\svg\\horizontal_rule__icon-foreground__rotate-90.svg',
   'D:\\Python\\rvrkcbot\\venv\\lib\\site-packages\\qdarktheme\\themes\\dark\\svg\\horizontal_rule__icon-foreground__rotate-90.svg',
   'DATA'),
  ('qdarktheme\\themes\\dark\\svg\\indeterminate_check_box__icon-foreground-disabled.svg',
   'D:\\Python\\rvrkcbot\\venv\\lib\\site-packages\\qdarktheme\\themes\\dark\\svg\\indeterminate_check_box__icon-foreground-disabled.svg',
   'DATA'),
  ('qdarktheme\\themes\\dark\\svg\\arrow_drop_up__icon-foreground.svg',
   'D:\\Python\\rvrkcbot\\venv\\lib\\site-packages\\qdarktheme\\themes\\dark\\svg\\arrow_drop_up__icon-foreground.svg',
   'DATA'),
  ('qdarktheme\\themes\\light\\svg\\check__icon-foreground.svg',
   'D:\\Python\\rvrkcbot\\venv\\lib\\site-packages\\qdarktheme\\themes\\light\\svg\\check__icon-foreground.svg',
   'DATA'),
  ('qdarktheme\\themes\\dark\\svg\\arrow_drop_up__scrollbar-handle-pressed__rotate-270.svg',
   'D:\\Python\\rvrkcbot\\venv\\lib\\site-packages\\qdarktheme\\themes\\dark\\svg\\arrow_drop_up__scrollbar-handle-pressed__rotate-270.svg',
   'DATA'),
  ('qdarktheme\\themes\\dark\\svg\\flip_to_front__icon-foreground.svg',
   'D:\\Python\\rvrkcbot\\venv\\lib\\site-packages\\qdarktheme\\themes\\dark\\svg\\flip_to_front__icon-foreground.svg',
   'DATA'),
  ('qdarktheme\\themes\\dark\\svg\\double_arrow__icon-foreground.svg',
   'D:\\Python\\rvrkcbot\\venv\\lib\\site-packages\\qdarktheme\\themes\\dark\\svg\\double_arrow__icon-foreground.svg',
   'DATA'),
  ('qdarktheme\\themes\\dark\\svg\\arrow_drop_up__scrollbar-disabled__rotate-270.svg',
   'D:\\Python\\rvrkcbot\\venv\\lib\\site-packages\\qdarktheme\\themes\\dark\\svg\\arrow_drop_up__scrollbar-disabled__rotate-270.svg',
   'DATA'),
  ('qdarktheme\\themes\\light\\svg\\expand_less__icon-foreground-disabled__rotate-180.svg',
   'D:\\Python\\rvrkcbot\\venv\\lib\\site-packages\\qdarktheme\\themes\\light\\svg\\expand_less__icon-foreground-disabled__rotate-180.svg',
   'DATA'),
  ('qdarktheme\\themes\\light\\svg\\east__highlight.svg',
   'D:\\Python\\rvrkcbot\\venv\\lib\\site-packages\\qdarktheme\\themes\\light\\svg\\east__highlight.svg',
   'DATA'),
  ('qdarktheme\\themes\\light\\svg\\arrow_drop_up__scrollbar-handle__rotate-180.svg',
   'D:\\Python\\rvrkcbot\\venv\\lib\\site-packages\\qdarktheme\\themes\\light\\svg\\arrow_drop_up__scrollbar-handle__rotate-180.svg',
   'DATA'),
  ('PyQt6\\Qt6\\translations\\qtbase_fr.qm',
   'D:\\Python\\rvrkcbot\\venv\\lib\\site-packages\\PyQt6\\Qt6\\translations\\qtbase_fr.qm',
   'DATA'),
  ('qdarktheme\\themes\\dark\\svg\\save__icon-foreground.svg',
   'D:\\Python\\rvrkcbot\\venv\\lib\\site-packages\\qdarktheme\\themes\\dark\\svg\\save__icon-foreground.svg',
   'DATA'),
  ('qdarktheme\\themes\\dark\\svg\\arrow_drop_up__scrollbar-handle__rotate-90.svg',
   'D:\\Python\\rvrkcbot\\venv\\lib\\site-packages\\qdarktheme\\themes\\dark\\svg\\arrow_drop_up__scrollbar-handle__rotate-90.svg',
   'DATA'),
  ('PyQt6\\Qt6\\translations\\qtbase_it.qm',
   'D:\\Python\\rvrkcbot\\venv\\lib\\site-packages\\PyQt6\\Qt6\\translations\\qtbase_it.qm',
   'DATA'),
  ('qdarktheme\\themes\\light\\svg\\arrow_drop_up__scrollbar-handle.svg',
   'D:\\Python\\rvrkcbot\\venv\\lib\\site-packages\\qdarktheme\\themes\\light\\svg\\arrow_drop_up__scrollbar-handle.svg',
   'DATA'),
  ('qdarktheme\\themes\\light\\svg\\arrow_upward__icon-foreground__rotate-90.svg',
   'D:\\Python\\rvrkcbot\\venv\\lib\\site-packages\\qdarktheme\\themes\\light\\svg\\arrow_upward__icon-foreground__rotate-90.svg',
   'DATA'),
  ('PyQt6\\Qt6\\translations\\qtbase_pl.qm',
   'D:\\Python\\rvrkcbot\\venv\\lib\\site-packages\\PyQt6\\Qt6\\translations\\qtbase_pl.qm',
   'DATA'),
  ('qdarktheme\\themes\\light\\svg\\folder_open__icon-foreground.svg',
   'D:\\Python\\rvrkcbot\\venv\\lib\\site-packages\\qdarktheme\\themes\\light\\svg\\folder_open__icon-foreground.svg',
   'DATA'),
  ('qdarktheme\\themes\\light\\svg\\horizontal_rule__icon-foreground-disabled__rotate-90.svg',
   'D:\\Python\\rvrkcbot\\venv\\lib\\site-packages\\qdarktheme\\themes\\light\\svg\\horizontal_rule__icon-foreground-disabled__rotate-90.svg',
   'DATA'),
  ('qdarktheme\\themes\\light\\svg\\save__icon-foreground.svg',
   'D:\\Python\\rvrkcbot\\venv\\lib\\site-packages\\qdarktheme\\themes\\light\\svg\\save__icon-foreground.svg',
   'DATA'),
  ('qdarktheme\\themes\\light\\svg\\arrow_drop_up__scrollbar-handle__rotate-90.svg',
   'D:\\Python\\rvrkcbot\\venv\\lib\\site-packages\\qdarktheme\\themes\\light\\svg\\arrow_drop_up__scrollbar-handle__rotate-90.svg',
   'DATA'),
  ('PyQt6\\Qt6\\translations\\qtbase_sk.qm',
   'D:\\Python\\rvrkcbot\\venv\\lib\\site-packages\\PyQt6\\Qt6\\translations\\qtbase_sk.qm',
   'DATA'),
  ('qdarktheme\\themes\\light\\svg\\horizontal_rule__icon-foreground.svg',
   'D:\\Python\\rvrkcbot\\venv\\lib\\site-packages\\qdarktheme\\themes\\light\\svg\\horizontal_rule__icon-foreground.svg',
   'DATA'),
  ('qdarktheme\\themes\\light\\svg\\vertical_line__icon-foreground-disabled.svg',
   'D:\\Python\\rvrkcbot\\venv\\lib\\site-packages\\qdarktheme\\themes\\light\\svg\\vertical_line__icon-foreground-disabled.svg',
   'DATA'),
  ('qdarktheme\\themes\\dark\\svg\\arrow_upward__icon-foreground__rotate-270.svg',
   'D:\\Python\\rvrkcbot\\venv\\lib\\site-packages\\qdarktheme\\themes\\dark\\svg\\arrow_upward__icon-foreground__rotate-270.svg',
   'DATA'),
  ('qdarktheme\\themes\\dark\\svg\\expand_less__icon-foreground-disabled__rotate-180.svg',
   'D:\\Python\\rvrkcbot\\venv\\lib\\site-packages\\qdarktheme\\themes\\dark\\svg\\expand_less__icon-foreground-disabled__rotate-180.svg',
   'DATA'),
  ('qdarktheme\\themes\\light\\svg\\arrow_upward__icon-foreground__rotate-270.svg',
   'D:\\Python\\rvrkcbot\\venv\\lib\\site-packages\\qdarktheme\\themes\\light\\svg\\arrow_upward__icon-foreground__rotate-270.svg',
   'DATA'),
  ('qdarktheme\\themes\\dark\\svg\\expand_less__icon-foreground.svg',
   'D:\\Python\\rvrkcbot\\venv\\lib\\site-packages\\qdarktheme\\themes\\dark\\svg\\expand_less__icon-foreground.svg',
   'DATA'),
  ('qdarktheme\\themes\\dark\\svg\\arrow_drop_up__icon-foreground-disabled__rotate-180.svg',
   'D:\\Python\\rvrkcbot\\venv\\lib\\site-packages\\qdarktheme\\themes\\dark\\svg\\arrow_drop_up__icon-foreground-disabled__rotate-180.svg',
   'DATA'),
  ('qdarktheme\\themes\\dark\\svg\\vertical_line__icon-foreground-disabled.svg',
   'D:\\Python\\rvrkcbot\\venv\\lib\\site-packages\\qdarktheme\\themes\\dark\\svg\\vertical_line__icon-foreground-disabled.svg',
   'DATA'),
  ('qdarktheme\\themes\\light\\svg\\vertical_line__icon-foreground.svg',
   'D:\\Python\\rvrkcbot\\venv\\lib\\site-packages\\qdarktheme\\themes\\light\\svg\\vertical_line__icon-foreground.svg',
   'DATA'),
  ('qdarktheme\\themes\\dark\\svg\\close__tabbar-button-inselected.svg',
   'D:\\Python\\rvrkcbot\\venv\\lib\\site-packages\\qdarktheme\\themes\\dark\\svg\\close__tabbar-button-inselected.svg',
   'DATA'),
  ('qdarktheme\\themes\\dark\\svg\\drag_indicator_horizontal__icon-foreground.svg',
   'D:\\Python\\rvrkcbot\\venv\\lib\\site-packages\\qdarktheme\\themes\\dark\\svg\\drag_indicator_horizontal__icon-foreground.svg',
   'DATA'),
  ('PyQt6\\Qt6\\translations\\qtbase_uk.qm',
   'D:\\Python\\rvrkcbot\\venv\\lib\\site-packages\\PyQt6\\Qt6\\translations\\qtbase_uk.qm',
   'DATA'),
  ('qdarktheme\\themes\\dark\\svg\\calendar_today__icon-foreground-disabled.svg',
   'D:\\Python\\rvrkcbot\\venv\\lib\\site-packages\\qdarktheme\\themes\\dark\\svg\\calendar_today__icon-foreground-disabled.svg',
   'DATA'),
  ('PyQt6\\Qt6\\translations\\qtbase_cs.qm',
   'D:\\Python\\rvrkcbot\\venv\\lib\\site-packages\\PyQt6\\Qt6\\translations\\qtbase_cs.qm',
   'DATA'),
  ('qdarktheme\\themes\\dark\\svg\\check_box_outline_blank__icon-foreground.svg',
   'D:\\Python\\rvrkcbot\\venv\\lib\\site-packages\\qdarktheme\\themes\\dark\\svg\\check_box_outline_blank__icon-foreground.svg',
   'DATA'),
  ('qdarktheme\\themes\\light\\svg\\radio_button_unchecked__icon-foreground.svg',
   'D:\\Python\\rvrkcbot\\venv\\lib\\site-packages\\qdarktheme\\themes\\light\\svg\\radio_button_unchecked__icon-foreground.svg',
   'DATA'),
  ('qdarktheme\\themes\\dark\\svg\\arrow_upward__icon-foreground__rotate-90.svg',
   'D:\\Python\\rvrkcbot\\venv\\lib\\site-packages\\qdarktheme\\themes\\dark\\svg\\arrow_upward__icon-foreground__rotate-90.svg',
   'DATA'),
  ('qdarktheme\\themes\\dark\\svg\\check_box__highlight.svg',
   'D:\\Python\\rvrkcbot\\venv\\lib\\site-packages\\qdarktheme\\themes\\dark\\svg\\check_box__highlight.svg',
   'DATA'),
  ('qdarktheme\\themes\\dark\\svg\\arrow_drop_up__scrollbar-handle.svg',
   'D:\\Python\\rvrkcbot\\venv\\lib\\site-packages\\qdarktheme\\themes\\dark\\svg\\arrow_drop_up__scrollbar-handle.svg',
   'DATA'),
  ('qdarktheme\\themes\\dark\\svg\\arrow_drop_up__scrollbar-disabled__rotate-180.svg',
   'D:\\Python\\rvrkcbot\\venv\\lib\\site-packages\\qdarktheme\\themes\\dark\\svg\\arrow_drop_up__scrollbar-disabled__rotate-180.svg',
   'DATA'),
  ('qdarktheme\\themes\\dark\\svg\\horizontal_rule__icon-foreground-disabled__rotate-90.svg',
   'D:\\Python\\rvrkcbot\\venv\\lib\\site-packages\\qdarktheme\\themes\\dark\\svg\\horizontal_rule__icon-foreground-disabled__rotate-90.svg',
   'DATA'),
  ('qdarktheme\\themes\\light\\svg\\vertical_line__guides-stroke-inactive.svg',
   'D:\\Python\\rvrkcbot\\venv\\lib\\site-packages\\qdarktheme\\themes\\light\\svg\\vertical_line__guides-stroke-inactive.svg',
   'DATA'),
  ('PyQt6\\Qt6\\translations\\qtbase_hu.qm',
   'D:\\Python\\rvrkcbot\\venv\\lib\\site-packages\\PyQt6\\Qt6\\translations\\qtbase_hu.qm',
   'DATA'),
  ('qdarktheme\\themes\\dark\\svg\\radio_button_checked__icon-foreground-disabled.svg',
   'D:\\Python\\rvrkcbot\\venv\\lib\\site-packages\\qdarktheme\\themes\\dark\\svg\\radio_button_checked__icon-foreground-disabled.svg',
   'DATA'),
  ('qdarktheme\\themes\\dark\\svg\\horizontal_rule__icon-foreground-disabled.svg',
   'D:\\Python\\rvrkcbot\\venv\\lib\\site-packages\\qdarktheme\\themes\\dark\\svg\\horizontal_rule__icon-foreground-disabled.svg',
   'DATA'),
  ('PyQt6\\Qt6\\translations\\qtbase_en.qm',
   'D:\\Python\\rvrkcbot\\venv\\lib\\site-packages\\PyQt6\\Qt6\\translations\\qtbase_en.qm',
   'DATA'),
  ('qdarktheme\\themes\\light\\svg\\expand_less__icon-foreground__rotate-180.svg',
   'D:\\Python\\rvrkcbot\\venv\\lib\\site-packages\\qdarktheme\\themes\\light\\svg\\expand_less__icon-foreground__rotate-180.svg',
   'DATA'),
  ('qdarktheme\\themes\\light\\svg\\arrow_drop_up__scrollbar-handle-pressed__rotate-180.svg',
   'D:\\Python\\rvrkcbot\\venv\\lib\\site-packages\\qdarktheme\\themes\\light\\svg\\arrow_drop_up__scrollbar-handle-pressed__rotate-180.svg',
   'DATA'),
  ('qdarktheme\\themes\\light\\svg\\arrow_drop_up__scrollbar-handle__rotate-270.svg',
   'D:\\Python\\rvrkcbot\\venv\\lib\\site-packages\\qdarktheme\\themes\\light\\svg\\arrow_drop_up__scrollbar-handle__rotate-270.svg',
   'DATA'),
  ('qdarktheme\\themes\\dark\\svg\\check__icon-foreground.svg',
   'D:\\Python\\rvrkcbot\\venv\\lib\\site-packages\\qdarktheme\\themes\\dark\\svg\\check__icon-foreground.svg',
   'DATA'),
  ('qdarktheme\\themes\\dark\\svg\\east__highlight.svg',
   'D:\\Python\\rvrkcbot\\venv\\lib\\site-packages\\qdarktheme\\themes\\dark\\svg\\east__highlight.svg',
   'DATA'),
  ('qdarktheme\\themes\\light\\svg\\arrow_upward__icon-foreground.svg',
   'D:\\Python\\rvrkcbot\\venv\\lib\\site-packages\\qdarktheme\\themes\\light\\svg\\arrow_upward__icon-foreground.svg',
   'DATA'),
  ('qdarktheme\\themes\\dark\\svg\\arrow_drop_up__scrollbar-handle-pressed__rotate-180.svg',
   'D:\\Python\\rvrkcbot\\venv\\lib\\site-packages\\qdarktheme\\themes\\dark\\svg\\arrow_drop_up__scrollbar-handle-pressed__rotate-180.svg',
   'DATA'),
  ('qdarktheme\\themes\\light\\svg\\flip_to_front__icon-foreground.svg',
   'D:\\Python\\rvrkcbot\\venv\\lib\\site-packages\\qdarktheme\\themes\\light\\svg\\flip_to_front__icon-foreground.svg',
   'DATA'),
  ('qdarktheme\\themes\\light\\svg\\check_box_outline_blank__icon-foreground-disabled.svg',
   'D:\\Python\\rvrkcbot\\venv\\lib\\site-packages\\qdarktheme\\themes\\light\\svg\\check_box_outline_blank__icon-foreground-disabled.svg',
   'DATA'),
  ('qdarktheme\\themes\\dark\\svg\\arrow_drop_up__scrollbar-disabled.svg',
   'D:\\Python\\rvrkcbot\\venv\\lib\\site-packages\\qdarktheme\\themes\\dark\\svg\\arrow_drop_up__scrollbar-disabled.svg',
   'DATA'),
  ('qdarktheme\\themes\\dark\\svg\\horizontal_rule__icon-foreground.svg',
   'D:\\Python\\rvrkcbot\\venv\\lib\\site-packages\\qdarktheme\\themes\\dark\\svg\\horizontal_rule__icon-foreground.svg',
   'DATA'),
  ('qdarktheme\\themes\\light\\svg\\create_new_folder__icon-foreground.svg',
   'D:\\Python\\rvrkcbot\\venv\\lib\\site-packages\\qdarktheme\\themes\\light\\svg\\create_new_folder__icon-foreground.svg',
   'DATA'),
  ('qdarktheme\\themes\\light\\svg\\double_arrow__icon-foreground-disabled.svg',
   'D:\\Python\\rvrkcbot\\venv\\lib\\site-packages\\qdarktheme\\themes\\light\\svg\\double_arrow__icon-foreground-disabled.svg',
   'DATA'),
  ('qdarktheme\\themes\\dark\\svg\\arrow_drop_up__icon-foreground__rotate-180.svg',
   'D:\\Python\\rvrkcbot\\venv\\lib\\site-packages\\qdarktheme\\themes\\dark\\svg\\arrow_drop_up__icon-foreground__rotate-180.svg',
   'DATA'),
  ('qdarktheme\\themes\\dark\\svg\\arrow_drop_up__scrollbar-handle-pressed.svg',
   'D:\\Python\\rvrkcbot\\venv\\lib\\site-packages\\qdarktheme\\themes\\dark\\svg\\arrow_drop_up__scrollbar-handle-pressed.svg',
   'DATA'),
  ('qdarktheme\\themes\\dark\\svg\\indeterminate_check_box__highlight.svg',
   'D:\\Python\\rvrkcbot\\venv\\lib\\site-packages\\qdarktheme\\themes\\dark\\svg\\indeterminate_check_box__highlight.svg',
   'DATA'),
  ('qdarktheme\\themes\\light\\svg\\radio_button_unchecked__icon-foreground-disabled.svg',
   'D:\\Python\\rvrkcbot\\venv\\lib\\site-packages\\qdarktheme\\themes\\light\\svg\\radio_button_unchecked__icon-foreground-disabled.svg',
   'DATA'),
  ('qdarktheme\\themes\\light\\svg\\drag_indicator_horizontal__icon-foreground.svg',
   'D:\\Python\\rvrkcbot\\venv\\lib\\site-packages\\qdarktheme\\themes\\light\\svg\\drag_indicator_horizontal__icon-foreground.svg',
   'DATA'),
  ('qdarktheme\\themes\\dark\\svg\\check_box__icon-foreground-disabled.svg',
   'D:\\Python\\rvrkcbot\\venv\\lib\\site-packages\\qdarktheme\\themes\\dark\\svg\\check_box__icon-foreground-disabled.svg',
   'DATA'),
  ('qdarktheme\\themes\\dark\\svg\\cancel__icon-foreground.svg',
   'D:\\Python\\rvrkcbot\\venv\\lib\\site-packages\\qdarktheme\\themes\\dark\\svg\\cancel__icon-foreground.svg',
   'DATA'),
  ('PyQt6\\Qt6\\translations\\qtbase_zh_TW.qm',
   'D:\\Python\\rvrkcbot\\venv\\lib\\site-packages\\PyQt6\\Qt6\\translations\\qtbase_zh_TW.qm',
   'DATA'),
  ('qdarktheme\\themes\\dark\\svg\\check_circle__icon-foreground.svg',
   'D:\\Python\\rvrkcbot\\venv\\lib\\site-packages\\qdarktheme\\themes\\dark\\svg\\check_circle__icon-foreground.svg',
   'DATA'),
  ('PyQt6\\Qt6\\translations\\qtbase_fa.qm',
   'D:\\Python\\rvrkcbot\\venv\\lib\\site-packages\\PyQt6\\Qt6\\translations\\qtbase_fa.qm',
   'DATA'),
  ('qdarktheme\\themes\\light\\svg\\cancel__icon-foreground.svg',
   'D:\\Python\\rvrkcbot\\venv\\lib\\site-packages\\qdarktheme\\themes\\light\\svg\\cancel__icon-foreground.svg',
   'DATA'),
  ('PyQt6\\Qt6\\translations\\qtbase_tr.qm',
   'D:\\Python\\rvrkcbot\\venv\\lib\\site-packages\\PyQt6\\Qt6\\translations\\qtbase_tr.qm',
   'DATA'),
  ('qdarktheme\\themes\\light\\svg\\close__icon-foreground.svg',
   'D:\\Python\\rvrkcbot\\venv\\lib\\site-packages\\qdarktheme\\themes\\light\\svg\\close__icon-foreground.svg',
   'DATA'),
  ('qdarktheme\\themes\\dark\\svg\\arrow_drop_up__icon-foreground-disabled.svg',
   'D:\\Python\\rvrkcbot\\venv\\lib\\site-packages\\qdarktheme\\themes\\dark\\svg\\arrow_drop_up__icon-foreground-disabled.svg',
   'DATA'),
  ('qdarktheme\\themes\\dark\\svg\\arrow_drop_up__scrollbar-disabled__rotate-90.svg',
   'D:\\Python\\rvrkcbot\\venv\\lib\\site-packages\\qdarktheme\\themes\\dark\\svg\\arrow_drop_up__scrollbar-disabled__rotate-90.svg',
   'DATA'),
  ('PyQt6\\Qt6\\translations\\qtbase_ca.qm',
   'D:\\Python\\rvrkcbot\\venv\\lib\\site-packages\\PyQt6\\Qt6\\translations\\qtbase_ca.qm',
   'DATA'),
  ('qdarktheme\\themes\\dark\\svg\\expand_less__icon-foreground-disabled.svg',
   'D:\\Python\\rvrkcbot\\venv\\lib\\site-packages\\qdarktheme\\themes\\dark\\svg\\expand_less__icon-foreground-disabled.svg',
   'DATA'),
  ('PyQt6\\Qt6\\translations\\qtbase_gd.qm',
   'D:\\Python\\rvrkcbot\\venv\\lib\\site-packages\\PyQt6\\Qt6\\translations\\qtbase_gd.qm',
   'DATA'),
  ('PyQt6\\Qt6\\translations\\qtbase_ja.qm',
   'D:\\Python\\rvrkcbot\\venv\\lib\\site-packages\\PyQt6\\Qt6\\translations\\qtbase_ja.qm',
   'DATA'),
  ('qdarktheme\\themes\\light\\svg\\arrow_drop_up__scrollbar-disabled.svg',
   'D:\\Python\\rvrkcbot\\venv\\lib\\site-packages\\qdarktheme\\themes\\light\\svg\\arrow_drop_up__scrollbar-disabled.svg',
   'DATA'),
  ('PyQt6\\Qt6\\translations\\qtbase_zh_CN.qm',
   'D:\\Python\\rvrkcbot\\venv\\lib\\site-packages\\PyQt6\\Qt6\\translations\\qtbase_zh_CN.qm',
   'DATA'),
  ('qdarktheme\\themes\\light\\svg\\arrow_drop_up__icon-foreground.svg',
   'D:\\Python\\rvrkcbot\\venv\\lib\\site-packages\\qdarktheme\\themes\\light\\svg\\arrow_drop_up__icon-foreground.svg',
   'DATA'),
  ('qdarktheme\\themes\\dark\\svg\\drag_indicator_horizontal__icon-foreground__rotate-90.svg',
   'D:\\Python\\rvrkcbot\\venv\\lib\\site-packages\\qdarktheme\\themes\\dark\\svg\\drag_indicator_horizontal__icon-foreground__rotate-90.svg',
   'DATA'),
  ('qdarktheme\\themes\\dark\\svg\\restart_alt__icon-foreground.svg',
   'D:\\Python\\rvrkcbot\\venv\\lib\\site-packages\\qdarktheme\\themes\\dark\\svg\\restart_alt__icon-foreground.svg',
   'DATA'),
  ('qdarktheme\\themes\\light\\svg\\indeterminate_check_box__highlight.svg',
   'D:\\Python\\rvrkcbot\\venv\\lib\\site-packages\\qdarktheme\\themes\\light\\svg\\indeterminate_check_box__highlight.svg',
   'DATA'),
  ('qdarktheme\\themes\\dark\\svg\\close__icon-foreground.svg',
   'D:\\Python\\rvrkcbot\\venv\\lib\\site-packages\\qdarktheme\\themes\\dark\\svg\\close__icon-foreground.svg',
   'DATA'),
  ('qdarktheme\\themes\\light\\svg\\check_box__highlight.svg',
   'D:\\Python\\rvrkcbot\\venv\\lib\\site-packages\\qdarktheme\\themes\\light\\svg\\check_box__highlight.svg',
   'DATA'),
  ('qdarktheme\\themes\\light\\svg\\arrow_drop_up__scrollbar-disabled__rotate-90.svg',
   'D:\\Python\\rvrkcbot\\venv\\lib\\site-packages\\qdarktheme\\themes\\light\\svg\\arrow_drop_up__scrollbar-disabled__rotate-90.svg',
   'DATA'),
  ('PyQt6\\Qt6\\translations\\qtbase_nn.qm',
   'D:\\Python\\rvrkcbot\\venv\\lib\\site-packages\\PyQt6\\Qt6\\translations\\qtbase_nn.qm',
   'DATA'),
  ('qdarktheme\\themes\\light\\svg\\close__tabbar-button-inselected.svg',
   'D:\\Python\\rvrkcbot\\venv\\lib\\site-packages\\qdarktheme\\themes\\light\\svg\\close__tabbar-button-inselected.svg',
   'DATA'),
  ('qdarktheme\\themes\\light\\svg\\horizontal_rule__icon-foreground__rotate-90.svg',
   'D:\\Python\\rvrkcbot\\venv\\lib\\site-packages\\qdarktheme\\themes\\light\\svg\\horizontal_rule__icon-foreground__rotate-90.svg',
   'DATA'),
  ('qdarktheme\\themes\\light\\svg\\arrow_drop_up__icon-foreground__rotate-180.svg',
   'D:\\Python\\rvrkcbot\\venv\\lib\\site-packages\\qdarktheme\\themes\\light\\svg\\arrow_drop_up__icon-foreground__rotate-180.svg',
   'DATA'),
  ('qdarktheme\\themes\\light\\svg\\chevron_right__icon-foreground-disabled.svg',
   'D:\\Python\\rvrkcbot\\venv\\lib\\site-packages\\qdarktheme\\themes\\light\\svg\\chevron_right__icon-foreground-disabled.svg',
   'DATA'),
  ('qdarktheme\\themes\\dark\\svg\\vertical_line__guides-stroke-inactive.svg',
   'D:\\Python\\rvrkcbot\\venv\\lib\\site-packages\\qdarktheme\\themes\\dark\\svg\\vertical_line__guides-stroke-inactive.svg',
   'DATA'),
  ('qdarktheme\\themes\\dark\\svg\\double_arrow__icon-foreground-disabled.svg',
   'D:\\Python\\rvrkcbot\\venv\\lib\\site-packages\\qdarktheme\\themes\\dark\\svg\\double_arrow__icon-foreground-disabled.svg',
   'DATA'),
  ('PyQt6\\Qt6\\translations\\qtbase_ko.qm',
   'D:\\Python\\rvrkcbot\\venv\\lib\\site-packages\\PyQt6\\Qt6\\translations\\qtbase_ko.qm',
   'DATA'),
  ('qdarktheme\\themes\\dark\\svg\\arrow_drop_up__scrollbar-handle__rotate-270.svg',
   'D:\\Python\\rvrkcbot\\venv\\lib\\site-packages\\qdarktheme\\themes\\dark\\svg\\arrow_drop_up__scrollbar-handle__rotate-270.svg',
   'DATA'),
  ('qdarktheme\\themes\\dark\\svg\\create_new_folder__icon-foreground.svg',
   'D:\\Python\\rvrkcbot\\venv\\lib\\site-packages\\qdarktheme\\themes\\dark\\svg\\create_new_folder__icon-foreground.svg',
   'DATA'),
  ('qdarktheme\\themes\\dark\\svg\\radio_button_checked__highlight.svg',
   'D:\\Python\\rvrkcbot\\venv\\lib\\site-packages\\qdarktheme\\themes\\dark\\svg\\radio_button_checked__highlight.svg',
   'DATA'),
  ('qdarktheme\\themes\\light\\svg\\drag_indicator_horizontal__icon-foreground__rotate-90.svg',
   'D:\\Python\\rvrkcbot\\venv\\lib\\site-packages\\qdarktheme\\themes\\light\\svg\\drag_indicator_horizontal__icon-foreground__rotate-90.svg',
   'DATA'),
  ('qdarktheme\\themes\\light\\svg\\chevron_right__icon-foreground.svg',
   'D:\\Python\\rvrkcbot\\venv\\lib\\site-packages\\qdarktheme\\themes\\light\\svg\\chevron_right__icon-foreground.svg',
   'DATA'),
  ('PyQt6\\Qt6\\translations\\qtbase_he.qm',
   'D:\\Python\\rvrkcbot\\venv\\lib\\site-packages\\PyQt6\\Qt6\\translations\\qtbase_he.qm',
   'DATA'),
  ('qdarktheme\\themes\\light\\svg\\arrow_drop_up__scrollbar-disabled__rotate-270.svg',
   'D:\\Python\\rvrkcbot\\venv\\lib\\site-packages\\qdarktheme\\themes\\light\\svg\\arrow_drop_up__scrollbar-disabled__rotate-270.svg',
   'DATA'),
  ('qdarktheme\\themes\\light\\svg\\help__icon-foreground.svg',
   'D:\\Python\\rvrkcbot\\venv\\lib\\site-packages\\qdarktheme\\themes\\light\\svg\\help__icon-foreground.svg',
   'DATA'),
  ('qdarktheme\\themes\\dark\\svg\\close__icon-foreground-disabled.svg',
   'D:\\Python\\rvrkcbot\\venv\\lib\\site-packages\\qdarktheme\\themes\\dark\\svg\\close__icon-foreground-disabled.svg',
   'DATA'),
  ('qdarktheme\\themes\\dark\\svg\\expand_less__icon-foreground__rotate-180.svg',
   'D:\\Python\\rvrkcbot\\venv\\lib\\site-packages\\qdarktheme\\themes\\dark\\svg\\expand_less__icon-foreground__rotate-180.svg',
   'DATA'),
  ('qdarktheme\\themes\\light\\svg\\delete__icon-foreground.svg',
   'D:\\Python\\rvrkcbot\\venv\\lib\\site-packages\\qdarktheme\\themes\\light\\svg\\delete__icon-foreground.svg',
   'DATA'),
  ('qdarktheme\\themes\\dark\\svg\\vertical_line__icon-foreground.svg',
   'D:\\Python\\rvrkcbot\\venv\\lib\\site-packages\\qdarktheme\\themes\\dark\\svg\\vertical_line__icon-foreground.svg',
   'DATA'),
  ('qdarktheme\\themes\\light\\svg\\arrow_drop_up__scrollbar-handle-pressed__rotate-90.svg',
   'D:\\Python\\rvrkcbot\\venv\\lib\\site-packages\\qdarktheme\\themes\\light\\svg\\arrow_drop_up__scrollbar-handle-pressed__rotate-90.svg',
   'DATA'),
  ('PyQt6\\Qt6\\translations\\qtbase_fi.qm',
   'D:\\Python\\rvrkcbot\\venv\\lib\\site-packages\\PyQt6\\Qt6\\translations\\qtbase_fi.qm',
   'DATA'),
  ('qdarktheme\\themes\\light\\svg\\restart_alt__icon-foreground.svg',
   'D:\\Python\\rvrkcbot\\venv\\lib\\site-packages\\qdarktheme\\themes\\light\\svg\\restart_alt__icon-foreground.svg',
   'DATA')],
 [],
 False,
 False,
 1662705269,
 [('runw.exe',
   'D:\\Python\\rvrkcbot\\venv\\lib\\site-packages\\PyInstaller\\bootloader\\Windows-64bit\\runw.exe',
   'EXECUTABLE')])
