('D:\\Python\\prohorenok_pyqt6\\project\\shredder\\dist\\shredder.exe',
 True,
 False,
 False,
 'D:\\Python\\prohorenok_pyqt6\\venv\\Lib\\site-packages\\PyInstaller\\bootloader\\images\\icon-console.ico',
 None,
 False,
 False,
 '<?xml version="1.0" encoding="UTF-8" standalone="yes"?><assembly xmlns="urn:schemas-microsoft-com:asm.v1" manifestVersion="1.0"><assemblyIdentity type="win32" name="shredder" processorArchitecture="amd64" version="1.0.0.0"/><trustInfo xmlns="urn:schemas-microsoft-com:asm.v3"><security><requestedPrivileges><requestedExecutionLevel level="asInvoker" uiAccess="false"/></requestedPrivileges></security></trustInfo><dependency><dependentAssembly><assemblyIdentity type="win32" name="Microsoft.Windows.Common-Controls" language="*" processorArchitecture="*" version="6.0.0.0" publicKeyToken="6595b64144ccf1df"/></dependentAssembly></dependency><compatibility xmlns="urn:schemas-microsoft-com:compatibility.v1"><application><supportedOS Id="{e2011457-1546-43c5-a5fe-008deee3d3f0}"/><supportedOS Id="{35138b9a-5d96-4fbd-8e2d-a2440225f93a}"/><supportedOS Id="{4a2f28e3-53b9-4441-ba9c-d69d4a4a6e38}"/><supportedOS Id="{1f676c76-80e1-4239-95bb-83d0f6d0da78}"/><supportedOS Id="{8e0f7a12-bfb3-4fe8-b9a5-48fd50a15a9a}"/></application></compatibility><application xmlns="urn:schemas-microsoft-com:asm.v3"><windowsSettings><longPathAware xmlns="http://schemas.microsoft.com/SMI/2016/WindowsSettings">true</longPathAware></windowsSettings></application></assembly>',
 True,
 True,
 False,
 None,
 None,
 None,
 'D:\\Python\\prohorenok_pyqt6\\project\\shredder\\build\\shredder\\shredder.pkg',
 [('PYZ-00.pyz',
   'D:\\Python\\prohorenok_pyqt6\\project\\shredder\\build\\shredder\\PYZ-00.pyz',
   'PYZ'),
  ('struct',
   'D:\\Python\\prohorenok_pyqt6\\project\\shredder\\build\\shredder\\localpycs\\struct.pyc',
   'PYMODULE'),
  ('pyimod01_archive',
   'D:\\Python\\prohorenok_pyqt6\\project\\shredder\\build\\shredder\\localpycs\\pyimod01_archive.pyc',
   'PYMODULE'),
  ('pyimod02_importers',
   'D:\\Python\\prohorenok_pyqt6\\project\\shredder\\build\\shredder\\localpycs\\pyimod02_importers.pyc',
   'PYMODULE'),
  ('pyimod03_ctypes',
   'D:\\Python\\prohorenok_pyqt6\\project\\shredder\\build\\shredder\\localpycs\\pyimod03_ctypes.pyc',
   'PYMODULE'),
  ('pyimod04_pywin32',
   'D:\\Python\\prohorenok_pyqt6\\project\\shredder\\build\\shredder\\localpycs\\pyimod04_pywin32.pyc',
   'PYMODULE'),
  ('pyiboot01_bootstrap',
   'D:\\Python\\prohorenok_pyqt6\\venv\\Lib\\site-packages\\PyInstaller\\loader\\pyiboot01_bootstrap.py',
   'PYSOURCE'),
  ('pyi_rth_inspect',
   'D:\\Python\\prohorenok_pyqt6\\venv\\Lib\\site-packages\\PyInstaller\\hooks\\rthooks\\pyi_rth_inspect.py',
   'PYSOURCE'),
  ('pyi_rth_pyqt6',
   'D:\\Python\\prohorenok_pyqt6\\venv\\Lib\\site-packages\\PyInstaller\\hooks\\rthooks\\pyi_rth_pyqt6.py',
   'PYSOURCE'),
  ('pyi_rth_pkgutil',
   'D:\\Python\\prohorenok_pyqt6\\venv\\Lib\\site-packages\\PyInstaller\\hooks\\rthooks\\pyi_rth_pkgutil.py',
   'PYSOURCE'),
  ('pyi_rth_multiprocessing',
   'D:\\Python\\prohorenok_pyqt6\\venv\\Lib\\site-packages\\PyInstaller\\hooks\\rthooks\\pyi_rth_multiprocessing.py',
   'PYSOURCE'),
  ('pyi_rth_pyside6',
   'D:\\Python\\prohorenok_pyqt6\\venv\\Lib\\site-packages\\PyInstaller\\hooks\\rthooks\\pyi_rth_pyside6.py',
   'PYSOURCE'),
  ('shredder',
   'D:\\Python\\prohorenok_pyqt6\\project\\shredder\\shredder.py',
   'PYSOURCE'),
  ('api-ms-win-crt-heap-l1-1-0.dll',
   'D:\\Anaconda3\\api-ms-win-crt-heap-l1-1-0.dll',
   'BINARY'),
  ('python311.dll',
   'C:\\Users\\nidxegg.RKC\\AppData\\Local\\Programs\\Python\\Python311\\python311.dll',
   'BINARY'),
  ('api-ms-win-crt-math-l1-1-0.dll',
   'D:\\Anaconda3\\api-ms-win-crt-math-l1-1-0.dll',
   'BINARY'),
  ('VCRUNTIME140.dll',
   'C:\\Users\\nidxegg.RKC\\AppData\\Local\\Programs\\Python\\Python311\\VCRUNTIME140.dll',
   'BINARY'),
  ('api-ms-win-crt-stdio-l1-1-0.dll',
   'D:\\Anaconda3\\api-ms-win-crt-stdio-l1-1-0.dll',
   'BINARY'),
  ('api-ms-win-crt-runtime-l1-1-0.dll',
   'D:\\Anaconda3\\api-ms-win-crt-runtime-l1-1-0.dll',
   'BINARY'),
  ('api-ms-win-crt-locale-l1-1-0.dll',
   'D:\\Anaconda3\\api-ms-win-crt-locale-l1-1-0.dll',
   'BINARY'),
  ('ucrtbase.dll', 'D:\\Anaconda3\\ucrtbase.dll', 'BINARY'),
  ('api-ms-win-crt-environment-l1-1-0.dll',
   'D:\\Anaconda3\\api-ms-win-crt-environment-l1-1-0.dll',
   'BINARY'),
  ('api-ms-win-crt-time-l1-1-0.dll',
   'D:\\Anaconda3\\api-ms-win-crt-time-l1-1-0.dll',
   'BINARY'),
  ('api-ms-win-crt-convert-l1-1-0.dll',
   'D:\\Anaconda3\\api-ms-win-crt-convert-l1-1-0.dll',
   'BINARY'),
  ('api-ms-win-crt-filesystem-l1-1-0.dll',
   'D:\\Anaconda3\\api-ms-win-crt-filesystem-l1-1-0.dll',
   'BINARY'),
  ('api-ms-win-crt-conio-l1-1-0.dll',
   'D:\\Anaconda3\\api-ms-win-crt-conio-l1-1-0.dll',
   'BINARY'),
  ('api-ms-win-crt-process-l1-1-0.dll',
   'D:\\Anaconda3\\api-ms-win-crt-process-l1-1-0.dll',
   'BINARY'),
  ('api-ms-win-crt-string-l1-1-0.dll',
   'D:\\Anaconda3\\api-ms-win-crt-string-l1-1-0.dll',
   'BINARY'),
  ('api-ms-win-core-interlocked-l1-1-0.dll',
   'D:\\Anaconda3\\api-ms-win-core-interlocked-l1-1-0.dll',
   'BINARY'),
  ('api-ms-win-core-file-l1-1-0.dll',
   'D:\\Anaconda3\\api-ms-win-core-file-l1-1-0.dll',
   'BINARY'),
  ('api-ms-win-core-processthreads-l1-1-0.dll',
   'D:\\Anaconda3\\api-ms-win-core-processthreads-l1-1-0.dll',
   'BINARY'),
  ('api-ms-win-core-processenvironment-l1-1-0.dll',
   'D:\\Anaconda3\\api-ms-win-core-processenvironment-l1-1-0.dll',
   'BINARY'),
  ('api-ms-win-core-string-l1-1-0.dll',
   'D:\\Anaconda3\\api-ms-win-core-string-l1-1-0.dll',
   'BINARY'),
  ('api-ms-win-core-util-l1-1-0.dll',
   'D:\\Anaconda3\\api-ms-win-core-util-l1-1-0.dll',
   'BINARY'),
  ('api-ms-win-core-handle-l1-1-0.dll',
   'D:\\Anaconda3\\api-ms-win-core-handle-l1-1-0.dll',
   'BINARY'),
  ('api-ms-win-core-localization-l1-2-0.dll',
   'D:\\Anaconda3\\api-ms-win-core-localization-l1-2-0.dll',
   'BINARY'),
  ('api-ms-win-core-rtlsupport-l1-1-0.dll',
   'D:\\Anaconda3\\api-ms-win-core-rtlsupport-l1-1-0.dll',
   'BINARY'),
  ('api-ms-win-core-heap-l1-1-0.dll',
   'D:\\Anaconda3\\api-ms-win-core-heap-l1-1-0.dll',
   'BINARY'),
  ('api-ms-win-core-synch-l1-1-0.dll',
   'D:\\Anaconda3\\api-ms-win-core-synch-l1-1-0.dll',
   'BINARY'),
  ('api-ms-win-core-libraryloader-l1-1-0.dll',
   'D:\\Anaconda3\\api-ms-win-core-libraryloader-l1-1-0.dll',
   'BINARY'),
  ('api-ms-win-core-debug-l1-1-0.dll',
   'D:\\Anaconda3\\api-ms-win-core-debug-l1-1-0.dll',
   'BINARY'),
  ('api-ms-win-core-console-l1-1-0.dll',
   'D:\\Anaconda3\\api-ms-win-core-console-l1-1-0.dll',
   'BINARY'),
  ('api-ms-win-core-file-l2-1-0.dll',
   'D:\\Anaconda3\\api-ms-win-core-file-l2-1-0.dll',
   'BINARY'),
  ('api-ms-win-core-timezone-l1-1-0.dll',
   'D:\\Anaconda3\\api-ms-win-core-timezone-l1-1-0.dll',
   'BINARY'),
  ('api-ms-win-core-file-l1-2-0.dll',
   'D:\\Anaconda3\\api-ms-win-core-file-l1-2-0.dll',
   'BINARY'),
  ('api-ms-win-core-errorhandling-l1-1-0.dll',
   'D:\\Anaconda3\\api-ms-win-core-errorhandling-l1-1-0.dll',
   'BINARY'),
  ('api-ms-win-core-processthreads-l1-1-1.dll',
   'D:\\Anaconda3\\api-ms-win-core-processthreads-l1-1-1.dll',
   'BINARY'),
  ('api-ms-win-core-memory-l1-1-0.dll',
   'D:\\Anaconda3\\api-ms-win-core-memory-l1-1-0.dll',
   'BINARY'),
  ('api-ms-win-core-namedpipe-l1-1-0.dll',
   'D:\\Anaconda3\\api-ms-win-core-namedpipe-l1-1-0.dll',
   'BINARY'),
  ('api-ms-win-core-datetime-l1-1-0.dll',
   'D:\\Anaconda3\\api-ms-win-core-datetime-l1-1-0.dll',
   'BINARY'),
  ('api-ms-win-core-synch-l1-2-0.dll',
   'D:\\Anaconda3\\api-ms-win-core-synch-l1-2-0.dll',
   'BINARY'),
  ('api-ms-win-core-sysinfo-l1-1-0.dll',
   'D:\\Anaconda3\\api-ms-win-core-sysinfo-l1-1-0.dll',
   'BINARY'),
  ('api-ms-win-core-profile-l1-1-0.dll',
   'D:\\Anaconda3\\api-ms-win-core-profile-l1-1-0.dll',
   'BINARY'),
  ('PySide6\\plugins\\platforms\\qdirect2d.dll',
   'D:\\Python\\prohorenok_pyqt6\\venv\\Lib\\site-packages\\PySide6\\plugins\\platforms\\qdirect2d.dll',
   'BINARY'),
  ('PyQt6\\Qt6\\plugins\\imageformats\\qpdf.dll',
   'D:\\Python\\prohorenok_pyqt6\\venv\\Lib\\site-packages\\PyQt6\\Qt6\\plugins\\imageformats\\qpdf.dll',
   'BINARY'),
  ('PySide6\\plugins\\tls\\qopensslbackend.dll',
   'D:\\Python\\prohorenok_pyqt6\\venv\\Lib\\site-packages\\PySide6\\plugins\\tls\\qopensslbackend.dll',
   'BINARY'),
  ('PySide6\\plugins\\imageformats\\qgif.dll',
   'D:\\Python\\prohorenok_pyqt6\\venv\\Lib\\site-packages\\PySide6\\plugins\\imageformats\\qgif.dll',
   'BINARY'),
  ('PyQt6\\Qt6\\plugins\\styles\\qwindowsvistastyle.dll',
   'D:\\Python\\prohorenok_pyqt6\\venv\\Lib\\site-packages\\PyQt6\\Qt6\\plugins\\styles\\qwindowsvistastyle.dll',
   'BINARY'),
  ('PySide6\\opengl32sw.dll',
   'D:\\Python\\prohorenok_pyqt6\\venv\\Lib\\site-packages\\PySide6\\opengl32sw.dll',
   'BINARY'),
  ('PySide6\\plugins\\platforms\\qoffscreen.dll',
   'D:\\Python\\prohorenok_pyqt6\\venv\\Lib\\site-packages\\PySide6\\plugins\\platforms\\qoffscreen.dll',
   'BINARY'),
  ('PySide6\\plugins\\imageformats\\qpdf.dll',
   'D:\\Python\\prohorenok_pyqt6\\venv\\Lib\\site-packages\\PySide6\\plugins\\imageformats\\qpdf.dll',
   'BINARY'),
  ('PyQt6\\Qt6\\plugins\\platforms\\qoffscreen.dll',
   'D:\\Python\\prohorenok_pyqt6\\venv\\Lib\\site-packages\\PyQt6\\Qt6\\plugins\\platforms\\qoffscreen.dll',
   'BINARY'),
  ('PySide6\\plugins\\networkinformation\\qnetworklistmanager.dll',
   'D:\\Python\\prohorenok_pyqt6\\venv\\Lib\\site-packages\\PySide6\\plugins\\networkinformation\\qnetworklistmanager.dll',
   'BINARY'),
  ('PySide6\\plugins\\tls\\qschannelbackend.dll',
   'D:\\Python\\prohorenok_pyqt6\\venv\\Lib\\site-packages\\PySide6\\plugins\\tls\\qschannelbackend.dll',
   'BINARY'),
  ('PyQt6\\Qt6\\plugins\\platforms\\qwindows.dll',
   'D:\\Python\\prohorenok_pyqt6\\venv\\Lib\\site-packages\\PyQt6\\Qt6\\plugins\\platforms\\qwindows.dll',
   'BINARY'),
  ('PySide6\\plugins\\generic\\qtuiotouchplugin.dll',
   'D:\\Python\\prohorenok_pyqt6\\venv\\Lib\\site-packages\\PySide6\\plugins\\generic\\qtuiotouchplugin.dll',
   'BINARY'),
  ('PyQt6\\Qt6\\plugins\\imageformats\\qwbmp.dll',
   'D:\\Python\\prohorenok_pyqt6\\venv\\Lib\\site-packages\\PyQt6\\Qt6\\plugins\\imageformats\\qwbmp.dll',
   'BINARY'),
  ('PySide6\\plugins\\imageformats\\qsvg.dll',
   'D:\\Python\\prohorenok_pyqt6\\venv\\Lib\\site-packages\\PySide6\\plugins\\imageformats\\qsvg.dll',
   'BINARY'),
  ('PySide6\\plugins\\iconengines\\qsvgicon.dll',
   'D:\\Python\\prohorenok_pyqt6\\venv\\Lib\\site-packages\\PySide6\\plugins\\iconengines\\qsvgicon.dll',
   'BINARY'),
  ('PyQt6\\Qt6\\plugins\\imageformats\\qico.dll',
   'D:\\Python\\prohorenok_pyqt6\\venv\\Lib\\site-packages\\PyQt6\\Qt6\\plugins\\imageformats\\qico.dll',
   'BINARY'),
  ('PySide6\\plugins\\styles\\qwindowsvistastyle.dll',
   'D:\\Python\\prohorenok_pyqt6\\venv\\Lib\\site-packages\\PySide6\\plugins\\styles\\qwindowsvistastyle.dll',
   'BINARY'),
  ('PyQt6\\Qt6\\plugins\\imageformats\\qtiff.dll',
   'D:\\Python\\prohorenok_pyqt6\\venv\\Lib\\site-packages\\PyQt6\\Qt6\\plugins\\imageformats\\qtiff.dll',
   'BINARY'),
  ('PyQt6\\Qt6\\plugins\\imageformats\\qtga.dll',
   'D:\\Python\\prohorenok_pyqt6\\venv\\Lib\\site-packages\\PyQt6\\Qt6\\plugins\\imageformats\\qtga.dll',
   'BINARY'),
  ('PyQt6\\Qt6\\plugins\\imageformats\\qwebp.dll',
   'D:\\Python\\prohorenok_pyqt6\\venv\\Lib\\site-packages\\PyQt6\\Qt6\\plugins\\imageformats\\qwebp.dll',
   'BINARY'),
  ('PySide6\\plugins\\imageformats\\qjpeg.dll',
   'D:\\Python\\prohorenok_pyqt6\\venv\\Lib\\site-packages\\PySide6\\plugins\\imageformats\\qjpeg.dll',
   'BINARY'),
  ('PyQt6\\Qt6\\plugins\\iconengines\\qsvgicon.dll',
   'D:\\Python\\prohorenok_pyqt6\\venv\\Lib\\site-packages\\PyQt6\\Qt6\\plugins\\iconengines\\qsvgicon.dll',
   'BINARY'),
  ('PySide6\\plugins\\imageformats\\qico.dll',
   'D:\\Python\\prohorenok_pyqt6\\venv\\Lib\\site-packages\\PySide6\\plugins\\imageformats\\qico.dll',
   'BINARY'),
  ('PySide6\\plugins\\platforms\\qwindows.dll',
   'D:\\Python\\prohorenok_pyqt6\\venv\\Lib\\site-packages\\PySide6\\plugins\\platforms\\qwindows.dll',
   'BINARY'),
  ('PyQt6\\Qt6\\plugins\\imageformats\\qicns.dll',
   'D:\\Python\\prohorenok_pyqt6\\venv\\Lib\\site-packages\\PyQt6\\Qt6\\plugins\\imageformats\\qicns.dll',
   'BINARY'),
  ('PySide6\\plugins\\tls\\qcertonlybackend.dll',
   'D:\\Python\\prohorenok_pyqt6\\venv\\Lib\\site-packages\\PySide6\\plugins\\tls\\qcertonlybackend.dll',
   'BINARY'),
  ('PyQt6\\Qt6\\plugins\\imageformats\\qgif.dll',
   'D:\\Python\\prohorenok_pyqt6\\venv\\Lib\\site-packages\\PyQt6\\Qt6\\plugins\\imageformats\\qgif.dll',
   'BINARY'),
  ('PyQt6\\Qt6\\plugins\\platforms\\qminimal.dll',
   'D:\\Python\\prohorenok_pyqt6\\venv\\Lib\\site-packages\\PyQt6\\Qt6\\plugins\\platforms\\qminimal.dll',
   'BINARY'),
  ('PyQt6\\Qt6\\bin\\opengl32sw.dll',
   'D:\\Python\\prohorenok_pyqt6\\venv\\Lib\\site-packages\\PyQt6\\Qt6\\bin\\opengl32sw.dll',
   'BINARY'),
  ('PySide6\\plugins\\imageformats\\qtga.dll',
   'D:\\Python\\prohorenok_pyqt6\\venv\\Lib\\site-packages\\PySide6\\plugins\\imageformats\\qtga.dll',
   'BINARY'),
  ('PySide6\\plugins\\platforms\\qminimal.dll',
   'D:\\Python\\prohorenok_pyqt6\\venv\\Lib\\site-packages\\PySide6\\plugins\\platforms\\qminimal.dll',
   'BINARY'),
  ('PyQt6\\Qt6\\plugins\\imageformats\\qjpeg.dll',
   'D:\\Python\\prohorenok_pyqt6\\venv\\Lib\\site-packages\\PyQt6\\Qt6\\plugins\\imageformats\\qjpeg.dll',
   'BINARY'),
  ('PySide6\\plugins\\imageformats\\qwebp.dll',
   'D:\\Python\\prohorenok_pyqt6\\venv\\Lib\\site-packages\\PySide6\\plugins\\imageformats\\qwebp.dll',
   'BINARY'),
  ('PySide6\\plugins\\imageformats\\qicns.dll',
   'D:\\Python\\prohorenok_pyqt6\\venv\\Lib\\site-packages\\PySide6\\plugins\\imageformats\\qicns.dll',
   'BINARY'),
  ('PyQt6\\Qt6\\plugins\\imageformats\\qsvg.dll',
   'D:\\Python\\prohorenok_pyqt6\\venv\\Lib\\site-packages\\PyQt6\\Qt6\\plugins\\imageformats\\qsvg.dll',
   'BINARY'),
  ('PyQt6\\Qt6\\plugins\\generic\\qtuiotouchplugin.dll',
   'D:\\Python\\prohorenok_pyqt6\\venv\\Lib\\site-packages\\PyQt6\\Qt6\\plugins\\generic\\qtuiotouchplugin.dll',
   'BINARY'),
  ('PySide6\\plugins\\imageformats\\qtiff.dll',
   'D:\\Python\\prohorenok_pyqt6\\venv\\Lib\\site-packages\\PySide6\\plugins\\imageformats\\qtiff.dll',
   'BINARY'),
  ('PySide6\\plugins\\platforminputcontexts\\qtvirtualkeyboardplugin.dll',
   'D:\\Python\\prohorenok_pyqt6\\venv\\Lib\\site-packages\\PySide6\\plugins\\platforminputcontexts\\qtvirtualkeyboardplugin.dll',
   'BINARY'),
  ('PySide6\\plugins\\imageformats\\qwbmp.dll',
   'D:\\Python\\prohorenok_pyqt6\\venv\\Lib\\site-packages\\PySide6\\plugins\\imageformats\\qwbmp.dll',
   'BINARY'),
  ('_multiprocessing.pyd',
   'C:\\Users\\nidxegg.RKC\\AppData\\Local\\Programs\\Python\\Python311\\DLLs\\_multiprocessing.pyd',
   'EXTENSION'),
  ('pyexpat.pyd',
   'C:\\Users\\nidxegg.RKC\\AppData\\Local\\Programs\\Python\\Python311\\DLLs\\pyexpat.pyd',
   'EXTENSION'),
  ('_ssl.pyd',
   'C:\\Users\\nidxegg.RKC\\AppData\\Local\\Programs\\Python\\Python311\\DLLs\\_ssl.pyd',
   'EXTENSION'),
  ('_hashlib.pyd',
   'C:\\Users\\nidxegg.RKC\\AppData\\Local\\Programs\\Python\\Python311\\DLLs\\_hashlib.pyd',
   'EXTENSION'),
  ('_decimal.pyd',
   'C:\\Users\\nidxegg.RKC\\AppData\\Local\\Programs\\Python\\Python311\\DLLs\\_decimal.pyd',
   'EXTENSION'),
  ('_socket.pyd',
   'C:\\Users\\nidxegg.RKC\\AppData\\Local\\Programs\\Python\\Python311\\DLLs\\_socket.pyd',
   'EXTENSION'),
  ('select.pyd',
   'C:\\Users\\nidxegg.RKC\\AppData\\Local\\Programs\\Python\\Python311\\DLLs\\select.pyd',
   'EXTENSION'),
  ('_lzma.pyd',
   'C:\\Users\\nidxegg.RKC\\AppData\\Local\\Programs\\Python\\Python311\\DLLs\\_lzma.pyd',
   'EXTENSION'),
  ('_bz2.pyd',
   'C:\\Users\\nidxegg.RKC\\AppData\\Local\\Programs\\Python\\Python311\\DLLs\\_bz2.pyd',
   'EXTENSION'),
  ('_ctypes.pyd',
   'C:\\Users\\nidxegg.RKC\\AppData\\Local\\Programs\\Python\\Python311\\DLLs\\_ctypes.pyd',
   'EXTENSION'),
  ('_queue.pyd',
   'C:\\Users\\nidxegg.RKC\\AppData\\Local\\Programs\\Python\\Python311\\DLLs\\_queue.pyd',
   'EXTENSION'),
  ('unicodedata.pyd',
   'C:\\Users\\nidxegg.RKC\\AppData\\Local\\Programs\\Python\\Python311\\DLLs\\unicodedata.pyd',
   'EXTENSION'),
  ('PyQt6\\QtGui.pyd',
   'D:\\Python\\prohorenok_pyqt6\\venv\\Lib\\site-packages\\PyQt6\\QtGui.pyd',
   'EXTENSION'),
  ('PyQt6\\QtCore.pyd',
   'D:\\Python\\prohorenok_pyqt6\\venv\\Lib\\site-packages\\PyQt6\\QtCore.pyd',
   'EXTENSION'),
  ('PyQt6\\sip.cp311-win_amd64.pyd',
   'D:\\Python\\prohorenok_pyqt6\\venv\\Lib\\site-packages\\PyQt6\\sip.cp311-win_amd64.pyd',
   'EXTENSION'),
  ('markupsafe\\_speedups.cp311-win_amd64.pyd',
   'D:\\Python\\prohorenok_pyqt6\\venv\\Lib\\site-packages\\markupsafe\\_speedups.cp311-win_amd64.pyd',
   'EXTENSION'),
  ('_overlapped.pyd',
   'C:\\Users\\nidxegg.RKC\\AppData\\Local\\Programs\\Python\\Python311\\DLLs\\_overlapped.pyd',
   'EXTENSION'),
  ('_asyncio.pyd',
   'C:\\Users\\nidxegg.RKC\\AppData\\Local\\Programs\\Python\\Python311\\DLLs\\_asyncio.pyd',
   'EXTENSION'),
  ('_elementtree.pyd',
   'C:\\Users\\nidxegg.RKC\\AppData\\Local\\Programs\\Python\\Python311\\DLLs\\_elementtree.pyd',
   'EXTENSION'),
  ('PySide6\\QtCore.pyd',
   'D:\\Python\\prohorenok_pyqt6\\venv\\Lib\\site-packages\\PySide6\\QtCore.pyd',
   'EXTENSION'),
  ('PySide6\\QtNetwork.pyd',
   'D:\\Python\\prohorenok_pyqt6\\venv\\Lib\\site-packages\\PySide6\\QtNetwork.pyd',
   'EXTENSION'),
  ('shiboken6\\Shiboken.pyd',
   'D:\\Python\\prohorenok_pyqt6\\venv\\Lib\\site-packages\\shiboken6\\Shiboken.pyd',
   'EXTENSION'),
  ('PySide6\\QtUiTools.pyd',
   'D:\\Python\\prohorenok_pyqt6\\venv\\Lib\\site-packages\\PySide6\\QtUiTools.pyd',
   'EXTENSION'),
  ('PySide6\\QtOpenGLWidgets.pyd',
   'D:\\Python\\prohorenok_pyqt6\\venv\\Lib\\site-packages\\PySide6\\QtOpenGLWidgets.pyd',
   'EXTENSION'),
  ('PySide6\\QtOpenGL.pyd',
   'D:\\Python\\prohorenok_pyqt6\\venv\\Lib\\site-packages\\PySide6\\QtOpenGL.pyd',
   'EXTENSION'),
  ('PySide6\\QtWidgets.pyd',
   'D:\\Python\\prohorenok_pyqt6\\venv\\Lib\\site-packages\\PySide6\\QtWidgets.pyd',
   'EXTENSION'),
  ('PySide6\\QtGui.pyd',
   'D:\\Python\\prohorenok_pyqt6\\venv\\Lib\\site-packages\\PySide6\\QtGui.pyd',
   'EXTENSION'),
  ('PyQt6\\QtWidgets.pyd',
   'D:\\Python\\prohorenok_pyqt6\\venv\\Lib\\site-packages\\PyQt6\\QtWidgets.pyd',
   'EXTENSION'),
  ('pyodbc.cp311-win_amd64.pyd',
   'D:\\Python\\prohorenok_pyqt6\\venv\\Lib\\site-packages\\pyodbc.cp311-win_amd64.pyd',
   'EXTENSION'),
  ('VCRUNTIME140_1.dll',
   'C:\\Users\\nidxegg.RKC\\AppData\\Local\\Programs\\Python\\Python311\\VCRUNTIME140_1.dll',
   'BINARY'),
  ('PyQt6\\Qt6\\bin\\Qt6Core.dll',
   'D:\\Python\\prohorenok_pyqt6\\venv\\Lib\\site-packages\\PyQt6\\Qt6\\bin\\Qt6Core.dll',
   'BINARY'),
  ('PyQt6\\Qt6\\bin\\Qt6Gui.dll',
   'D:\\Python\\prohorenok_pyqt6\\venv\\Lib\\site-packages\\PyQt6\\Qt6\\bin\\Qt6Gui.dll',
   'BINARY'),
  ('PyQt6\\Qt6\\bin\\MSVCP140.dll',
   'D:\\Python\\prohorenok_pyqt6\\venv\\Lib\\site-packages\\PyQt6\\Qt6\\bin\\MSVCP140.dll',
   'BINARY'),
  ('PyQt6\\Qt6\\bin\\Qt6Pdf.dll',
   'D:\\Python\\prohorenok_pyqt6\\venv\\Lib\\site-packages\\PyQt6\\Qt6\\bin\\Qt6Pdf.dll',
   'BINARY'),
  ('PyQt6\\Qt6\\bin\\Qt6Network.dll',
   'D:\\Python\\prohorenok_pyqt6\\venv\\Lib\\site-packages\\PyQt6\\Qt6\\bin\\Qt6Network.dll',
   'BINARY'),
  ('PyQt6\\Qt6\\bin\\Qt6Widgets.dll',
   'D:\\Python\\prohorenok_pyqt6\\venv\\Lib\\site-packages\\PyQt6\\Qt6\\bin\\Qt6Widgets.dll',
   'BINARY'),
  ('PyQt6\\Qt6\\bin\\Qt6Svg.dll',
   'D:\\Python\\prohorenok_pyqt6\\venv\\Lib\\site-packages\\PyQt6\\Qt6\\bin\\Qt6Svg.dll',
   'BINARY'),
  ('api-ms-win-crt-utility-l1-1-0.dll',
   'D:\\Anaconda3\\api-ms-win-crt-utility-l1-1-0.dll',
   'BINARY'),
  ('PySide6\\Qt6VirtualKeyboard.dll',
   'D:\\Python\\prohorenok_pyqt6\\venv\\Lib\\site-packages\\PySide6\\Qt6VirtualKeyboard.dll',
   'BINARY'),
  ('libcrypto-1_1.dll',
   'C:\\Users\\nidxegg.RKC\\AppData\\Local\\Programs\\Python\\Python311\\DLLs\\libcrypto-1_1.dll',
   'BINARY'),
  ('libssl-1_1.dll',
   'C:\\Users\\nidxegg.RKC\\AppData\\Local\\Programs\\Python\\Python311\\DLLs\\libssl-1_1.dll',
   'BINARY'),
  ('libffi-8.dll',
   'C:\\Users\\nidxegg.RKC\\AppData\\Local\\Programs\\Python\\Python311\\DLLs\\libffi-8.dll',
   'BINARY'),
  ('python3.dll',
   'C:\\Users\\nidxegg.RKC\\AppData\\Local\\Programs\\Python\\Python311\\python3.dll',
   'BINARY'),
  ('PyQt6\\Qt6\\bin\\MSVCP140_2.dll',
   'D:\\Python\\prohorenok_pyqt6\\venv\\Lib\\site-packages\\PyQt6\\Qt6\\bin\\MSVCP140_2.dll',
   'BINARY'),
  ('PySide6\\pyside6.abi3.dll',
   'D:\\Python\\prohorenok_pyqt6\\venv\\Lib\\site-packages\\PySide6\\pyside6.abi3.dll',
   'BINARY'),
  ('PySide6\\Qt6Core.dll',
   'D:\\Python\\prohorenok_pyqt6\\venv\\Lib\\site-packages\\PySide6\\Qt6Core.dll',
   'BINARY'),
  ('shiboken6\\shiboken6.abi3.dll',
   'D:\\Python\\prohorenok_pyqt6\\venv\\Lib\\site-packages\\shiboken6\\shiboken6.abi3.dll',
   'BINARY'),
  ('PySide6\\Qt6Network.dll',
   'D:\\Python\\prohorenok_pyqt6\\venv\\Lib\\site-packages\\PySide6\\Qt6Network.dll',
   'BINARY'),
  ('shiboken6\\VCRUNTIME140_1.dll',
   'D:\\Python\\prohorenok_pyqt6\\venv\\Lib\\site-packages\\shiboken6\\VCRUNTIME140_1.dll',
   'BINARY'),
  ('PySide6\\Qt6Gui.dll',
   'D:\\Python\\prohorenok_pyqt6\\venv\\Lib\\site-packages\\PySide6\\Qt6Gui.dll',
   'BINARY'),
  ('PySide6\\Qt6UiTools.dll',
   'D:\\Python\\prohorenok_pyqt6\\venv\\Lib\\site-packages\\PySide6\\Qt6UiTools.dll',
   'BINARY'),
  ('PySide6\\Qt6OpenGLWidgets.dll',
   'D:\\Python\\prohorenok_pyqt6\\venv\\Lib\\site-packages\\PySide6\\Qt6OpenGLWidgets.dll',
   'BINARY'),
  ('PySide6\\Qt6Widgets.dll',
   'D:\\Python\\prohorenok_pyqt6\\venv\\Lib\\site-packages\\PySide6\\Qt6Widgets.dll',
   'BINARY'),
  ('PySide6\\Qt6OpenGL.dll',
   'D:\\Python\\prohorenok_pyqt6\\venv\\Lib\\site-packages\\PySide6\\Qt6OpenGL.dll',
   'BINARY'),
  ('PyQt6\\Qt6\\bin\\MSVCP140_1.dll',
   'D:\\Python\\prohorenok_pyqt6\\venv\\Lib\\site-packages\\PyQt6\\Qt6\\bin\\MSVCP140_1.dll',
   'BINARY'),
  ('PySide6\\Qt6Quick.dll',
   'D:\\Python\\prohorenok_pyqt6\\venv\\Lib\\site-packages\\PySide6\\Qt6Quick.dll',
   'BINARY'),
  ('PySide6\\Qt6Qml.dll',
   'D:\\Python\\prohorenok_pyqt6\\venv\\Lib\\site-packages\\PySide6\\Qt6Qml.dll',
   'BINARY'),
  ('shiboken6\\MSVCP140.dll',
   'D:\\Python\\prohorenok_pyqt6\\venv\\Lib\\site-packages\\shiboken6\\MSVCP140.dll',
   'BINARY'),
  ('PySide6\\Qt6QmlModels.dll',
   'D:\\Python\\prohorenok_pyqt6\\venv\\Lib\\site-packages\\PySide6\\Qt6QmlModels.dll',
   'BINARY'),
  ('base_library.zip',
   'D:\\Python\\prohorenok_pyqt6\\project\\shredder\\build\\shredder\\base_library.zip',
   'DATA'),
  ('qt_material\\themes\\light_amber.xml',
   'D:\\Python\\prohorenok_pyqt6\\venv\\Lib\\site-packages\\qt_material\\themes\\light_amber.xml',
   'DATA'),
  ('qt_material\\resources\\source\\radiobutton_checked_invert.svg',
   'D:\\Python\\prohorenok_pyqt6\\venv\\Lib\\site-packages\\qt_material\\resources\\source\\radiobutton_checked_invert.svg',
   'DATA'),
  ('qt_material\\resources\\source\\checkbox_unchecked.svg',
   'D:\\Python\\prohorenok_pyqt6\\venv\\Lib\\site-packages\\qt_material\\resources\\source\\checkbox_unchecked.svg',
   'DATA'),
  ('qt_material\\resources\\source\\radiobutton_unchecked_invert.svg',
   'D:\\Python\\prohorenok_pyqt6\\venv\\Lib\\site-packages\\qt_material\\resources\\source\\radiobutton_unchecked_invert.svg',
   'DATA'),
  ('PySide6\\translations\\qtbase_hr.qm',
   'D:\\Python\\prohorenok_pyqt6\\venv\\Lib\\site-packages\\PySide6\\translations\\qtbase_hr.qm',
   'DATA'),
  ('qt_material\\themes\\light_purple_500.xml',
   'D:\\Python\\prohorenok_pyqt6\\venv\\Lib\\site-packages\\qt_material\\themes\\light_purple_500.xml',
   'DATA'),
  ('qt_material\\themes\\light_pink.xml',
   'D:\\Python\\prohorenok_pyqt6\\venv\\Lib\\site-packages\\qt_material\\themes\\light_pink.xml',
   'DATA'),
  ('qt_material\\themes\\dark_blue.xml',
   'D:\\Python\\prohorenok_pyqt6\\venv\\Lib\\site-packages\\qt_material\\themes\\dark_blue.xml',
   'DATA'),
  ('PyQt6\\Qt6\\translations\\qtbase_de.qm',
   'D:\\Python\\prohorenok_pyqt6\\venv\\Lib\\site-packages\\PyQt6\\Qt6\\translations\\qtbase_de.qm',
   'DATA'),
  ('qt_material\\resources\\logo\\logo.svg',
   'D:\\Python\\prohorenok_pyqt6\\venv\\Lib\\site-packages\\qt_material\\resources\\logo\\logo.svg',
   'DATA'),
  ('PyQt6\\Qt6\\translations\\qtbase_zh_CN.qm',
   'D:\\Python\\prohorenok_pyqt6\\venv\\Lib\\site-packages\\PyQt6\\Qt6\\translations\\qtbase_zh_CN.qm',
   'DATA'),
  ('qt_material\\resources\\source\\branch-closed.svg',
   'D:\\Python\\prohorenok_pyqt6\\venv\\Lib\\site-packages\\qt_material\\resources\\source\\branch-closed.svg',
   'DATA'),
  ('PyQt6\\Qt6\\translations\\qtbase_lv.qm',
   'D:\\Python\\prohorenok_pyqt6\\venv\\Lib\\site-packages\\PyQt6\\Qt6\\translations\\qtbase_lv.qm',
   'DATA'),
  ('PyQt6\\uic\\widget-plugins\\__pycache__\\qtwebenginewidgets.cpython-311.pyc',
   'D:\\Python\\prohorenok_pyqt6\\venv\\Lib\\site-packages\\PyQt6\\uic\\widget-plugins\\__pycache__\\qtwebenginewidgets.cpython-311.pyc',
   'DATA'),
  ('PyQt6\\Qt6\\translations\\qtbase_nn.qm',
   'D:\\Python\\prohorenok_pyqt6\\venv\\Lib\\site-packages\\PyQt6\\Qt6\\translations\\qtbase_nn.qm',
   'DATA'),
  ('qt_material\\themes\\light_cyan.xml',
   'D:\\Python\\prohorenok_pyqt6\\venv\\Lib\\site-packages\\qt_material\\themes\\light_cyan.xml',
   'DATA'),
  ('qt_material\\themes\\light_yellow.xml',
   'D:\\Python\\prohorenok_pyqt6\\venv\\Lib\\site-packages\\qt_material\\themes\\light_yellow.xml',
   'DATA'),
  ('PyQt6\\uic\\widget-plugins\\qaxcontainer.py',
   'D:\\Python\\prohorenok_pyqt6\\venv\\Lib\\site-packages\\PyQt6\\uic\\widget-plugins\\qaxcontainer.py',
   'DATA'),
  ('PyQt6\\uic\\widget-plugins\\qtcharts.py',
   'D:\\Python\\prohorenok_pyqt6\\venv\\Lib\\site-packages\\PyQt6\\uic\\widget-plugins\\qtcharts.py',
   'DATA'),
  ('PySide6\\translations\\qtbase_nn.qm',
   'D:\\Python\\prohorenok_pyqt6\\venv\\Lib\\site-packages\\PySide6\\translations\\qtbase_nn.qm',
   'DATA'),
  ('qt_material\\fonts\\roboto\\RobotoCondensed-Light.ttf',
   'D:\\Python\\prohorenok_pyqt6\\venv\\Lib\\site-packages\\qt_material\\fonts\\roboto\\RobotoCondensed-Light.ttf',
   'DATA'),
  ('PyQt6\\uic\\widget-plugins\\__pycache__\\qaxcontainer.cpython-311.pyc',
   'D:\\Python\\prohorenok_pyqt6\\venv\\Lib\\site-packages\\PyQt6\\uic\\widget-plugins\\__pycache__\\qaxcontainer.cpython-311.pyc',
   'DATA'),
  ('PySide6\\translations\\qtbase_ja.qm',
   'D:\\Python\\prohorenok_pyqt6\\venv\\Lib\\site-packages\\PySide6\\translations\\qtbase_ja.qm',
   'DATA'),
  ('PySide6\\translations\\qtbase_ko.qm',
   'D:\\Python\\prohorenok_pyqt6\\venv\\Lib\\site-packages\\PySide6\\translations\\qtbase_ko.qm',
   'DATA'),
  ('qt_material\\dock_theme.ui',
   'D:\\Python\\prohorenok_pyqt6\\venv\\Lib\\site-packages\\qt_material\\dock_theme.ui',
   'DATA'),
  ('qt_material\\resources\\source\\slider.svg',
   'D:\\Python\\prohorenok_pyqt6\\venv\\Lib\\site-packages\\qt_material\\resources\\source\\slider.svg',
   'DATA'),
  ('PySide6\\translations\\qtbase_ru.qm',
   'D:\\Python\\prohorenok_pyqt6\\venv\\Lib\\site-packages\\PySide6\\translations\\qtbase_ru.qm',
   'DATA'),
  ('qt_material\\fonts\\roboto\\Roboto-BoldItalic.ttf',
   'D:\\Python\\prohorenok_pyqt6\\venv\\Lib\\site-packages\\qt_material\\fonts\\roboto\\Roboto-BoldItalic.ttf',
   'DATA'),
  ('PySide6\\translations\\qtbase_de.qm',
   'D:\\Python\\prohorenok_pyqt6\\venv\\Lib\\site-packages\\PySide6\\translations\\qtbase_de.qm',
   'DATA'),
  ('PySide6\\translations\\qtbase_it.qm',
   'D:\\Python\\prohorenok_pyqt6\\venv\\Lib\\site-packages\\PySide6\\translations\\qtbase_it.qm',
   'DATA'),
  ('qt_material\\themes\\light_cyan_500.xml',
   'D:\\Python\\prohorenok_pyqt6\\venv\\Lib\\site-packages\\qt_material\\themes\\light_cyan_500.xml',
   'DATA'),
  ('qt_material\\resources\\source\\vline.svg',
   'D:\\Python\\prohorenok_pyqt6\\venv\\Lib\\site-packages\\qt_material\\resources\\source\\vline.svg',
   'DATA'),
  ('PySide6\\translations\\qtbase_nl.qm',
   'D:\\Python\\prohorenok_pyqt6\\venv\\Lib\\site-packages\\PySide6\\translations\\qtbase_nl.qm',
   'DATA'),
  ('qt_material\\themes\\dark_yellow.xml',
   'D:\\Python\\prohorenok_pyqt6\\venv\\Lib\\site-packages\\qt_material\\themes\\dark_yellow.xml',
   'DATA'),
  ('qt_material\\resources\\source\\checklist_invert.svg',
   'D:\\Python\\prohorenok_pyqt6\\venv\\Lib\\site-packages\\qt_material\\resources\\source\\checklist_invert.svg',
   'DATA'),
  ('qt_material\\fonts\\roboto\\Roboto-Light.ttf',
   'D:\\Python\\prohorenok_pyqt6\\venv\\Lib\\site-packages\\qt_material\\fonts\\roboto\\Roboto-Light.ttf',
   'DATA'),
  ('qt_material\\fonts\\roboto\\Roboto-Bold.ttf',
   'D:\\Python\\prohorenok_pyqt6\\venv\\Lib\\site-packages\\qt_material\\fonts\\roboto\\Roboto-Bold.ttf',
   'DATA'),
  ('qt_material\\resources\\source\\uparrow2.svg',
   'D:\\Python\\prohorenok_pyqt6\\venv\\Lib\\site-packages\\qt_material\\resources\\source\\uparrow2.svg',
   'DATA'),
  ('qt_material\\fonts\\roboto\\RobotoCondensed-BoldItalic.ttf',
   'D:\\Python\\prohorenok_pyqt6\\venv\\Lib\\site-packages\\qt_material\\fonts\\roboto\\RobotoCondensed-BoldItalic.ttf',
   'DATA'),
  ('PyQt6\\Qt6\\translations\\qtbase_zh_TW.qm',
   'D:\\Python\\prohorenok_pyqt6\\venv\\Lib\\site-packages\\PyQt6\\Qt6\\translations\\qtbase_zh_TW.qm',
   'DATA'),
  ('PyQt6\\Qt6\\translations\\qtbase_pt_BR.qm',
   'D:\\Python\\prohorenok_pyqt6\\venv\\Lib\\site-packages\\PyQt6\\Qt6\\translations\\qtbase_pt_BR.qm',
   'DATA'),
  ('qt_material\\resources\\source\\radiobutton_unchecked.svg',
   'D:\\Python\\prohorenok_pyqt6\\venv\\Lib\\site-packages\\qt_material\\resources\\source\\radiobutton_unchecked.svg',
   'DATA'),
  ('PySide6\\translations\\qtbase_zh_TW.qm',
   'D:\\Python\\prohorenok_pyqt6\\venv\\Lib\\site-packages\\PySide6\\translations\\qtbase_zh_TW.qm',
   'DATA'),
  ('qt_material\\themes\\dark_medical.xml',
   'D:\\Python\\prohorenok_pyqt6\\venv\\Lib\\site-packages\\qt_material\\themes\\dark_medical.xml',
   'DATA'),
  ('qt_material\\fonts\\roboto\\Roboto-LightItalic.ttf',
   'D:\\Python\\prohorenok_pyqt6\\venv\\Lib\\site-packages\\qt_material\\fonts\\roboto\\Roboto-LightItalic.ttf',
   'DATA'),
  ('PyQt6\\Qt6\\translations\\qtbase_gd.qm',
   'D:\\Python\\prohorenok_pyqt6\\venv\\Lib\\site-packages\\PyQt6\\Qt6\\translations\\qtbase_gd.qm',
   'DATA'),
  ('qt_material\\resources\\source\\float.svg',
   'D:\\Python\\prohorenok_pyqt6\\venv\\Lib\\site-packages\\qt_material\\resources\\source\\float.svg',
   'DATA'),
  ('qt_material\\themes\\dark_lightgreen.xml',
   'D:\\Python\\prohorenok_pyqt6\\venv\\Lib\\site-packages\\qt_material\\themes\\dark_lightgreen.xml',
   'DATA'),
  ('PyQt6\\Qt6\\translations\\qtbase_ko.qm',
   'D:\\Python\\prohorenok_pyqt6\\venv\\Lib\\site-packages\\PyQt6\\Qt6\\translations\\qtbase_ko.qm',
   'DATA'),
  ('qt_material\\resources\\source\\radiobutton_checked.svg',
   'D:\\Python\\prohorenok_pyqt6\\venv\\Lib\\site-packages\\qt_material\\resources\\source\\radiobutton_checked.svg',
   'DATA'),
  ('PySide6\\translations\\qtbase_he.qm',
   'D:\\Python\\prohorenok_pyqt6\\venv\\Lib\\site-packages\\PySide6\\translations\\qtbase_he.qm',
   'DATA'),
  ('qt_material\\fonts\\roboto\\Roboto-Thin.ttf',
   'D:\\Python\\prohorenok_pyqt6\\venv\\Lib\\site-packages\\qt_material\\fonts\\roboto\\Roboto-Thin.ttf',
   'DATA'),
  ('PyQt6\\Qt6\\translations\\qtbase_uk.qm',
   'D:\\Python\\prohorenok_pyqt6\\venv\\Lib\\site-packages\\PyQt6\\Qt6\\translations\\qtbase_uk.qm',
   'DATA'),
  ('PyQt6\\Qt6\\translations\\qtbase_ru.qm',
   'D:\\Python\\prohorenok_pyqt6\\venv\\Lib\\site-packages\\PyQt6\\Qt6\\translations\\qtbase_ru.qm',
   'DATA'),
  ('qt_material\\resources\\source\\splitter-vertical.svg',
   'D:\\Python\\prohorenok_pyqt6\\venv\\Lib\\site-packages\\qt_material\\resources\\source\\splitter-vertical.svg',
   'DATA'),
  ('PyQt6\\Qt6\\translations\\qtbase_en.qm',
   'D:\\Python\\prohorenok_pyqt6\\venv\\Lib\\site-packages\\PyQt6\\Qt6\\translations\\qtbase_en.qm',
   'DATA'),
  ('PySide6\\translations\\qtbase_gd.qm',
   'D:\\Python\\prohorenok_pyqt6\\venv\\Lib\\site-packages\\PySide6\\translations\\qtbase_gd.qm',
   'DATA'),
  ('PySide6\\translations\\qtbase_tr.qm',
   'D:\\Python\\prohorenok_pyqt6\\venv\\Lib\\site-packages\\PySide6\\translations\\qtbase_tr.qm',
   'DATA'),
  ('PySide6\\translations\\qtbase_fa.qm',
   'D:\\Python\\prohorenok_pyqt6\\venv\\Lib\\site-packages\\PySide6\\translations\\qtbase_fa.qm',
   'DATA'),
  ('qt_material\\resources\\source\\__pycache__\\__init__.cpython-311.pyc',
   'D:\\Python\\prohorenok_pyqt6\\venv\\Lib\\site-packages\\qt_material\\resources\\source\\__pycache__\\__init__.cpython-311.pyc',
   'DATA'),
  ('qt_material\\resources\\source\\branch-open.svg',
   'D:\\Python\\prohorenok_pyqt6\\venv\\Lib\\site-packages\\qt_material\\resources\\source\\branch-open.svg',
   'DATA'),
  ('qt_material\\resources\\source\\checkbox_indeterminate_invert.svg',
   'D:\\Python\\prohorenok_pyqt6\\venv\\Lib\\site-packages\\qt_material\\resources\\source\\checkbox_indeterminate_invert.svg',
   'DATA'),
  ('qt_material\\resources\\source\\branch-more.svg',
   'D:\\Python\\prohorenok_pyqt6\\venv\\Lib\\site-packages\\qt_material\\resources\\source\\branch-more.svg',
   'DATA'),
  ('PyQt6\\uic\\widget-plugins\\__pycache__\\qscintilla.cpython-311.pyc',
   'D:\\Python\\prohorenok_pyqt6\\venv\\Lib\\site-packages\\PyQt6\\uic\\widget-plugins\\__pycache__\\qscintilla.cpython-311.pyc',
   'DATA'),
  ('PyQt6\\Qt6\\translations\\qtbase_it.qm',
   'D:\\Python\\prohorenok_pyqt6\\venv\\Lib\\site-packages\\PyQt6\\Qt6\\translations\\qtbase_it.qm',
   'DATA'),
  ('qt_material\\resources\\source\\__init__.py',
   'D:\\Python\\prohorenok_pyqt6\\venv\\Lib\\site-packages\\qt_material\\resources\\source\\__init__.py',
   'DATA'),
  ('qt_material\\resources\\source\\checklist.svg',
   'D:\\Python\\prohorenok_pyqt6\\venv\\Lib\\site-packages\\qt_material\\resources\\source\\checklist.svg',
   'DATA'),
  ('qt_material\\resources\\source\\checkbox_checked_invert.svg',
   'D:\\Python\\prohorenok_pyqt6\\venv\\Lib\\site-packages\\qt_material\\resources\\source\\checkbox_checked_invert.svg',
   'DATA'),
  ('qt_material\\themes\\light_red_500.xml',
   'D:\\Python\\prohorenok_pyqt6\\venv\\Lib\\site-packages\\qt_material\\themes\\light_red_500.xml',
   'DATA'),
  ('qt_material\\material.css.template',
   'D:\\Python\\prohorenok_pyqt6\\venv\\Lib\\site-packages\\qt_material\\material.css.template',
   'DATA'),
  ('qt_material\\resources\\source\\leftarrow2.svg',
   'D:\\Python\\prohorenok_pyqt6\\venv\\Lib\\site-packages\\qt_material\\resources\\source\\leftarrow2.svg',
   'DATA'),
  ('PyQt6\\Qt6\\translations\\qtbase_da.qm',
   'D:\\Python\\prohorenok_pyqt6\\venv\\Lib\\site-packages\\PyQt6\\Qt6\\translations\\qtbase_da.qm',
   'DATA'),
  ('qt_material\\themes\\dark_pink.xml',
   'D:\\Python\\prohorenok_pyqt6\\venv\\Lib\\site-packages\\qt_material\\themes\\dark_pink.xml',
   'DATA'),
  ('PyQt6\\uic\\widget-plugins\\qtwebenginewidgets.py',
   'D:\\Python\\prohorenok_pyqt6\\venv\\Lib\\site-packages\\PyQt6\\uic\\widget-plugins\\qtwebenginewidgets.py',
   'DATA'),
  ('qt_material\\themes\\light_purple.xml',
   'D:\\Python\\prohorenok_pyqt6\\venv\\Lib\\site-packages\\qt_material\\themes\\light_purple.xml',
   'DATA'),
  ('PySide6\\translations\\qtbase_uk.qm',
   'D:\\Python\\prohorenok_pyqt6\\venv\\Lib\\site-packages\\PySide6\\translations\\qtbase_uk.qm',
   'DATA'),
  ('PyQt6\\Qt6\\translations\\qtbase_fr.qm',
   'D:\\Python\\prohorenok_pyqt6\\venv\\Lib\\site-packages\\PyQt6\\Qt6\\translations\\qtbase_fr.qm',
   'DATA'),
  ('qt_material\\resources\\logo\\__init__.py',
   'D:\\Python\\prohorenok_pyqt6\\venv\\Lib\\site-packages\\qt_material\\resources\\logo\\__init__.py',
   'DATA'),
  ('qt_material\\resources\\source\\rightarrow.svg',
   'D:\\Python\\prohorenok_pyqt6\\venv\\Lib\\site-packages\\qt_material\\resources\\source\\rightarrow.svg',
   'DATA'),
  ('PyQt6\\Qt6\\translations\\qtbase_fa.qm',
   'D:\\Python\\prohorenok_pyqt6\\venv\\Lib\\site-packages\\PyQt6\\Qt6\\translations\\qtbase_fa.qm',
   'DATA'),
  ('PyQt6\\Qt6\\translations\\qtbase_sk.qm',
   'D:\\Python\\prohorenok_pyqt6\\venv\\Lib\\site-packages\\PyQt6\\Qt6\\translations\\qtbase_sk.qm',
   'DATA'),
  ('PySide6\\translations\\qtbase_fr.qm',
   'D:\\Python\\prohorenok_pyqt6\\venv\\Lib\\site-packages\\PySide6\\translations\\qtbase_fr.qm',
   'DATA'),
  ('qt_material\\fonts\\roboto\\Roboto-Italic.ttf',
   'D:\\Python\\prohorenok_pyqt6\\venv\\Lib\\site-packages\\qt_material\\fonts\\roboto\\Roboto-Italic.ttf',
   'DATA'),
  ('qt_material\\fonts\\roboto\\RobotoCondensed-Bold.ttf',
   'D:\\Python\\prohorenok_pyqt6\\venv\\Lib\\site-packages\\qt_material\\fonts\\roboto\\RobotoCondensed-Bold.ttf',
   'DATA'),
  ('qt_material\\resources\\source\\base.svg',
   'D:\\Python\\prohorenok_pyqt6\\venv\\Lib\\site-packages\\qt_material\\resources\\source\\base.svg',
   'DATA'),
  ('qt_material\\resources\\source\\checkbox_unchecked_invert.svg',
   'D:\\Python\\prohorenok_pyqt6\\venv\\Lib\\site-packages\\qt_material\\resources\\source\\checkbox_unchecked_invert.svg',
   'DATA'),
  ('qt_material\\themes\\light_lightgreen_500.xml',
   'D:\\Python\\prohorenok_pyqt6\\venv\\Lib\\site-packages\\qt_material\\themes\\light_lightgreen_500.xml',
   'DATA'),
  ('qt_material\\fonts\\roboto\\Roboto-ThinItalic.ttf',
   'D:\\Python\\prohorenok_pyqt6\\venv\\Lib\\site-packages\\qt_material\\fonts\\roboto\\Roboto-ThinItalic.ttf',
   'DATA'),
  ('qt_material\\resources\\source\\branch-end.svg',
   'D:\\Python\\prohorenok_pyqt6\\venv\\Lib\\site-packages\\qt_material\\resources\\source\\branch-end.svg',
   'DATA'),
  ('PyQt6\\uic\\widget-plugins\\__pycache__\\qtquickwidgets.cpython-311.pyc',
   'D:\\Python\\prohorenok_pyqt6\\venv\\Lib\\site-packages\\PyQt6\\uic\\widget-plugins\\__pycache__\\qtquickwidgets.cpython-311.pyc',
   'DATA'),
  ('PyQt6\\uic\\widget-plugins\\qscintilla.py',
   'D:\\Python\\prohorenok_pyqt6\\venv\\Lib\\site-packages\\PyQt6\\uic\\widget-plugins\\qscintilla.py',
   'DATA'),
  ('qt_material\\fonts\\roboto\\Roboto-BlackItalic.ttf',
   'D:\\Python\\prohorenok_pyqt6\\venv\\Lib\\site-packages\\qt_material\\fonts\\roboto\\Roboto-BlackItalic.ttf',
   'DATA'),
  ('qt_material\\resources\\source\\tab_close.svg',
   'D:\\Python\\prohorenok_pyqt6\\venv\\Lib\\site-packages\\qt_material\\resources\\source\\tab_close.svg',
   'DATA'),
  ('qt_material\\resources\\source\\toolbar-handle-horizontal.svg',
   'D:\\Python\\prohorenok_pyqt6\\venv\\Lib\\site-packages\\qt_material\\resources\\source\\toolbar-handle-horizontal.svg',
   'DATA'),
  ('qt_material\\resources\\logo\\logo_frame.svg',
   'D:\\Python\\prohorenok_pyqt6\\venv\\Lib\\site-packages\\qt_material\\resources\\logo\\logo_frame.svg',
   'DATA'),
  ('qt_material\\resources\\generate.py',
   'D:\\Python\\prohorenok_pyqt6\\venv\\Lib\\site-packages\\qt_material\\resources\\generate.py',
   'DATA'),
  ('PySide6\\translations\\qtbase_sk.qm',
   'D:\\Python\\prohorenok_pyqt6\\venv\\Lib\\site-packages\\PySide6\\translations\\qtbase_sk.qm',
   'DATA'),
  ('qt_material\\fonts\\roboto\\Roboto-MediumItalic.ttf',
   'D:\\Python\\prohorenok_pyqt6\\venv\\Lib\\site-packages\\qt_material\\fonts\\roboto\\Roboto-MediumItalic.ttf',
   'DATA'),
  ('qt_material\\resources\\source\\toolbar-handle-vertical.svg',
   'D:\\Python\\prohorenok_pyqt6\\venv\\Lib\\site-packages\\qt_material\\resources\\source\\toolbar-handle-vertical.svg',
   'DATA'),
  ('qt_material\\themes\\light_orange.xml',
   'D:\\Python\\prohorenok_pyqt6\\venv\\Lib\\site-packages\\qt_material\\themes\\light_orange.xml',
   'DATA'),
  ('PyQt6\\uic\\widget-plugins\\qtquickwidgets.py',
   'D:\\Python\\prohorenok_pyqt6\\venv\\Lib\\site-packages\\PyQt6\\uic\\widget-plugins\\qtquickwidgets.py',
   'DATA'),
  ('qt_material\\fonts\\roboto\\RobotoCondensed-Italic.ttf',
   'D:\\Python\\prohorenok_pyqt6\\venv\\Lib\\site-packages\\qt_material\\fonts\\roboto\\RobotoCondensed-Italic.ttf',
   'DATA'),
  ('qt_material\\themes\\dark_red.xml',
   'D:\\Python\\prohorenok_pyqt6\\venv\\Lib\\site-packages\\qt_material\\themes\\dark_red.xml',
   'DATA'),
  ('PySide6\\translations\\qtbase_ca.qm',
   'D:\\Python\\prohorenok_pyqt6\\venv\\Lib\\site-packages\\PySide6\\translations\\qtbase_ca.qm',
   'DATA'),
  ('PySide6\\translations\\qtbase_hu.qm',
   'D:\\Python\\prohorenok_pyqt6\\venv\\Lib\\site-packages\\PySide6\\translations\\qtbase_hu.qm',
   'DATA'),
  ('qt_material\\fonts\\roboto\\RobotoCondensed-Regular.ttf',
   'D:\\Python\\prohorenok_pyqt6\\venv\\Lib\\site-packages\\qt_material\\fonts\\roboto\\RobotoCondensed-Regular.ttf',
   'DATA'),
  ('qt_material\\resources\\source\\checklist_indeterminate_invert.svg',
   'D:\\Python\\prohorenok_pyqt6\\venv\\Lib\\site-packages\\qt_material\\resources\\source\\checklist_indeterminate_invert.svg',
   'DATA'),
  ('PyQt6\\uic\\widget-plugins\\__pycache__\\qtprintsupport.cpython-311.pyc',
   'D:\\Python\\prohorenok_pyqt6\\venv\\Lib\\site-packages\\PyQt6\\uic\\widget-plugins\\__pycache__\\qtprintsupport.cpython-311.pyc',
   'DATA'),
  ('qt_material\\fonts\\roboto\\Roboto-Black.ttf',
   'D:\\Python\\prohorenok_pyqt6\\venv\\Lib\\site-packages\\qt_material\\fonts\\roboto\\Roboto-Black.ttf',
   'DATA'),
  ('qt_material\\resources\\source\\checkbox_indeterminate.svg',
   'D:\\Python\\prohorenok_pyqt6\\venv\\Lib\\site-packages\\qt_material\\resources\\source\\checkbox_indeterminate.svg',
   'DATA'),
  ('qt_material\\fonts\\roboto\\Roboto-Regular.ttf',
   'D:\\Python\\prohorenok_pyqt6\\venv\\Lib\\site-packages\\qt_material\\fonts\\roboto\\Roboto-Regular.ttf',
   'DATA'),
  ('PyQt6\\Qt6\\translations\\qtbase_fi.qm',
   'D:\\Python\\prohorenok_pyqt6\\venv\\Lib\\site-packages\\PyQt6\\Qt6\\translations\\qtbase_fi.qm',
   'DATA'),
  ('PySide6\\translations\\qtbase_pl.qm',
   'D:\\Python\\prohorenok_pyqt6\\venv\\Lib\\site-packages\\PySide6\\translations\\qtbase_pl.qm',
   'DATA'),
  ('qt_material\\themes\\light_red.xml',
   'D:\\Python\\prohorenok_pyqt6\\venv\\Lib\\site-packages\\qt_material\\themes\\light_red.xml',
   'DATA'),
  ('qt_material\\fonts\\roboto\\RobotoCondensed-LightItalic.ttf',
   'D:\\Python\\prohorenok_pyqt6\\venv\\Lib\\site-packages\\qt_material\\fonts\\roboto\\RobotoCondensed-LightItalic.ttf',
   'DATA'),
  ('qt_material\\resources\\source\\close.svg',
   'D:\\Python\\prohorenok_pyqt6\\venv\\Lib\\site-packages\\qt_material\\resources\\source\\close.svg',
   'DATA'),
  ('PySide6\\translations\\qtbase_cs.qm',
   'D:\\Python\\prohorenok_pyqt6\\venv\\Lib\\site-packages\\PySide6\\translations\\qtbase_cs.qm',
   'DATA'),
  ('PyQt6\\Qt6\\translations\\qtbase_tr.qm',
   'D:\\Python\\prohorenok_pyqt6\\venv\\Lib\\site-packages\\PyQt6\\Qt6\\translations\\qtbase_tr.qm',
   'DATA'),
  ('PySide6\\translations\\qtbase_lv.qm',
   'D:\\Python\\prohorenok_pyqt6\\venv\\Lib\\site-packages\\PySide6\\translations\\qtbase_lv.qm',
   'DATA'),
  ('qt_material\\resources\\source\\sizegrip.svg',
   'D:\\Python\\prohorenok_pyqt6\\venv\\Lib\\site-packages\\qt_material\\resources\\source\\sizegrip.svg',
   'DATA'),
  ('qt_material\\themes\\light_blue_500.xml',
   'D:\\Python\\prohorenok_pyqt6\\venv\\Lib\\site-packages\\qt_material\\themes\\light_blue_500.xml',
   'DATA'),
  ('PyQt6\\Qt6\\translations\\qtbase_he.qm',
   'D:\\Python\\prohorenok_pyqt6\\venv\\Lib\\site-packages\\PyQt6\\Qt6\\translations\\qtbase_he.qm',
   'DATA'),
  ('qt_material\\resources\\source\\splitter-horizontal.svg',
   'D:\\Python\\prohorenok_pyqt6\\venv\\Lib\\site-packages\\qt_material\\resources\\source\\splitter-horizontal.svg',
   'DATA'),
  ('qt_material\\themes\\light_blue.xml',
   'D:\\Python\\prohorenok_pyqt6\\venv\\Lib\\site-packages\\qt_material\\themes\\light_blue.xml',
   'DATA'),
  ('qt_material\\themes\\light_pink_500.xml',
   'D:\\Python\\prohorenok_pyqt6\\venv\\Lib\\site-packages\\qt_material\\themes\\light_pink_500.xml',
   'DATA'),
  ('qt_material\\themes\\light_teal.xml',
   'D:\\Python\\prohorenok_pyqt6\\venv\\Lib\\site-packages\\qt_material\\themes\\light_teal.xml',
   'DATA'),
  ('qt_material\\themes\\light_lightgreen.xml',
   'D:\\Python\\prohorenok_pyqt6\\venv\\Lib\\site-packages\\qt_material\\themes\\light_lightgreen.xml',
   'DATA'),
  ('PyQt6\\Qt6\\translations\\qtbase_es.qm',
   'D:\\Python\\prohorenok_pyqt6\\venv\\Lib\\site-packages\\PyQt6\\Qt6\\translations\\qtbase_es.qm',
   'DATA'),
  ('qt_material\\resources\\source\\leftarrow.svg',
   'D:\\Python\\prohorenok_pyqt6\\venv\\Lib\\site-packages\\qt_material\\resources\\source\\leftarrow.svg',
   'DATA'),
  ('PyQt6\\uic\\widget-plugins\\__pycache__\\qtcharts.cpython-311.pyc',
   'D:\\Python\\prohorenok_pyqt6\\venv\\Lib\\site-packages\\PyQt6\\uic\\widget-plugins\\__pycache__\\qtcharts.cpython-311.pyc',
   'DATA'),
  ('qt_material\\themes\\dark_teal.xml',
   'D:\\Python\\prohorenok_pyqt6\\venv\\Lib\\site-packages\\qt_material\\themes\\dark_teal.xml',
   'DATA'),
  ('qt_material\\resources\\source\\checklist_indeterminate.svg',
   'D:\\Python\\prohorenok_pyqt6\\venv\\Lib\\site-packages\\qt_material\\resources\\source\\checklist_indeterminate.svg',
   'DATA'),
  ('qt_material\\resources\\source\\downarrow2.svg',
   'D:\\Python\\prohorenok_pyqt6\\venv\\Lib\\site-packages\\qt_material\\resources\\source\\downarrow2.svg',
   'DATA'),
  ('qt_material\\themes\\dark_purple.xml',
   'D:\\Python\\prohorenok_pyqt6\\venv\\Lib\\site-packages\\qt_material\\themes\\dark_purple.xml',
   'DATA'),
  ('PyQt6\\Qt6\\translations\\qtbase_hr.qm',
   'D:\\Python\\prohorenok_pyqt6\\venv\\Lib\\site-packages\\PyQt6\\Qt6\\translations\\qtbase_hr.qm',
   'DATA'),
  ('PyQt6\\Qt6\\translations\\qtbase_ar.qm',
   'D:\\Python\\prohorenok_pyqt6\\venv\\Lib\\site-packages\\PyQt6\\Qt6\\translations\\qtbase_ar.qm',
   'DATA'),
  ('PyQt6\\Qt6\\translations\\qtbase_hu.qm',
   'D:\\Python\\prohorenok_pyqt6\\venv\\Lib\\site-packages\\PyQt6\\Qt6\\translations\\qtbase_hu.qm',
   'DATA'),
  ('qt_material\\resources\\__pycache__\\__init__.cpython-311.pyc',
   'D:\\Python\\prohorenok_pyqt6\\venv\\Lib\\site-packages\\qt_material\\resources\\__pycache__\\__init__.cpython-311.pyc',
   'DATA'),
  ('qt_material\\resources\\__pycache__\\generate.cpython-311.pyc',
   'D:\\Python\\prohorenok_pyqt6\\venv\\Lib\\site-packages\\qt_material\\resources\\__pycache__\\generate.cpython-311.pyc',
   'DATA'),
  ('PySide6\\translations\\qtbase_ar.qm',
   'D:\\Python\\prohorenok_pyqt6\\venv\\Lib\\site-packages\\PySide6\\translations\\qtbase_ar.qm',
   'DATA'),
  ('PySide6\\translations\\qtbase_fi.qm',
   'D:\\Python\\prohorenok_pyqt6\\venv\\Lib\\site-packages\\PySide6\\translations\\qtbase_fi.qm',
   'DATA'),
  ('qt_material\\resources\\source\\rightarrow2.svg',
   'D:\\Python\\prohorenok_pyqt6\\venv\\Lib\\site-packages\\qt_material\\resources\\source\\rightarrow2.svg',
   'DATA'),
  ('qt_material\\resources\\source\\checkbox_checked.svg',
   'D:\\Python\\prohorenok_pyqt6\\venv\\Lib\\site-packages\\qt_material\\resources\\source\\checkbox_checked.svg',
   'DATA'),
  ('qt_material\\fonts\\roboto\\Roboto-Medium.ttf',
   'D:\\Python\\prohorenok_pyqt6\\venv\\Lib\\site-packages\\qt_material\\fonts\\roboto\\Roboto-Medium.ttf',
   'DATA'),
  ('PySide6\\translations\\qtbase_en.qm',
   'D:\\Python\\prohorenok_pyqt6\\venv\\Lib\\site-packages\\PySide6\\translations\\qtbase_en.qm',
   'DATA'),
  ('qt_material\\themes\\dark_cyan.xml',
   'D:\\Python\\prohorenok_pyqt6\\venv\\Lib\\site-packages\\qt_material\\themes\\dark_cyan.xml',
   'DATA'),
  ('PyQt6\\Qt6\\translations\\qtbase_ca.qm',
   'D:\\Python\\prohorenok_pyqt6\\venv\\Lib\\site-packages\\PyQt6\\Qt6\\translations\\qtbase_ca.qm',
   'DATA'),
  ('PySide6\\translations\\qtbase_pt_BR.qm',
   'D:\\Python\\prohorenok_pyqt6\\venv\\Lib\\site-packages\\PySide6\\translations\\qtbase_pt_BR.qm',
   'DATA'),
  ('qt_material\\themes\\dark_amber.xml',
   'D:\\Python\\prohorenok_pyqt6\\venv\\Lib\\site-packages\\qt_material\\themes\\dark_amber.xml',
   'DATA'),
  ('PySide6\\translations\\qtbase_zh_CN.qm',
   'D:\\Python\\prohorenok_pyqt6\\venv\\Lib\\site-packages\\PySide6\\translations\\qtbase_zh_CN.qm',
   'DATA'),
  ('qt_material\\resources\\source\\uparrow.svg',
   'D:\\Python\\prohorenok_pyqt6\\venv\\Lib\\site-packages\\qt_material\\resources\\source\\uparrow.svg',
   'DATA'),
  ('PyQt6\\uic\\widget-plugins\\qtprintsupport.py',
   'D:\\Python\\prohorenok_pyqt6\\venv\\Lib\\site-packages\\PyQt6\\uic\\widget-plugins\\qtprintsupport.py',
   'DATA'),
  ('PySide6\\translations\\qtbase_es.qm',
   'D:\\Python\\prohorenok_pyqt6\\venv\\Lib\\site-packages\\PySide6\\translations\\qtbase_es.qm',
   'DATA'),
  ('PySide6\\translations\\qtbase_bg.qm',
   'D:\\Python\\prohorenok_pyqt6\\venv\\Lib\\site-packages\\PySide6\\translations\\qtbase_bg.qm',
   'DATA'),
  ('PySide6\\translations\\qtbase_da.qm',
   'D:\\Python\\prohorenok_pyqt6\\venv\\Lib\\site-packages\\PySide6\\translations\\qtbase_da.qm',
   'DATA'),
  ('qt_material\\resources\\source\\downarrow.svg',
   'D:\\Python\\prohorenok_pyqt6\\venv\\Lib\\site-packages\\qt_material\\resources\\source\\downarrow.svg',
   'DATA'),
  ('qt_material\\resources\\__init__.py',
   'D:\\Python\\prohorenok_pyqt6\\venv\\Lib\\site-packages\\qt_material\\resources\\__init__.py',
   'DATA'),
  ('PyQt6\\Qt6\\translations\\qtbase_ja.qm',
   'D:\\Python\\prohorenok_pyqt6\\venv\\Lib\\site-packages\\PyQt6\\Qt6\\translations\\qtbase_ja.qm',
   'DATA'),
  ('PyQt6\\Qt6\\translations\\qtbase_nl.qm',
   'D:\\Python\\prohorenok_pyqt6\\venv\\Lib\\site-packages\\PyQt6\\Qt6\\translations\\qtbase_nl.qm',
   'DATA'),
  ('PyQt6\\Qt6\\translations\\qtbase_cs.qm',
   'D:\\Python\\prohorenok_pyqt6\\venv\\Lib\\site-packages\\PyQt6\\Qt6\\translations\\qtbase_cs.qm',
   'DATA'),
  ('PyQt6\\Qt6\\translations\\qtbase_bg.qm',
   'D:\\Python\\prohorenok_pyqt6\\venv\\Lib\\site-packages\\PyQt6\\Qt6\\translations\\qtbase_bg.qm',
   'DATA'),
  ('PyQt6\\Qt6\\translations\\qtbase_pl.qm',
   'D:\\Python\\prohorenok_pyqt6\\venv\\Lib\\site-packages\\PyQt6\\Qt6\\translations\\qtbase_pl.qm',
   'DATA'),
  ('qt_material\\resources\\logo\\__pycache__\\__init__.cpython-311.pyc',
   'D:\\Python\\prohorenok_pyqt6\\venv\\Lib\\site-packages\\qt_material\\resources\\logo\\__pycache__\\__init__.cpython-311.pyc',
   'DATA'),
  ('qt_material\\themes\\light_teal_500.xml',
   'D:\\Python\\prohorenok_pyqt6\\venv\\Lib\\site-packages\\qt_material\\themes\\light_teal_500.xml',
   'DATA')],
 [],
 False,
 False,
 1678027006,
 [('run.exe',
   'D:\\Python\\prohorenok_pyqt6\\venv\\Lib\\site-packages\\PyInstaller\\bootloader\\Windows-64bit-intel\\run.exe',
   'EXECUTABLE')])
