('D:\\Python\\prohorenok_pyqt6\\project\\shredder\\build\\shredder\\PYZ-00.pyz',
 [('PyQt6',
   'D:\\Python\\prohorenok_pyqt6\\venv\\Lib\\site-packages\\PyQt6\\__init__.py',
   'PYMODULE'),
  ('PyQt6.uic',
   'D:\\Python\\prohorenok_pyqt6\\venv\\Lib\\site-packages\\PyQt6\\uic\\__init__.py',
   'PYMODULE'),
  ('PyQt6.uic.Compiler',
   'D:\\Python\\prohorenok_pyqt6\\venv\\Lib\\site-packages\\PyQt6\\uic\\Compiler\\__init__.py',
   'PYMODULE'),
  ('PyQt6.uic.Compiler.as_string',
   'D:\\Python\\prohorenok_pyqt6\\venv\\Lib\\site-packages\\PyQt6\\uic\\Compiler\\as_string.py',
   'PYMODULE'),
  ('PyQt6.uic.Compiler.compiler',
   'D:\\Python\\prohorenok_pyqt6\\venv\\Lib\\site-packages\\PyQt6\\uic\\Compiler\\compiler.py',
   'PYMODULE'),
  ('PyQt6.uic.Compiler.indenter',
   'D:\\Python\\prohorenok_pyqt6\\venv\\Lib\\site-packages\\PyQt6\\uic\\Compiler\\indenter.py',
   'PYMODULE'),
  ('PyQt6.uic.Compiler.misc',
   'D:\\Python\\prohorenok_pyqt6\\venv\\Lib\\site-packages\\PyQt6\\uic\\Compiler\\misc.py',
   'PYMODULE'),
  ('PyQt6.uic.Compiler.proxy_metaclass',
   'D:\\Python\\prohorenok_pyqt6\\venv\\Lib\\site-packages\\PyQt6\\uic\\Compiler\\proxy_metaclass.py',
   'PYMODULE'),
  ('PyQt6.uic.Compiler.qobjectcreator',
   'D:\\Python\\prohorenok_pyqt6\\venv\\Lib\\site-packages\\PyQt6\\uic\\Compiler\\qobjectcreator.py',
   'PYMODULE'),
  ('PyQt6.uic.Compiler.qtproxies',
   'D:\\Python\\prohorenok_pyqt6\\venv\\Lib\\site-packages\\PyQt6\\uic\\Compiler\\qtproxies.py',
   'PYMODULE'),
  ('PyQt6.uic.Loader',
   'D:\\Python\\prohorenok_pyqt6\\venv\\Lib\\site-packages\\PyQt6\\uic\\Loader\\__init__.py',
   'PYMODULE'),
  ('PyQt6.uic.Loader.loader',
   'D:\\Python\\prohorenok_pyqt6\\venv\\Lib\\site-packages\\PyQt6\\uic\\Loader\\loader.py',
   'PYMODULE'),
  ('PyQt6.uic.Loader.qobjectcreator',
   'D:\\Python\\prohorenok_pyqt6\\venv\\Lib\\site-packages\\PyQt6\\uic\\Loader\\qobjectcreator.py',
   'PYMODULE'),
  ('PyQt6.uic.compile_ui',
   'D:\\Python\\prohorenok_pyqt6\\venv\\Lib\\site-packages\\PyQt6\\uic\\compile_ui.py',
   'PYMODULE'),
  ('PyQt6.uic.enum_map',
   'D:\\Python\\prohorenok_pyqt6\\venv\\Lib\\site-packages\\PyQt6\\uic\\enum_map.py',
   'PYMODULE'),
  ('PyQt6.uic.exceptions',
   'D:\\Python\\prohorenok_pyqt6\\venv\\Lib\\site-packages\\PyQt6\\uic\\exceptions.py',
   'PYMODULE'),
  ('PyQt6.uic.icon_cache',
   'D:\\Python\\prohorenok_pyqt6\\venv\\Lib\\site-packages\\PyQt6\\uic\\icon_cache.py',
   'PYMODULE'),
  ('PyQt6.uic.load_ui',
   'D:\\Python\\prohorenok_pyqt6\\venv\\Lib\\site-packages\\PyQt6\\uic\\load_ui.py',
   'PYMODULE'),
  ('PyQt6.uic.objcreator',
   'D:\\Python\\prohorenok_pyqt6\\venv\\Lib\\site-packages\\PyQt6\\uic\\objcreator.py',
   'PYMODULE'),
  ('PyQt6.uic.properties',
   'D:\\Python\\prohorenok_pyqt6\\venv\\Lib\\site-packages\\PyQt6\\uic\\properties.py',
   'PYMODULE'),
  ('PyQt6.uic.ui_file',
   'D:\\Python\\prohorenok_pyqt6\\venv\\Lib\\site-packages\\PyQt6\\uic\\ui_file.py',
   'PYMODULE'),
  ('PyQt6.uic.uiparser',
   'D:\\Python\\prohorenok_pyqt6\\venv\\Lib\\site-packages\\PyQt6\\uic\\uiparser.py',
   'PYMODULE'),
  ('PySide6',
   'D:\\Python\\prohorenok_pyqt6\\venv\\Lib\\site-packages\\PySide6\\__init__.py',
   'PYMODULE'),
  ('PySide6.support',
   'D:\\Python\\prohorenok_pyqt6\\venv\\Lib\\site-packages\\PySide6\\support\\__init__.py',
   'PYMODULE'),
  ('PySide6.support.deprecated',
   'D:\\Python\\prohorenok_pyqt6\\venv\\Lib\\site-packages\\PySide6\\support\\deprecated.py',
   'PYMODULE'),
  ('_compat_pickle',
   'C:\\Users\\nidxegg.RKC\\AppData\\Local\\Programs\\Python\\Python311\\Lib\\_compat_pickle.py',
   'PYMODULE'),
  ('_compression',
   'C:\\Users\\nidxegg.RKC\\AppData\\Local\\Programs\\Python\\Python311\\Lib\\_compression.py',
   'PYMODULE'),
  ('_py_abc',
   'C:\\Users\\nidxegg.RKC\\AppData\\Local\\Programs\\Python\\Python311\\Lib\\_py_abc.py',
   'PYMODULE'),
  ('_pydecimal',
   'C:\\Users\\nidxegg.RKC\\AppData\\Local\\Programs\\Python\\Python311\\Lib\\_pydecimal.py',
   'PYMODULE'),
  ('_strptime',
   'C:\\Users\\nidxegg.RKC\\AppData\\Local\\Programs\\Python\\Python311\\Lib\\_strptime.py',
   'PYMODULE'),
  ('_threading_local',
   'C:\\Users\\nidxegg.RKC\\AppData\\Local\\Programs\\Python\\Python311\\Lib\\_threading_local.py',
   'PYMODULE'),
  ('argparse',
   'C:\\Users\\nidxegg.RKC\\AppData\\Local\\Programs\\Python\\Python311\\Lib\\argparse.py',
   'PYMODULE'),
  ('ast',
   'C:\\Users\\nidxegg.RKC\\AppData\\Local\\Programs\\Python\\Python311\\Lib\\ast.py',
   'PYMODULE'),
  ('asyncio',
   'C:\\Users\\nidxegg.RKC\\AppData\\Local\\Programs\\Python\\Python311\\Lib\\asyncio\\__init__.py',
   'PYMODULE'),
  ('asyncio.base_events',
   'C:\\Users\\nidxegg.RKC\\AppData\\Local\\Programs\\Python\\Python311\\Lib\\asyncio\\base_events.py',
   'PYMODULE'),
  ('asyncio.base_futures',
   'C:\\Users\\nidxegg.RKC\\AppData\\Local\\Programs\\Python\\Python311\\Lib\\asyncio\\base_futures.py',
   'PYMODULE'),
  ('asyncio.base_subprocess',
   'C:\\Users\\nidxegg.RKC\\AppData\\Local\\Programs\\Python\\Python311\\Lib\\asyncio\\base_subprocess.py',
   'PYMODULE'),
  ('asyncio.base_tasks',
   'C:\\Users\\nidxegg.RKC\\AppData\\Local\\Programs\\Python\\Python311\\Lib\\asyncio\\base_tasks.py',
   'PYMODULE'),
  ('asyncio.constants',
   'C:\\Users\\nidxegg.RKC\\AppData\\Local\\Programs\\Python\\Python311\\Lib\\asyncio\\constants.py',
   'PYMODULE'),
  ('asyncio.coroutines',
   'C:\\Users\\nidxegg.RKC\\AppData\\Local\\Programs\\Python\\Python311\\Lib\\asyncio\\coroutines.py',
   'PYMODULE'),
  ('asyncio.events',
   'C:\\Users\\nidxegg.RKC\\AppData\\Local\\Programs\\Python\\Python311\\Lib\\asyncio\\events.py',
   'PYMODULE'),
  ('asyncio.exceptions',
   'C:\\Users\\nidxegg.RKC\\AppData\\Local\\Programs\\Python\\Python311\\Lib\\asyncio\\exceptions.py',
   'PYMODULE'),
  ('asyncio.format_helpers',
   'C:\\Users\\nidxegg.RKC\\AppData\\Local\\Programs\\Python\\Python311\\Lib\\asyncio\\format_helpers.py',
   'PYMODULE'),
  ('asyncio.futures',
   'C:\\Users\\nidxegg.RKC\\AppData\\Local\\Programs\\Python\\Python311\\Lib\\asyncio\\futures.py',
   'PYMODULE'),
  ('asyncio.locks',
   'C:\\Users\\nidxegg.RKC\\AppData\\Local\\Programs\\Python\\Python311\\Lib\\asyncio\\locks.py',
   'PYMODULE'),
  ('asyncio.log',
   'C:\\Users\\nidxegg.RKC\\AppData\\Local\\Programs\\Python\\Python311\\Lib\\asyncio\\log.py',
   'PYMODULE'),
  ('asyncio.mixins',
   'C:\\Users\\nidxegg.RKC\\AppData\\Local\\Programs\\Python\\Python311\\Lib\\asyncio\\mixins.py',
   'PYMODULE'),
  ('asyncio.proactor_events',
   'C:\\Users\\nidxegg.RKC\\AppData\\Local\\Programs\\Python\\Python311\\Lib\\asyncio\\proactor_events.py',
   'PYMODULE'),
  ('asyncio.protocols',
   'C:\\Users\\nidxegg.RKC\\AppData\\Local\\Programs\\Python\\Python311\\Lib\\asyncio\\protocols.py',
   'PYMODULE'),
  ('asyncio.queues',
   'C:\\Users\\nidxegg.RKC\\AppData\\Local\\Programs\\Python\\Python311\\Lib\\asyncio\\queues.py',
   'PYMODULE'),
  ('asyncio.runners',
   'C:\\Users\\nidxegg.RKC\\AppData\\Local\\Programs\\Python\\Python311\\Lib\\asyncio\\runners.py',
   'PYMODULE'),
  ('asyncio.selector_events',
   'C:\\Users\\nidxegg.RKC\\AppData\\Local\\Programs\\Python\\Python311\\Lib\\asyncio\\selector_events.py',
   'PYMODULE'),
  ('asyncio.sslproto',
   'C:\\Users\\nidxegg.RKC\\AppData\\Local\\Programs\\Python\\Python311\\Lib\\asyncio\\sslproto.py',
   'PYMODULE'),
  ('asyncio.staggered',
   'C:\\Users\\nidxegg.RKC\\AppData\\Local\\Programs\\Python\\Python311\\Lib\\asyncio\\staggered.py',
   'PYMODULE'),
  ('asyncio.streams',
   'C:\\Users\\nidxegg.RKC\\AppData\\Local\\Programs\\Python\\Python311\\Lib\\asyncio\\streams.py',
   'PYMODULE'),
  ('asyncio.subprocess',
   'C:\\Users\\nidxegg.RKC\\AppData\\Local\\Programs\\Python\\Python311\\Lib\\asyncio\\subprocess.py',
   'PYMODULE'),
  ('asyncio.taskgroups',
   'C:\\Users\\nidxegg.RKC\\AppData\\Local\\Programs\\Python\\Python311\\Lib\\asyncio\\taskgroups.py',
   'PYMODULE'),
  ('asyncio.tasks',
   'C:\\Users\\nidxegg.RKC\\AppData\\Local\\Programs\\Python\\Python311\\Lib\\asyncio\\tasks.py',
   'PYMODULE'),
  ('asyncio.threads',
   'C:\\Users\\nidxegg.RKC\\AppData\\Local\\Programs\\Python\\Python311\\Lib\\asyncio\\threads.py',
   'PYMODULE'),
  ('asyncio.timeouts',
   'C:\\Users\\nidxegg.RKC\\AppData\\Local\\Programs\\Python\\Python311\\Lib\\asyncio\\timeouts.py',
   'PYMODULE'),
  ('asyncio.transports',
   'C:\\Users\\nidxegg.RKC\\AppData\\Local\\Programs\\Python\\Python311\\Lib\\asyncio\\transports.py',
   'PYMODULE'),
  ('asyncio.trsock',
   'C:\\Users\\nidxegg.RKC\\AppData\\Local\\Programs\\Python\\Python311\\Lib\\asyncio\\trsock.py',
   'PYMODULE'),
  ('asyncio.unix_events',
   'C:\\Users\\nidxegg.RKC\\AppData\\Local\\Programs\\Python\\Python311\\Lib\\asyncio\\unix_events.py',
   'PYMODULE'),
  ('asyncio.windows_events',
   'C:\\Users\\nidxegg.RKC\\AppData\\Local\\Programs\\Python\\Python311\\Lib\\asyncio\\windows_events.py',
   'PYMODULE'),
  ('asyncio.windows_utils',
   'C:\\Users\\nidxegg.RKC\\AppData\\Local\\Programs\\Python\\Python311\\Lib\\asyncio\\windows_utils.py',
   'PYMODULE'),
  ('base64',
   'C:\\Users\\nidxegg.RKC\\AppData\\Local\\Programs\\Python\\Python311\\Lib\\base64.py',
   'PYMODULE'),
  ('bisect',
   'C:\\Users\\nidxegg.RKC\\AppData\\Local\\Programs\\Python\\Python311\\Lib\\bisect.py',
   'PYMODULE'),
  ('bz2',
   'C:\\Users\\nidxegg.RKC\\AppData\\Local\\Programs\\Python\\Python311\\Lib\\bz2.py',
   'PYMODULE'),
  ('calendar',
   'C:\\Users\\nidxegg.RKC\\AppData\\Local\\Programs\\Python\\Python311\\Lib\\calendar.py',
   'PYMODULE'),
  ('concurrent',
   'C:\\Users\\nidxegg.RKC\\AppData\\Local\\Programs\\Python\\Python311\\Lib\\concurrent\\__init__.py',
   'PYMODULE'),
  ('concurrent.futures',
   'C:\\Users\\nidxegg.RKC\\AppData\\Local\\Programs\\Python\\Python311\\Lib\\concurrent\\futures\\__init__.py',
   'PYMODULE'),
  ('concurrent.futures._base',
   'C:\\Users\\nidxegg.RKC\\AppData\\Local\\Programs\\Python\\Python311\\Lib\\concurrent\\futures\\_base.py',
   'PYMODULE'),
  ('concurrent.futures.process',
   'C:\\Users\\nidxegg.RKC\\AppData\\Local\\Programs\\Python\\Python311\\Lib\\concurrent\\futures\\process.py',
   'PYMODULE'),
  ('concurrent.futures.thread',
   'C:\\Users\\nidxegg.RKC\\AppData\\Local\\Programs\\Python\\Python311\\Lib\\concurrent\\futures\\thread.py',
   'PYMODULE'),
  ('contextlib',
   'C:\\Users\\nidxegg.RKC\\AppData\\Local\\Programs\\Python\\Python311\\Lib\\contextlib.py',
   'PYMODULE'),
  ('contextvars',
   'C:\\Users\\nidxegg.RKC\\AppData\\Local\\Programs\\Python\\Python311\\Lib\\contextvars.py',
   'PYMODULE'),
  ('copy',
   'C:\\Users\\nidxegg.RKC\\AppData\\Local\\Programs\\Python\\Python311\\Lib\\copy.py',
   'PYMODULE'),
  ('csv',
   'C:\\Users\\nidxegg.RKC\\AppData\\Local\\Programs\\Python\\Python311\\Lib\\csv.py',
   'PYMODULE'),
  ('ctypes',
   'C:\\Users\\nidxegg.RKC\\AppData\\Local\\Programs\\Python\\Python311\\Lib\\ctypes\\__init__.py',
   'PYMODULE'),
  ('ctypes._aix',
   'C:\\Users\\nidxegg.RKC\\AppData\\Local\\Programs\\Python\\Python311\\Lib\\ctypes\\_aix.py',
   'PYMODULE'),
  ('ctypes._endian',
   'C:\\Users\\nidxegg.RKC\\AppData\\Local\\Programs\\Python\\Python311\\Lib\\ctypes\\_endian.py',
   'PYMODULE'),
  ('ctypes.macholib',
   'C:\\Users\\nidxegg.RKC\\AppData\\Local\\Programs\\Python\\Python311\\Lib\\ctypes\\macholib\\__init__.py',
   'PYMODULE'),
  ('ctypes.macholib.dyld',
   'C:\\Users\\nidxegg.RKC\\AppData\\Local\\Programs\\Python\\Python311\\Lib\\ctypes\\macholib\\dyld.py',
   'PYMODULE'),
  ('ctypes.macholib.dylib',
   'C:\\Users\\nidxegg.RKC\\AppData\\Local\\Programs\\Python\\Python311\\Lib\\ctypes\\macholib\\dylib.py',
   'PYMODULE'),
  ('ctypes.macholib.framework',
   'C:\\Users\\nidxegg.RKC\\AppData\\Local\\Programs\\Python\\Python311\\Lib\\ctypes\\macholib\\framework.py',
   'PYMODULE'),
  ('ctypes.util',
   'C:\\Users\\nidxegg.RKC\\AppData\\Local\\Programs\\Python\\Python311\\Lib\\ctypes\\util.py',
   'PYMODULE'),
  ('dataclasses',
   'C:\\Users\\nidxegg.RKC\\AppData\\Local\\Programs\\Python\\Python311\\Lib\\dataclasses.py',
   'PYMODULE'),
  ('datetime',
   'C:\\Users\\nidxegg.RKC\\AppData\\Local\\Programs\\Python\\Python311\\Lib\\datetime.py',
   'PYMODULE'),
  ('decimal',
   'C:\\Users\\nidxegg.RKC\\AppData\\Local\\Programs\\Python\\Python311\\Lib\\decimal.py',
   'PYMODULE'),
  ('dis',
   'C:\\Users\\nidxegg.RKC\\AppData\\Local\\Programs\\Python\\Python311\\Lib\\dis.py',
   'PYMODULE'),
  ('email',
   'C:\\Users\\nidxegg.RKC\\AppData\\Local\\Programs\\Python\\Python311\\Lib\\email\\__init__.py',
   'PYMODULE'),
  ('email._encoded_words',
   'C:\\Users\\nidxegg.RKC\\AppData\\Local\\Programs\\Python\\Python311\\Lib\\email\\_encoded_words.py',
   'PYMODULE'),
  ('email._header_value_parser',
   'C:\\Users\\nidxegg.RKC\\AppData\\Local\\Programs\\Python\\Python311\\Lib\\email\\_header_value_parser.py',
   'PYMODULE'),
  ('email._parseaddr',
   'C:\\Users\\nidxegg.RKC\\AppData\\Local\\Programs\\Python\\Python311\\Lib\\email\\_parseaddr.py',
   'PYMODULE'),
  ('email._policybase',
   'C:\\Users\\nidxegg.RKC\\AppData\\Local\\Programs\\Python\\Python311\\Lib\\email\\_policybase.py',
   'PYMODULE'),
  ('email.base64mime',
   'C:\\Users\\nidxegg.RKC\\AppData\\Local\\Programs\\Python\\Python311\\Lib\\email\\base64mime.py',
   'PYMODULE'),
  ('email.charset',
   'C:\\Users\\nidxegg.RKC\\AppData\\Local\\Programs\\Python\\Python311\\Lib\\email\\charset.py',
   'PYMODULE'),
  ('email.contentmanager',
   'C:\\Users\\nidxegg.RKC\\AppData\\Local\\Programs\\Python\\Python311\\Lib\\email\\contentmanager.py',
   'PYMODULE'),
  ('email.encoders',
   'C:\\Users\\nidxegg.RKC\\AppData\\Local\\Programs\\Python\\Python311\\Lib\\email\\encoders.py',
   'PYMODULE'),
  ('email.errors',
   'C:\\Users\\nidxegg.RKC\\AppData\\Local\\Programs\\Python\\Python311\\Lib\\email\\errors.py',
   'PYMODULE'),
  ('email.feedparser',
   'C:\\Users\\nidxegg.RKC\\AppData\\Local\\Programs\\Python\\Python311\\Lib\\email\\feedparser.py',
   'PYMODULE'),
  ('email.generator',
   'C:\\Users\\nidxegg.RKC\\AppData\\Local\\Programs\\Python\\Python311\\Lib\\email\\generator.py',
   'PYMODULE'),
  ('email.header',
   'C:\\Users\\nidxegg.RKC\\AppData\\Local\\Programs\\Python\\Python311\\Lib\\email\\header.py',
   'PYMODULE'),
  ('email.headerregistry',
   'C:\\Users\\nidxegg.RKC\\AppData\\Local\\Programs\\Python\\Python311\\Lib\\email\\headerregistry.py',
   'PYMODULE'),
  ('email.iterators',
   'C:\\Users\\nidxegg.RKC\\AppData\\Local\\Programs\\Python\\Python311\\Lib\\email\\iterators.py',
   'PYMODULE'),
  ('email.message',
   'C:\\Users\\nidxegg.RKC\\AppData\\Local\\Programs\\Python\\Python311\\Lib\\email\\message.py',
   'PYMODULE'),
  ('email.parser',
   'C:\\Users\\nidxegg.RKC\\AppData\\Local\\Programs\\Python\\Python311\\Lib\\email\\parser.py',
   'PYMODULE'),
  ('email.policy',
   'C:\\Users\\nidxegg.RKC\\AppData\\Local\\Programs\\Python\\Python311\\Lib\\email\\policy.py',
   'PYMODULE'),
  ('email.quoprimime',
   'C:\\Users\\nidxegg.RKC\\AppData\\Local\\Programs\\Python\\Python311\\Lib\\email\\quoprimime.py',
   'PYMODULE'),
  ('email.utils',
   'C:\\Users\\nidxegg.RKC\\AppData\\Local\\Programs\\Python\\Python311\\Lib\\email\\utils.py',
   'PYMODULE'),
  ('fractions',
   'C:\\Users\\nidxegg.RKC\\AppData\\Local\\Programs\\Python\\Python311\\Lib\\fractions.py',
   'PYMODULE'),
  ('ftplib',
   'C:\\Users\\nidxegg.RKC\\AppData\\Local\\Programs\\Python\\Python311\\Lib\\ftplib.py',
   'PYMODULE'),
  ('getopt',
   'C:\\Users\\nidxegg.RKC\\AppData\\Local\\Programs\\Python\\Python311\\Lib\\getopt.py',
   'PYMODULE'),
  ('getpass',
   'C:\\Users\\nidxegg.RKC\\AppData\\Local\\Programs\\Python\\Python311\\Lib\\getpass.py',
   'PYMODULE'),
  ('gettext',
   'C:\\Users\\nidxegg.RKC\\AppData\\Local\\Programs\\Python\\Python311\\Lib\\gettext.py',
   'PYMODULE'),
  ('gzip',
   'C:\\Users\\nidxegg.RKC\\AppData\\Local\\Programs\\Python\\Python311\\Lib\\gzip.py',
   'PYMODULE'),
  ('hashlib',
   'C:\\Users\\nidxegg.RKC\\AppData\\Local\\Programs\\Python\\Python311\\Lib\\hashlib.py',
   'PYMODULE'),
  ('hmac',
   'C:\\Users\\nidxegg.RKC\\AppData\\Local\\Programs\\Python\\Python311\\Lib\\hmac.py',
   'PYMODULE'),
  ('html',
   'C:\\Users\\nidxegg.RKC\\AppData\\Local\\Programs\\Python\\Python311\\Lib\\html\\__init__.py',
   'PYMODULE'),
  ('html.entities',
   'C:\\Users\\nidxegg.RKC\\AppData\\Local\\Programs\\Python\\Python311\\Lib\\html\\entities.py',
   'PYMODULE'),
  ('http',
   'C:\\Users\\nidxegg.RKC\\AppData\\Local\\Programs\\Python\\Python311\\Lib\\http\\__init__.py',
   'PYMODULE'),
  ('http.client',
   'C:\\Users\\nidxegg.RKC\\AppData\\Local\\Programs\\Python\\Python311\\Lib\\http\\client.py',
   'PYMODULE'),
  ('http.cookiejar',
   'C:\\Users\\nidxegg.RKC\\AppData\\Local\\Programs\\Python\\Python311\\Lib\\http\\cookiejar.py',
   'PYMODULE'),
  ('importlib',
   'C:\\Users\\nidxegg.RKC\\AppData\\Local\\Programs\\Python\\Python311\\Lib\\importlib\\__init__.py',
   'PYMODULE'),
  ('importlib._abc',
   'C:\\Users\\nidxegg.RKC\\AppData\\Local\\Programs\\Python\\Python311\\Lib\\importlib\\_abc.py',
   'PYMODULE'),
  ('importlib._bootstrap',
   'C:\\Users\\nidxegg.RKC\\AppData\\Local\\Programs\\Python\\Python311\\Lib\\importlib\\_bootstrap.py',
   'PYMODULE'),
  ('importlib._bootstrap_external',
   'C:\\Users\\nidxegg.RKC\\AppData\\Local\\Programs\\Python\\Python311\\Lib\\importlib\\_bootstrap_external.py',
   'PYMODULE'),
  ('importlib.abc',
   'C:\\Users\\nidxegg.RKC\\AppData\\Local\\Programs\\Python\\Python311\\Lib\\importlib\\abc.py',
   'PYMODULE'),
  ('importlib.machinery',
   'C:\\Users\\nidxegg.RKC\\AppData\\Local\\Programs\\Python\\Python311\\Lib\\importlib\\machinery.py',
   'PYMODULE'),
  ('importlib.metadata',
   'C:\\Users\\nidxegg.RKC\\AppData\\Local\\Programs\\Python\\Python311\\Lib\\importlib\\metadata\\__init__.py',
   'PYMODULE'),
  ('importlib.metadata._adapters',
   'C:\\Users\\nidxegg.RKC\\AppData\\Local\\Programs\\Python\\Python311\\Lib\\importlib\\metadata\\_adapters.py',
   'PYMODULE'),
  ('importlib.metadata._collections',
   'C:\\Users\\nidxegg.RKC\\AppData\\Local\\Programs\\Python\\Python311\\Lib\\importlib\\metadata\\_collections.py',
   'PYMODULE'),
  ('importlib.metadata._functools',
   'C:\\Users\\nidxegg.RKC\\AppData\\Local\\Programs\\Python\\Python311\\Lib\\importlib\\metadata\\_functools.py',
   'PYMODULE'),
  ('importlib.metadata._itertools',
   'C:\\Users\\nidxegg.RKC\\AppData\\Local\\Programs\\Python\\Python311\\Lib\\importlib\\metadata\\_itertools.py',
   'PYMODULE'),
  ('importlib.metadata._meta',
   'C:\\Users\\nidxegg.RKC\\AppData\\Local\\Programs\\Python\\Python311\\Lib\\importlib\\metadata\\_meta.py',
   'PYMODULE'),
  ('importlib.metadata._text',
   'C:\\Users\\nidxegg.RKC\\AppData\\Local\\Programs\\Python\\Python311\\Lib\\importlib\\metadata\\_text.py',
   'PYMODULE'),
  ('importlib.readers',
   'C:\\Users\\nidxegg.RKC\\AppData\\Local\\Programs\\Python\\Python311\\Lib\\importlib\\readers.py',
   'PYMODULE'),
  ('importlib.resources',
   'C:\\Users\\nidxegg.RKC\\AppData\\Local\\Programs\\Python\\Python311\\Lib\\importlib\\resources\\__init__.py',
   'PYMODULE'),
  ('importlib.resources._adapters',
   'C:\\Users\\nidxegg.RKC\\AppData\\Local\\Programs\\Python\\Python311\\Lib\\importlib\\resources\\_adapters.py',
   'PYMODULE'),
  ('importlib.resources._common',
   'C:\\Users\\nidxegg.RKC\\AppData\\Local\\Programs\\Python\\Python311\\Lib\\importlib\\resources\\_common.py',
   'PYMODULE'),
  ('importlib.resources._itertools',
   'C:\\Users\\nidxegg.RKC\\AppData\\Local\\Programs\\Python\\Python311\\Lib\\importlib\\resources\\_itertools.py',
   'PYMODULE'),
  ('importlib.resources._legacy',
   'C:\\Users\\nidxegg.RKC\\AppData\\Local\\Programs\\Python\\Python311\\Lib\\importlib\\resources\\_legacy.py',
   'PYMODULE'),
  ('importlib.resources.abc',
   'C:\\Users\\nidxegg.RKC\\AppData\\Local\\Programs\\Python\\Python311\\Lib\\importlib\\resources\\abc.py',
   'PYMODULE'),
  ('importlib.resources.readers',
   'C:\\Users\\nidxegg.RKC\\AppData\\Local\\Programs\\Python\\Python311\\Lib\\importlib\\resources\\readers.py',
   'PYMODULE'),
  ('importlib.util',
   'C:\\Users\\nidxegg.RKC\\AppData\\Local\\Programs\\Python\\Python311\\Lib\\importlib\\util.py',
   'PYMODULE'),
  ('inspect',
   'C:\\Users\\nidxegg.RKC\\AppData\\Local\\Programs\\Python\\Python311\\Lib\\inspect.py',
   'PYMODULE'),
  ('jinja2',
   'D:\\Python\\prohorenok_pyqt6\\venv\\Lib\\site-packages\\jinja2\\__init__.py',
   'PYMODULE'),
  ('jinja2._identifier',
   'D:\\Python\\prohorenok_pyqt6\\venv\\Lib\\site-packages\\jinja2\\_identifier.py',
   'PYMODULE'),
  ('jinja2.async_utils',
   'D:\\Python\\prohorenok_pyqt6\\venv\\Lib\\site-packages\\jinja2\\async_utils.py',
   'PYMODULE'),
  ('jinja2.bccache',
   'D:\\Python\\prohorenok_pyqt6\\venv\\Lib\\site-packages\\jinja2\\bccache.py',
   'PYMODULE'),
  ('jinja2.compiler',
   'D:\\Python\\prohorenok_pyqt6\\venv\\Lib\\site-packages\\jinja2\\compiler.py',
   'PYMODULE'),
  ('jinja2.constants',
   'D:\\Python\\prohorenok_pyqt6\\venv\\Lib\\site-packages\\jinja2\\constants.py',
   'PYMODULE'),
  ('jinja2.debug',
   'D:\\Python\\prohorenok_pyqt6\\venv\\Lib\\site-packages\\jinja2\\debug.py',
   'PYMODULE'),
  ('jinja2.defaults',
   'D:\\Python\\prohorenok_pyqt6\\venv\\Lib\\site-packages\\jinja2\\defaults.py',
   'PYMODULE'),
  ('jinja2.environment',
   'D:\\Python\\prohorenok_pyqt6\\venv\\Lib\\site-packages\\jinja2\\environment.py',
   'PYMODULE'),
  ('jinja2.exceptions',
   'D:\\Python\\prohorenok_pyqt6\\venv\\Lib\\site-packages\\jinja2\\exceptions.py',
   'PYMODULE'),
  ('jinja2.ext',
   'D:\\Python\\prohorenok_pyqt6\\venv\\Lib\\site-packages\\jinja2\\ext.py',
   'PYMODULE'),
  ('jinja2.filters',
   'D:\\Python\\prohorenok_pyqt6\\venv\\Lib\\site-packages\\jinja2\\filters.py',
   'PYMODULE'),
  ('jinja2.idtracking',
   'D:\\Python\\prohorenok_pyqt6\\venv\\Lib\\site-packages\\jinja2\\idtracking.py',
   'PYMODULE'),
  ('jinja2.lexer',
   'D:\\Python\\prohorenok_pyqt6\\venv\\Lib\\site-packages\\jinja2\\lexer.py',
   'PYMODULE'),
  ('jinja2.loaders',
   'D:\\Python\\prohorenok_pyqt6\\venv\\Lib\\site-packages\\jinja2\\loaders.py',
   'PYMODULE'),
  ('jinja2.nodes',
   'D:\\Python\\prohorenok_pyqt6\\venv\\Lib\\site-packages\\jinja2\\nodes.py',
   'PYMODULE'),
  ('jinja2.optimizer',
   'D:\\Python\\prohorenok_pyqt6\\venv\\Lib\\site-packages\\jinja2\\optimizer.py',
   'PYMODULE'),
  ('jinja2.parser',
   'D:\\Python\\prohorenok_pyqt6\\venv\\Lib\\site-packages\\jinja2\\parser.py',
   'PYMODULE'),
  ('jinja2.runtime',
   'D:\\Python\\prohorenok_pyqt6\\venv\\Lib\\site-packages\\jinja2\\runtime.py',
   'PYMODULE'),
  ('jinja2.sandbox',
   'D:\\Python\\prohorenok_pyqt6\\venv\\Lib\\site-packages\\jinja2\\sandbox.py',
   'PYMODULE'),
  ('jinja2.tests',
   'D:\\Python\\prohorenok_pyqt6\\venv\\Lib\\site-packages\\jinja2\\tests.py',
   'PYMODULE'),
  ('jinja2.utils',
   'D:\\Python\\prohorenok_pyqt6\\venv\\Lib\\site-packages\\jinja2\\utils.py',
   'PYMODULE'),
  ('jinja2.visitor',
   'D:\\Python\\prohorenok_pyqt6\\venv\\Lib\\site-packages\\jinja2\\visitor.py',
   'PYMODULE'),
  ('json',
   'C:\\Users\\nidxegg.RKC\\AppData\\Local\\Programs\\Python\\Python311\\Lib\\json\\__init__.py',
   'PYMODULE'),
  ('json.decoder',
   'C:\\Users\\nidxegg.RKC\\AppData\\Local\\Programs\\Python\\Python311\\Lib\\json\\decoder.py',
   'PYMODULE'),
  ('json.encoder',
   'C:\\Users\\nidxegg.RKC\\AppData\\Local\\Programs\\Python\\Python311\\Lib\\json\\encoder.py',
   'PYMODULE'),
  ('json.scanner',
   'C:\\Users\\nidxegg.RKC\\AppData\\Local\\Programs\\Python\\Python311\\Lib\\json\\scanner.py',
   'PYMODULE'),
  ('logging',
   'C:\\Users\\nidxegg.RKC\\AppData\\Local\\Programs\\Python\\Python311\\Lib\\logging\\__init__.py',
   'PYMODULE'),
  ('lzma',
   'C:\\Users\\nidxegg.RKC\\AppData\\Local\\Programs\\Python\\Python311\\Lib\\lzma.py',
   'PYMODULE'),
  ('markupsafe',
   'D:\\Python\\prohorenok_pyqt6\\venv\\Lib\\site-packages\\markupsafe\\__init__.py',
   'PYMODULE'),
  ('markupsafe._native',
   'D:\\Python\\prohorenok_pyqt6\\venv\\Lib\\site-packages\\markupsafe\\_native.py',
   'PYMODULE'),
  ('mimetypes',
   'C:\\Users\\nidxegg.RKC\\AppData\\Local\\Programs\\Python\\Python311\\Lib\\mimetypes.py',
   'PYMODULE'),
  ('multiprocessing',
   'C:\\Users\\nidxegg.RKC\\AppData\\Local\\Programs\\Python\\Python311\\Lib\\multiprocessing\\__init__.py',
   'PYMODULE'),
  ('multiprocessing.connection',
   'C:\\Users\\nidxegg.RKC\\AppData\\Local\\Programs\\Python\\Python311\\Lib\\multiprocessing\\connection.py',
   'PYMODULE'),
  ('multiprocessing.context',
   'C:\\Users\\nidxegg.RKC\\AppData\\Local\\Programs\\Python\\Python311\\Lib\\multiprocessing\\context.py',
   'PYMODULE'),
  ('multiprocessing.dummy',
   'C:\\Users\\nidxegg.RKC\\AppData\\Local\\Programs\\Python\\Python311\\Lib\\multiprocessing\\dummy\\__init__.py',
   'PYMODULE'),
  ('multiprocessing.dummy.connection',
   'C:\\Users\\nidxegg.RKC\\AppData\\Local\\Programs\\Python\\Python311\\Lib\\multiprocessing\\dummy\\connection.py',
   'PYMODULE'),
  ('multiprocessing.forkserver',
   'C:\\Users\\nidxegg.RKC\\AppData\\Local\\Programs\\Python\\Python311\\Lib\\multiprocessing\\forkserver.py',
   'PYMODULE'),
  ('multiprocessing.heap',
   'C:\\Users\\nidxegg.RKC\\AppData\\Local\\Programs\\Python\\Python311\\Lib\\multiprocessing\\heap.py',
   'PYMODULE'),
  ('multiprocessing.managers',
   'C:\\Users\\nidxegg.RKC\\AppData\\Local\\Programs\\Python\\Python311\\Lib\\multiprocessing\\managers.py',
   'PYMODULE'),
  ('multiprocessing.pool',
   'C:\\Users\\nidxegg.RKC\\AppData\\Local\\Programs\\Python\\Python311\\Lib\\multiprocessing\\pool.py',
   'PYMODULE'),
  ('multiprocessing.popen_fork',
   'C:\\Users\\nidxegg.RKC\\AppData\\Local\\Programs\\Python\\Python311\\Lib\\multiprocessing\\popen_fork.py',
   'PYMODULE'),
  ('multiprocessing.popen_forkserver',
   'C:\\Users\\nidxegg.RKC\\AppData\\Local\\Programs\\Python\\Python311\\Lib\\multiprocessing\\popen_forkserver.py',
   'PYMODULE'),
  ('multiprocessing.popen_spawn_posix',
   'C:\\Users\\nidxegg.RKC\\AppData\\Local\\Programs\\Python\\Python311\\Lib\\multiprocessing\\popen_spawn_posix.py',
   'PYMODULE'),
  ('multiprocessing.popen_spawn_win32',
   'C:\\Users\\nidxegg.RKC\\AppData\\Local\\Programs\\Python\\Python311\\Lib\\multiprocessing\\popen_spawn_win32.py',
   'PYMODULE'),
  ('multiprocessing.process',
   'C:\\Users\\nidxegg.RKC\\AppData\\Local\\Programs\\Python\\Python311\\Lib\\multiprocessing\\process.py',
   'PYMODULE'),
  ('multiprocessing.queues',
   'C:\\Users\\nidxegg.RKC\\AppData\\Local\\Programs\\Python\\Python311\\Lib\\multiprocessing\\queues.py',
   'PYMODULE'),
  ('multiprocessing.reduction',
   'C:\\Users\\nidxegg.RKC\\AppData\\Local\\Programs\\Python\\Python311\\Lib\\multiprocessing\\reduction.py',
   'PYMODULE'),
  ('multiprocessing.resource_sharer',
   'C:\\Users\\nidxegg.RKC\\AppData\\Local\\Programs\\Python\\Python311\\Lib\\multiprocessing\\resource_sharer.py',
   'PYMODULE'),
  ('multiprocessing.resource_tracker',
   'C:\\Users\\nidxegg.RKC\\AppData\\Local\\Programs\\Python\\Python311\\Lib\\multiprocessing\\resource_tracker.py',
   'PYMODULE'),
  ('multiprocessing.shared_memory',
   'C:\\Users\\nidxegg.RKC\\AppData\\Local\\Programs\\Python\\Python311\\Lib\\multiprocessing\\shared_memory.py',
   'PYMODULE'),
  ('multiprocessing.sharedctypes',
   'C:\\Users\\nidxegg.RKC\\AppData\\Local\\Programs\\Python\\Python311\\Lib\\multiprocessing\\sharedctypes.py',
   'PYMODULE'),
  ('multiprocessing.spawn',
   'C:\\Users\\nidxegg.RKC\\AppData\\Local\\Programs\\Python\\Python311\\Lib\\multiprocessing\\spawn.py',
   'PYMODULE'),
  ('multiprocessing.synchronize',
   'C:\\Users\\nidxegg.RKC\\AppData\\Local\\Programs\\Python\\Python311\\Lib\\multiprocessing\\synchronize.py',
   'PYMODULE'),
  ('multiprocessing.util',
   'C:\\Users\\nidxegg.RKC\\AppData\\Local\\Programs\\Python\\Python311\\Lib\\multiprocessing\\util.py',
   'PYMODULE'),
  ('netrc',
   'C:\\Users\\nidxegg.RKC\\AppData\\Local\\Programs\\Python\\Python311\\Lib\\netrc.py',
   'PYMODULE'),
  ('nturl2path',
   'C:\\Users\\nidxegg.RKC\\AppData\\Local\\Programs\\Python\\Python311\\Lib\\nturl2path.py',
   'PYMODULE'),
  ('numbers',
   'C:\\Users\\nidxegg.RKC\\AppData\\Local\\Programs\\Python\\Python311\\Lib\\numbers.py',
   'PYMODULE'),
  ('opcode',
   'C:\\Users\\nidxegg.RKC\\AppData\\Local\\Programs\\Python\\Python311\\Lib\\opcode.py',
   'PYMODULE'),
  ('pickle',
   'C:\\Users\\nidxegg.RKC\\AppData\\Local\\Programs\\Python\\Python311\\Lib\\pickle.py',
   'PYMODULE'),
  ('pkgutil',
   'C:\\Users\\nidxegg.RKC\\AppData\\Local\\Programs\\Python\\Python311\\Lib\\pkgutil.py',
   'PYMODULE'),
  ('platform',
   'C:\\Users\\nidxegg.RKC\\AppData\\Local\\Programs\\Python\\Python311\\Lib\\platform.py',
   'PYMODULE'),
  ('pprint',
   'C:\\Users\\nidxegg.RKC\\AppData\\Local\\Programs\\Python\\Python311\\Lib\\pprint.py',
   'PYMODULE'),
  ('py_compile',
   'C:\\Users\\nidxegg.RKC\\AppData\\Local\\Programs\\Python\\Python311\\Lib\\py_compile.py',
   'PYMODULE'),
  ('pypyodbc',
   'D:\\Python\\prohorenok_pyqt6\\venv\\Lib\\site-packages\\pypyodbc.py',
   'PYMODULE'),
  ('qt_material',
   'D:\\Python\\prohorenok_pyqt6\\venv\\Lib\\site-packages\\qt_material\\__init__.py',
   'PYMODULE'),
  ('qt_material.resources',
   'D:\\Python\\prohorenok_pyqt6\\venv\\Lib\\site-packages\\qt_material\\resources\\__init__.py',
   'PYMODULE'),
  ('qt_material.resources.generate',
   'D:\\Python\\prohorenok_pyqt6\\venv\\Lib\\site-packages\\qt_material\\resources\\generate.py',
   'PYMODULE'),
  ('queue',
   'C:\\Users\\nidxegg.RKC\\AppData\\Local\\Programs\\Python\\Python311\\Lib\\queue.py',
   'PYMODULE'),
  ('quopri',
   'C:\\Users\\nidxegg.RKC\\AppData\\Local\\Programs\\Python\\Python311\\Lib\\quopri.py',
   'PYMODULE'),
  ('random',
   'C:\\Users\\nidxegg.RKC\\AppData\\Local\\Programs\\Python\\Python311\\Lib\\random.py',
   'PYMODULE'),
  ('rlcompleter',
   'C:\\Users\\nidxegg.RKC\\AppData\\Local\\Programs\\Python\\Python311\\Lib\\rlcompleter.py',
   'PYMODULE'),
  ('runpy',
   'C:\\Users\\nidxegg.RKC\\AppData\\Local\\Programs\\Python\\Python311\\Lib\\runpy.py',
   'PYMODULE'),
  ('secrets',
   'C:\\Users\\nidxegg.RKC\\AppData\\Local\\Programs\\Python\\Python311\\Lib\\secrets.py',
   'PYMODULE'),
  ('selectors',
   'C:\\Users\\nidxegg.RKC\\AppData\\Local\\Programs\\Python\\Python311\\Lib\\selectors.py',
   'PYMODULE'),
  ('shiboken6',
   'D:\\Python\\prohorenok_pyqt6\\venv\\Lib\\site-packages\\shiboken6\\__init__.py',
   'PYMODULE'),
  ('shlex',
   'C:\\Users\\nidxegg.RKC\\AppData\\Local\\Programs\\Python\\Python311\\Lib\\shlex.py',
   'PYMODULE'),
  ('shredder_template',
   'D:\\Python\\prohorenok_pyqt6\\project\\shredder\\shredder_template.py',
   'PYMODULE'),
  ('shutil',
   'C:\\Users\\nidxegg.RKC\\AppData\\Local\\Programs\\Python\\Python311\\Lib\\shutil.py',
   'PYMODULE'),
  ('signal',
   'C:\\Users\\nidxegg.RKC\\AppData\\Local\\Programs\\Python\\Python311\\Lib\\signal.py',
   'PYMODULE'),
  ('socket',
   'C:\\Users\\nidxegg.RKC\\AppData\\Local\\Programs\\Python\\Python311\\Lib\\socket.py',
   'PYMODULE'),
  ('ssl',
   'C:\\Users\\nidxegg.RKC\\AppData\\Local\\Programs\\Python\\Python311\\Lib\\ssl.py',
   'PYMODULE'),
  ('statistics',
   'C:\\Users\\nidxegg.RKC\\AppData\\Local\\Programs\\Python\\Python311\\Lib\\statistics.py',
   'PYMODULE'),
  ('string',
   'C:\\Users\\nidxegg.RKC\\AppData\\Local\\Programs\\Python\\Python311\\Lib\\string.py',
   'PYMODULE'),
  ('stringprep',
   'C:\\Users\\nidxegg.RKC\\AppData\\Local\\Programs\\Python\\Python311\\Lib\\stringprep.py',
   'PYMODULE'),
  ('subprocess',
   'C:\\Users\\nidxegg.RKC\\AppData\\Local\\Programs\\Python\\Python311\\Lib\\subprocess.py',
   'PYMODULE'),
  ('tarfile',
   'C:\\Users\\nidxegg.RKC\\AppData\\Local\\Programs\\Python\\Python311\\Lib\\tarfile.py',
   'PYMODULE'),
  ('tempfile',
   'C:\\Users\\nidxegg.RKC\\AppData\\Local\\Programs\\Python\\Python311\\Lib\\tempfile.py',
   'PYMODULE'),
  ('textwrap',
   'C:\\Users\\nidxegg.RKC\\AppData\\Local\\Programs\\Python\\Python311\\Lib\\textwrap.py',
   'PYMODULE'),
  ('threading',
   'C:\\Users\\nidxegg.RKC\\AppData\\Local\\Programs\\Python\\Python311\\Lib\\threading.py',
   'PYMODULE'),
  ('tracemalloc',
   'C:\\Users\\nidxegg.RKC\\AppData\\Local\\Programs\\Python\\Python311\\Lib\\tracemalloc.py',
   'PYMODULE'),
  ('typing',
   'C:\\Users\\nidxegg.RKC\\AppData\\Local\\Programs\\Python\\Python311\\Lib\\typing.py',
   'PYMODULE'),
  ('xml',
   'C:\\Users\\nidxegg.RKC\\AppData\\Local\\Programs\\Python\\Python311\\Lib\\xml\\__init__.py',
   'PYMODULE'),
  ('xml.dom',
   'C:\\Users\\nidxegg.RKC\\AppData\\Local\\Programs\\Python\\Python311\\Lib\\xml\\dom\\__init__.py',
   'PYMODULE'),
  ('xml.dom.NodeFilter',
   'C:\\Users\\nidxegg.RKC\\AppData\\Local\\Programs\\Python\\Python311\\Lib\\xml\\dom\\NodeFilter.py',
   'PYMODULE'),
  ('xml.dom.domreg',
   'C:\\Users\\nidxegg.RKC\\AppData\\Local\\Programs\\Python\\Python311\\Lib\\xml\\dom\\domreg.py',
   'PYMODULE'),
  ('xml.dom.expatbuilder',
   'C:\\Users\\nidxegg.RKC\\AppData\\Local\\Programs\\Python\\Python311\\Lib\\xml\\dom\\expatbuilder.py',
   'PYMODULE'),
  ('xml.dom.minicompat',
   'C:\\Users\\nidxegg.RKC\\AppData\\Local\\Programs\\Python\\Python311\\Lib\\xml\\dom\\minicompat.py',
   'PYMODULE'),
  ('xml.dom.minidom',
   'C:\\Users\\nidxegg.RKC\\AppData\\Local\\Programs\\Python\\Python311\\Lib\\xml\\dom\\minidom.py',
   'PYMODULE'),
  ('xml.dom.pulldom',
   'C:\\Users\\nidxegg.RKC\\AppData\\Local\\Programs\\Python\\Python311\\Lib\\xml\\dom\\pulldom.py',
   'PYMODULE'),
  ('xml.dom.xmlbuilder',
   'C:\\Users\\nidxegg.RKC\\AppData\\Local\\Programs\\Python\\Python311\\Lib\\xml\\dom\\xmlbuilder.py',
   'PYMODULE'),
  ('xml.etree',
   'C:\\Users\\nidxegg.RKC\\AppData\\Local\\Programs\\Python\\Python311\\Lib\\xml\\etree\\__init__.py',
   'PYMODULE'),
  ('xml.etree.ElementInclude',
   'C:\\Users\\nidxegg.RKC\\AppData\\Local\\Programs\\Python\\Python311\\Lib\\xml\\etree\\ElementInclude.py',
   'PYMODULE'),
  ('xml.etree.ElementPath',
   'C:\\Users\\nidxegg.RKC\\AppData\\Local\\Programs\\Python\\Python311\\Lib\\xml\\etree\\ElementPath.py',
   'PYMODULE'),
  ('xml.etree.ElementTree',
   'C:\\Users\\nidxegg.RKC\\AppData\\Local\\Programs\\Python\\Python311\\Lib\\xml\\etree\\ElementTree.py',
   'PYMODULE'),
  ('xml.etree.cElementTree',
   'C:\\Users\\nidxegg.RKC\\AppData\\Local\\Programs\\Python\\Python311\\Lib\\xml\\etree\\cElementTree.py',
   'PYMODULE'),
  ('xml.parsers',
   'C:\\Users\\nidxegg.RKC\\AppData\\Local\\Programs\\Python\\Python311\\Lib\\xml\\parsers\\__init__.py',
   'PYMODULE'),
  ('xml.parsers.expat',
   'C:\\Users\\nidxegg.RKC\\AppData\\Local\\Programs\\Python\\Python311\\Lib\\xml\\parsers\\expat.py',
   'PYMODULE'),
  ('xml.sax',
   'C:\\Users\\nidxegg.RKC\\AppData\\Local\\Programs\\Python\\Python311\\Lib\\xml\\sax\\__init__.py',
   'PYMODULE'),
  ('xml.sax._exceptions',
   'C:\\Users\\nidxegg.RKC\\AppData\\Local\\Programs\\Python\\Python311\\Lib\\xml\\sax\\_exceptions.py',
   'PYMODULE'),
  ('xml.sax.expatreader',
   'C:\\Users\\nidxegg.RKC\\AppData\\Local\\Programs\\Python\\Python311\\Lib\\xml\\sax\\expatreader.py',
   'PYMODULE'),
  ('xml.sax.handler',
   'C:\\Users\\nidxegg.RKC\\AppData\\Local\\Programs\\Python\\Python311\\Lib\\xml\\sax\\handler.py',
   'PYMODULE'),
  ('xml.sax.saxutils',
   'C:\\Users\\nidxegg.RKC\\AppData\\Local\\Programs\\Python\\Python311\\Lib\\xml\\sax\\saxutils.py',
   'PYMODULE'),
  ('xml.sax.xmlreader',
   'C:\\Users\\nidxegg.RKC\\AppData\\Local\\Programs\\Python\\Python311\\Lib\\xml\\sax\\xmlreader.py',
   'PYMODULE'),
  ('xmlrpc',
   'C:\\Users\\nidxegg.RKC\\AppData\\Local\\Programs\\Python\\Python311\\Lib\\xmlrpc\\__init__.py',
   'PYMODULE'),
  ('xmlrpc.client',
   'C:\\Users\\nidxegg.RKC\\AppData\\Local\\Programs\\Python\\Python311\\Lib\\xmlrpc\\client.py',
   'PYMODULE'),
  ('zipfile',
   'C:\\Users\\nidxegg.RKC\\AppData\\Local\\Programs\\Python\\Python311\\Lib\\zipfile.py',
   'PYMODULE'),
  ('zipimport',
   'C:\\Users\\nidxegg.RKC\\AppData\\Local\\Programs\\Python\\Python311\\Lib\\zipimport.py',
   'PYMODULE')])
