(['D:\\Python\\prohorenok_pyqt6\\project\\shredder\\shredder.py'],
 ['D:\\Python\\prohorenok_pyqt6\\project\\shredder'],
 ['codecs'],
 ['D:\\Python\\prohorenok_pyqt6\\venv\\Lib\\site-packages\\_pyinstaller_hooks_contrib\\hooks\\stdhooks',
  'D:\\Python\\prohorenok_pyqt6\\venv\\Lib\\site-packages\\_pyinstaller_hooks_contrib\\hooks\\stdhooks\\__pycache__',
  'D:\\Python\\prohorenok_pyqt6\\venv\\Lib\\site-packages\\_pyinstaller_hooks_contrib\\hooks\\rthooks',
  'D:\\Python\\prohorenok_pyqt6\\venv\\Lib\\site-packages\\_pyinstaller_hooks_contrib\\hooks\\rthooks\\__pycache__',
  'D:\\Python\\prohorenok_pyqt6\\venv\\Lib\\site-packages\\_pyinstaller_hooks_contrib\\hooks',
  'D:\\Python\\prohorenok_pyqt6\\venv\\Lib\\site-packages\\qt_material'],
 {},
 [],
 [],
 False,
 False,
 False,
 {},
 '3.11.1 (tags/v3.11.1:a7a450f, Dec  6 2022, 19:58:39) [MSC v.1934 64 bit '
 '(AMD64)]',
 [('pyi_rth_inspect',
   'D:\\Python\\prohorenok_pyqt6\\venv\\Lib\\site-packages\\PyInstaller\\hooks\\rthooks\\pyi_rth_inspect.py',
   'PYSOURCE'),
  ('pyi_rth_pyqt6',
   'D:\\Python\\prohorenok_pyqt6\\venv\\Lib\\site-packages\\PyInstaller\\hooks\\rthooks\\pyi_rth_pyqt6.py',
   'PYSOURCE'),
  ('pyi_rth_pkgutil',
   'D:\\Python\\prohorenok_pyqt6\\venv\\Lib\\site-packages\\PyInstaller\\hooks\\rthooks\\pyi_rth_pkgutil.py',
   'PYSOURCE'),
  ('pyi_rth_multiprocessing',
   'D:\\Python\\prohorenok_pyqt6\\venv\\Lib\\site-packages\\PyInstaller\\hooks\\rthooks\\pyi_rth_multiprocessing.py',
   'PYSOURCE'),
  ('pyi_rth_pyside6',
   'D:\\Python\\prohorenok_pyqt6\\venv\\Lib\\site-packages\\PyInstaller\\hooks\\rthooks\\pyi_rth_pyside6.py',
   'PYSOURCE'),
  ('shredder',
   'D:\\Python\\prohorenok_pyqt6\\project\\shredder\\shredder.py',
   'PYSOURCE')],
 [('multiprocessing.popen_spawn_posix',
   'C:\\Users\\nidxegg.RKC\\AppData\\Local\\Programs\\Python\\Python311\\Lib\\multiprocessing\\popen_spawn_posix.py',
   'PYMODULE'),
  ('multiprocessing.resource_tracker',
   'C:\\Users\\nidxegg.RKC\\AppData\\Local\\Programs\\Python\\Python311\\Lib\\multiprocessing\\resource_tracker.py',
   'PYMODULE'),
  ('signal',
   'C:\\Users\\nidxegg.RKC\\AppData\\Local\\Programs\\Python\\Python311\\Lib\\signal.py',
   'PYMODULE'),
  ('multiprocessing.util',
   'C:\\Users\\nidxegg.RKC\\AppData\\Local\\Programs\\Python\\Python311\\Lib\\multiprocessing\\util.py',
   'PYMODULE'),
  ('multiprocessing.forkserver',
   'C:\\Users\\nidxegg.RKC\\AppData\\Local\\Programs\\Python\\Python311\\Lib\\multiprocessing\\forkserver.py',
   'PYMODULE'),
  ('multiprocessing.connection',
   'C:\\Users\\nidxegg.RKC\\AppData\\Local\\Programs\\Python\\Python311\\Lib\\multiprocessing\\connection.py',
   'PYMODULE'),
  ('multiprocessing.resource_sharer',
   'C:\\Users\\nidxegg.RKC\\AppData\\Local\\Programs\\Python\\Python311\\Lib\\multiprocessing\\resource_sharer.py',
   'PYMODULE'),
  ('xmlrpc.client',
   'C:\\Users\\nidxegg.RKC\\AppData\\Local\\Programs\\Python\\Python311\\Lib\\xmlrpc\\client.py',
   'PYMODULE'),
  ('xmlrpc',
   'C:\\Users\\nidxegg.RKC\\AppData\\Local\\Programs\\Python\\Python311\\Lib\\xmlrpc\\__init__.py',
   'PYMODULE'),
  ('gzip',
   'C:\\Users\\nidxegg.RKC\\AppData\\Local\\Programs\\Python\\Python311\\Lib\\gzip.py',
   'PYMODULE'),
  ('argparse',
   'C:\\Users\\nidxegg.RKC\\AppData\\Local\\Programs\\Python\\Python311\\Lib\\argparse.py',
   'PYMODULE'),
  ('textwrap',
   'C:\\Users\\nidxegg.RKC\\AppData\\Local\\Programs\\Python\\Python311\\Lib\\textwrap.py',
   'PYMODULE'),
  ('copy',
   'C:\\Users\\nidxegg.RKC\\AppData\\Local\\Programs\\Python\\Python311\\Lib\\copy.py',
   'PYMODULE'),
  ('gettext',
   'C:\\Users\\nidxegg.RKC\\AppData\\Local\\Programs\\Python\\Python311\\Lib\\gettext.py',
   'PYMODULE'),
  ('_compression',
   'C:\\Users\\nidxegg.RKC\\AppData\\Local\\Programs\\Python\\Python311\\Lib\\_compression.py',
   'PYMODULE'),
  ('xml.parsers.expat',
   'C:\\Users\\nidxegg.RKC\\AppData\\Local\\Programs\\Python\\Python311\\Lib\\xml\\parsers\\expat.py',
   'PYMODULE'),
  ('xml.parsers',
   'C:\\Users\\nidxegg.RKC\\AppData\\Local\\Programs\\Python\\Python311\\Lib\\xml\\parsers\\__init__.py',
   'PYMODULE'),
  ('xml',
   'C:\\Users\\nidxegg.RKC\\AppData\\Local\\Programs\\Python\\Python311\\Lib\\xml\\__init__.py',
   'PYMODULE'),
  ('xml.sax.expatreader',
   'C:\\Users\\nidxegg.RKC\\AppData\\Local\\Programs\\Python\\Python311\\Lib\\xml\\sax\\expatreader.py',
   'PYMODULE'),
  ('xml.sax.saxutils',
   'C:\\Users\\nidxegg.RKC\\AppData\\Local\\Programs\\Python\\Python311\\Lib\\xml\\sax\\saxutils.py',
   'PYMODULE'),
  ('xml.sax',
   'C:\\Users\\nidxegg.RKC\\AppData\\Local\\Programs\\Python\\Python311\\Lib\\xml\\sax\\__init__.py',
   'PYMODULE'),
  ('xml.sax.handler',
   'C:\\Users\\nidxegg.RKC\\AppData\\Local\\Programs\\Python\\Python311\\Lib\\xml\\sax\\handler.py',
   'PYMODULE'),
  ('xml.sax._exceptions',
   'C:\\Users\\nidxegg.RKC\\AppData\\Local\\Programs\\Python\\Python311\\Lib\\xml\\sax\\_exceptions.py',
   'PYMODULE'),
  ('xml.sax.xmlreader',
   'C:\\Users\\nidxegg.RKC\\AppData\\Local\\Programs\\Python\\Python311\\Lib\\xml\\sax\\xmlreader.py',
   'PYMODULE'),
  ('http.client',
   'C:\\Users\\nidxegg.RKC\\AppData\\Local\\Programs\\Python\\Python311\\Lib\\http\\client.py',
   'PYMODULE'),
  ('ssl',
   'C:\\Users\\nidxegg.RKC\\AppData\\Local\\Programs\\Python\\Python311\\Lib\\ssl.py',
   'PYMODULE'),
  ('calendar',
   'C:\\Users\\nidxegg.RKC\\AppData\\Local\\Programs\\Python\\Python311\\Lib\\calendar.py',
   'PYMODULE'),
  ('http',
   'C:\\Users\\nidxegg.RKC\\AppData\\Local\\Programs\\Python\\Python311\\Lib\\http\\__init__.py',
   'PYMODULE'),
  ('email.message',
   'C:\\Users\\nidxegg.RKC\\AppData\\Local\\Programs\\Python\\Python311\\Lib\\email\\message.py',
   'PYMODULE'),
  ('email.policy',
   'C:\\Users\\nidxegg.RKC\\AppData\\Local\\Programs\\Python\\Python311\\Lib\\email\\policy.py',
   'PYMODULE'),
  ('email.contentmanager',
   'C:\\Users\\nidxegg.RKC\\AppData\\Local\\Programs\\Python\\Python311\\Lib\\email\\contentmanager.py',
   'PYMODULE'),
  ('email.quoprimime',
   'C:\\Users\\nidxegg.RKC\\AppData\\Local\\Programs\\Python\\Python311\\Lib\\email\\quoprimime.py',
   'PYMODULE'),
  ('string',
   'C:\\Users\\nidxegg.RKC\\AppData\\Local\\Programs\\Python\\Python311\\Lib\\string.py',
   'PYMODULE'),
  ('email.headerregistry',
   'C:\\Users\\nidxegg.RKC\\AppData\\Local\\Programs\\Python\\Python311\\Lib\\email\\headerregistry.py',
   'PYMODULE'),
  ('email._header_value_parser',
   'C:\\Users\\nidxegg.RKC\\AppData\\Local\\Programs\\Python\\Python311\\Lib\\email\\_header_value_parser.py',
   'PYMODULE'),
  ('email.iterators',
   'C:\\Users\\nidxegg.RKC\\AppData\\Local\\Programs\\Python\\Python311\\Lib\\email\\iterators.py',
   'PYMODULE'),
  ('email.generator',
   'C:\\Users\\nidxegg.RKC\\AppData\\Local\\Programs\\Python\\Python311\\Lib\\email\\generator.py',
   'PYMODULE'),
  ('random',
   'C:\\Users\\nidxegg.RKC\\AppData\\Local\\Programs\\Python\\Python311\\Lib\\random.py',
   'PYMODULE'),
  ('statistics',
   'C:\\Users\\nidxegg.RKC\\AppData\\Local\\Programs\\Python\\Python311\\Lib\\statistics.py',
   'PYMODULE'),
  ('fractions',
   'C:\\Users\\nidxegg.RKC\\AppData\\Local\\Programs\\Python\\Python311\\Lib\\fractions.py',
   'PYMODULE'),
  ('numbers',
   'C:\\Users\\nidxegg.RKC\\AppData\\Local\\Programs\\Python\\Python311\\Lib\\numbers.py',
   'PYMODULE'),
  ('hashlib',
   'C:\\Users\\nidxegg.RKC\\AppData\\Local\\Programs\\Python\\Python311\\Lib\\hashlib.py',
   'PYMODULE'),
  ('bisect',
   'C:\\Users\\nidxegg.RKC\\AppData\\Local\\Programs\\Python\\Python311\\Lib\\bisect.py',
   'PYMODULE'),
  ('email._encoded_words',
   'C:\\Users\\nidxegg.RKC\\AppData\\Local\\Programs\\Python\\Python311\\Lib\\email\\_encoded_words.py',
   'PYMODULE'),
  ('email.charset',
   'C:\\Users\\nidxegg.RKC\\AppData\\Local\\Programs\\Python\\Python311\\Lib\\email\\charset.py',
   'PYMODULE'),
  ('email.encoders',
   'C:\\Users\\nidxegg.RKC\\AppData\\Local\\Programs\\Python\\Python311\\Lib\\email\\encoders.py',
   'PYMODULE'),
  ('email.base64mime',
   'C:\\Users\\nidxegg.RKC\\AppData\\Local\\Programs\\Python\\Python311\\Lib\\email\\base64mime.py',
   'PYMODULE'),
  ('email._policybase',
   'C:\\Users\\nidxegg.RKC\\AppData\\Local\\Programs\\Python\\Python311\\Lib\\email\\_policybase.py',
   'PYMODULE'),
  ('email.header',
   'C:\\Users\\nidxegg.RKC\\AppData\\Local\\Programs\\Python\\Python311\\Lib\\email\\header.py',
   'PYMODULE'),
  ('email.errors',
   'C:\\Users\\nidxegg.RKC\\AppData\\Local\\Programs\\Python\\Python311\\Lib\\email\\errors.py',
   'PYMODULE'),
  ('email.utils',
   'C:\\Users\\nidxegg.RKC\\AppData\\Local\\Programs\\Python\\Python311\\Lib\\email\\utils.py',
   'PYMODULE'),
  ('email._parseaddr',
   'C:\\Users\\nidxegg.RKC\\AppData\\Local\\Programs\\Python\\Python311\\Lib\\email\\_parseaddr.py',
   'PYMODULE'),
  ('email',
   'C:\\Users\\nidxegg.RKC\\AppData\\Local\\Programs\\Python\\Python311\\Lib\\email\\__init__.py',
   'PYMODULE'),
  ('quopri',
   'C:\\Users\\nidxegg.RKC\\AppData\\Local\\Programs\\Python\\Python311\\Lib\\quopri.py',
   'PYMODULE'),
  ('getopt',
   'C:\\Users\\nidxegg.RKC\\AppData\\Local\\Programs\\Python\\Python311\\Lib\\getopt.py',
   'PYMODULE'),
  ('email.parser',
   'C:\\Users\\nidxegg.RKC\\AppData\\Local\\Programs\\Python\\Python311\\Lib\\email\\parser.py',
   'PYMODULE'),
  ('email.feedparser',
   'C:\\Users\\nidxegg.RKC\\AppData\\Local\\Programs\\Python\\Python311\\Lib\\email\\feedparser.py',
   'PYMODULE'),
  ('decimal',
   'C:\\Users\\nidxegg.RKC\\AppData\\Local\\Programs\\Python\\Python311\\Lib\\decimal.py',
   'PYMODULE'),
  ('_pydecimal',
   'C:\\Users\\nidxegg.RKC\\AppData\\Local\\Programs\\Python\\Python311\\Lib\\_pydecimal.py',
   'PYMODULE'),
  ('contextvars',
   'C:\\Users\\nidxegg.RKC\\AppData\\Local\\Programs\\Python\\Python311\\Lib\\contextvars.py',
   'PYMODULE'),
  ('datetime',
   'C:\\Users\\nidxegg.RKC\\AppData\\Local\\Programs\\Python\\Python311\\Lib\\datetime.py',
   'PYMODULE'),
  ('_strptime',
   'C:\\Users\\nidxegg.RKC\\AppData\\Local\\Programs\\Python\\Python311\\Lib\\_strptime.py',
   'PYMODULE'),
  ('base64',
   'C:\\Users\\nidxegg.RKC\\AppData\\Local\\Programs\\Python\\Python311\\Lib\\base64.py',
   'PYMODULE'),
  ('hmac',
   'C:\\Users\\nidxegg.RKC\\AppData\\Local\\Programs\\Python\\Python311\\Lib\\hmac.py',
   'PYMODULE'),
  ('struct',
   'C:\\Users\\nidxegg.RKC\\AppData\\Local\\Programs\\Python\\Python311\\Lib\\struct.py',
   'PYMODULE'),
  ('socket',
   'C:\\Users\\nidxegg.RKC\\AppData\\Local\\Programs\\Python\\Python311\\Lib\\socket.py',
   'PYMODULE'),
  ('selectors',
   'C:\\Users\\nidxegg.RKC\\AppData\\Local\\Programs\\Python\\Python311\\Lib\\selectors.py',
   'PYMODULE'),
  ('tempfile',
   'C:\\Users\\nidxegg.RKC\\AppData\\Local\\Programs\\Python\\Python311\\Lib\\tempfile.py',
   'PYMODULE'),
  ('shutil',
   'C:\\Users\\nidxegg.RKC\\AppData\\Local\\Programs\\Python\\Python311\\Lib\\shutil.py',
   'PYMODULE'),
  ('zipfile',
   'C:\\Users\\nidxegg.RKC\\AppData\\Local\\Programs\\Python\\Python311\\Lib\\zipfile.py',
   'PYMODULE'),
  ('py_compile',
   'C:\\Users\\nidxegg.RKC\\AppData\\Local\\Programs\\Python\\Python311\\Lib\\py_compile.py',
   'PYMODULE'),
  ('importlib.machinery',
   'C:\\Users\\nidxegg.RKC\\AppData\\Local\\Programs\\Python\\Python311\\Lib\\importlib\\machinery.py',
   'PYMODULE'),
  ('importlib',
   'C:\\Users\\nidxegg.RKC\\AppData\\Local\\Programs\\Python\\Python311\\Lib\\importlib\\__init__.py',
   'PYMODULE'),
  ('importlib._bootstrap',
   'C:\\Users\\nidxegg.RKC\\AppData\\Local\\Programs\\Python\\Python311\\Lib\\importlib\\_bootstrap.py',
   'PYMODULE'),
  ('importlib._bootstrap_external',
   'C:\\Users\\nidxegg.RKC\\AppData\\Local\\Programs\\Python\\Python311\\Lib\\importlib\\_bootstrap_external.py',
   'PYMODULE'),
  ('importlib.metadata',
   'C:\\Users\\nidxegg.RKC\\AppData\\Local\\Programs\\Python\\Python311\\Lib\\importlib\\metadata\\__init__.py',
   'PYMODULE'),
  ('typing',
   'C:\\Users\\nidxegg.RKC\\AppData\\Local\\Programs\\Python\\Python311\\Lib\\typing.py',
   'PYMODULE'),
  ('importlib.abc',
   'C:\\Users\\nidxegg.RKC\\AppData\\Local\\Programs\\Python\\Python311\\Lib\\importlib\\abc.py',
   'PYMODULE'),
  ('importlib.resources.abc',
   'C:\\Users\\nidxegg.RKC\\AppData\\Local\\Programs\\Python\\Python311\\Lib\\importlib\\resources\\abc.py',
   'PYMODULE'),
  ('importlib.resources',
   'C:\\Users\\nidxegg.RKC\\AppData\\Local\\Programs\\Python\\Python311\\Lib\\importlib\\resources\\__init__.py',
   'PYMODULE'),
  ('importlib.resources._legacy',
   'C:\\Users\\nidxegg.RKC\\AppData\\Local\\Programs\\Python\\Python311\\Lib\\importlib\\resources\\_legacy.py',
   'PYMODULE'),
  ('importlib.resources._common',
   'C:\\Users\\nidxegg.RKC\\AppData\\Local\\Programs\\Python\\Python311\\Lib\\importlib\\resources\\_common.py',
   'PYMODULE'),
  ('importlib.resources._adapters',
   'C:\\Users\\nidxegg.RKC\\AppData\\Local\\Programs\\Python\\Python311\\Lib\\importlib\\resources\\_adapters.py',
   'PYMODULE'),
  ('importlib._abc',
   'C:\\Users\\nidxegg.RKC\\AppData\\Local\\Programs\\Python\\Python311\\Lib\\importlib\\_abc.py',
   'PYMODULE'),
  ('importlib.metadata._itertools',
   'C:\\Users\\nidxegg.RKC\\AppData\\Local\\Programs\\Python\\Python311\\Lib\\importlib\\metadata\\_itertools.py',
   'PYMODULE'),
  ('importlib.metadata._functools',
   'C:\\Users\\nidxegg.RKC\\AppData\\Local\\Programs\\Python\\Python311\\Lib\\importlib\\metadata\\_functools.py',
   'PYMODULE'),
  ('importlib.metadata._collections',
   'C:\\Users\\nidxegg.RKC\\AppData\\Local\\Programs\\Python\\Python311\\Lib\\importlib\\metadata\\_collections.py',
   'PYMODULE'),
  ('importlib.metadata._meta',
   'C:\\Users\\nidxegg.RKC\\AppData\\Local\\Programs\\Python\\Python311\\Lib\\importlib\\metadata\\_meta.py',
   'PYMODULE'),
  ('importlib.metadata._adapters',
   'C:\\Users\\nidxegg.RKC\\AppData\\Local\\Programs\\Python\\Python311\\Lib\\importlib\\metadata\\_adapters.py',
   'PYMODULE'),
  ('importlib.metadata._text',
   'C:\\Users\\nidxegg.RKC\\AppData\\Local\\Programs\\Python\\Python311\\Lib\\importlib\\metadata\\_text.py',
   'PYMODULE'),
  ('csv',
   'C:\\Users\\nidxegg.RKC\\AppData\\Local\\Programs\\Python\\Python311\\Lib\\csv.py',
   'PYMODULE'),
  ('importlib.readers',
   'C:\\Users\\nidxegg.RKC\\AppData\\Local\\Programs\\Python\\Python311\\Lib\\importlib\\readers.py',
   'PYMODULE'),
  ('importlib.resources.readers',
   'C:\\Users\\nidxegg.RKC\\AppData\\Local\\Programs\\Python\\Python311\\Lib\\importlib\\resources\\readers.py',
   'PYMODULE'),
  ('importlib.resources._itertools',
   'C:\\Users\\nidxegg.RKC\\AppData\\Local\\Programs\\Python\\Python311\\Lib\\importlib\\resources\\_itertools.py',
   'PYMODULE'),
  ('contextlib',
   'C:\\Users\\nidxegg.RKC\\AppData\\Local\\Programs\\Python\\Python311\\Lib\\contextlib.py',
   'PYMODULE'),
  ('importlib.util',
   'C:\\Users\\nidxegg.RKC\\AppData\\Local\\Programs\\Python\\Python311\\Lib\\importlib\\util.py',
   'PYMODULE'),
  ('tarfile',
   'C:\\Users\\nidxegg.RKC\\AppData\\Local\\Programs\\Python\\Python311\\Lib\\tarfile.py',
   'PYMODULE'),
  ('lzma',
   'C:\\Users\\nidxegg.RKC\\AppData\\Local\\Programs\\Python\\Python311\\Lib\\lzma.py',
   'PYMODULE'),
  ('bz2',
   'C:\\Users\\nidxegg.RKC\\AppData\\Local\\Programs\\Python\\Python311\\Lib\\bz2.py',
   'PYMODULE'),
  ('logging',
   'C:\\Users\\nidxegg.RKC\\AppData\\Local\\Programs\\Python\\Python311\\Lib\\logging\\__init__.py',
   'PYMODULE'),
  ('pickle',
   'C:\\Users\\nidxegg.RKC\\AppData\\Local\\Programs\\Python\\Python311\\Lib\\pickle.py',
   'PYMODULE'),
  ('pprint',
   'C:\\Users\\nidxegg.RKC\\AppData\\Local\\Programs\\Python\\Python311\\Lib\\pprint.py',
   'PYMODULE'),
  ('dataclasses',
   'C:\\Users\\nidxegg.RKC\\AppData\\Local\\Programs\\Python\\Python311\\Lib\\dataclasses.py',
   'PYMODULE'),
  ('inspect',
   'C:\\Users\\nidxegg.RKC\\AppData\\Local\\Programs\\Python\\Python311\\Lib\\inspect.py',
   'PYMODULE'),
  ('dis',
   'C:\\Users\\nidxegg.RKC\\AppData\\Local\\Programs\\Python\\Python311\\Lib\\dis.py',
   'PYMODULE'),
  ('opcode',
   'C:\\Users\\nidxegg.RKC\\AppData\\Local\\Programs\\Python\\Python311\\Lib\\opcode.py',
   'PYMODULE'),
  ('ast',
   'C:\\Users\\nidxegg.RKC\\AppData\\Local\\Programs\\Python\\Python311\\Lib\\ast.py',
   'PYMODULE'),
  ('_compat_pickle',
   'C:\\Users\\nidxegg.RKC\\AppData\\Local\\Programs\\Python\\Python311\\Lib\\_compat_pickle.py',
   'PYMODULE'),
  ('multiprocessing.process',
   'C:\\Users\\nidxegg.RKC\\AppData\\Local\\Programs\\Python\\Python311\\Lib\\multiprocessing\\process.py',
   'PYMODULE'),
  ('multiprocessing.context',
   'C:\\Users\\nidxegg.RKC\\AppData\\Local\\Programs\\Python\\Python311\\Lib\\multiprocessing\\context.py',
   'PYMODULE'),
  ('multiprocessing.popen_forkserver',
   'C:\\Users\\nidxegg.RKC\\AppData\\Local\\Programs\\Python\\Python311\\Lib\\multiprocessing\\popen_forkserver.py',
   'PYMODULE'),
  ('multiprocessing.sharedctypes',
   'C:\\Users\\nidxegg.RKC\\AppData\\Local\\Programs\\Python\\Python311\\Lib\\multiprocessing\\sharedctypes.py',
   'PYMODULE'),
  ('multiprocessing.heap',
   'C:\\Users\\nidxegg.RKC\\AppData\\Local\\Programs\\Python\\Python311\\Lib\\multiprocessing\\heap.py',
   'PYMODULE'),
  ('ctypes',
   'C:\\Users\\nidxegg.RKC\\AppData\\Local\\Programs\\Python\\Python311\\Lib\\ctypes\\__init__.py',
   'PYMODULE'),
  ('ctypes._endian',
   'C:\\Users\\nidxegg.RKC\\AppData\\Local\\Programs\\Python\\Python311\\Lib\\ctypes\\_endian.py',
   'PYMODULE'),
  ('multiprocessing.pool',
   'C:\\Users\\nidxegg.RKC\\AppData\\Local\\Programs\\Python\\Python311\\Lib\\multiprocessing\\pool.py',
   'PYMODULE'),
  ('multiprocessing.dummy',
   'C:\\Users\\nidxegg.RKC\\AppData\\Local\\Programs\\Python\\Python311\\Lib\\multiprocessing\\dummy\\__init__.py',
   'PYMODULE'),
  ('multiprocessing.dummy.connection',
   'C:\\Users\\nidxegg.RKC\\AppData\\Local\\Programs\\Python\\Python311\\Lib\\multiprocessing\\dummy\\connection.py',
   'PYMODULE'),
  ('queue',
   'C:\\Users\\nidxegg.RKC\\AppData\\Local\\Programs\\Python\\Python311\\Lib\\queue.py',
   'PYMODULE'),
  ('multiprocessing.queues',
   'C:\\Users\\nidxegg.RKC\\AppData\\Local\\Programs\\Python\\Python311\\Lib\\multiprocessing\\queues.py',
   'PYMODULE'),
  ('multiprocessing.synchronize',
   'C:\\Users\\nidxegg.RKC\\AppData\\Local\\Programs\\Python\\Python311\\Lib\\multiprocessing\\synchronize.py',
   'PYMODULE'),
  ('multiprocessing.managers',
   'C:\\Users\\nidxegg.RKC\\AppData\\Local\\Programs\\Python\\Python311\\Lib\\multiprocessing\\managers.py',
   'PYMODULE'),
  ('multiprocessing.shared_memory',
   'C:\\Users\\nidxegg.RKC\\AppData\\Local\\Programs\\Python\\Python311\\Lib\\multiprocessing\\shared_memory.py',
   'PYMODULE'),
  ('secrets',
   'C:\\Users\\nidxegg.RKC\\AppData\\Local\\Programs\\Python\\Python311\\Lib\\secrets.py',
   'PYMODULE'),
  ('multiprocessing.reduction',
   'C:\\Users\\nidxegg.RKC\\AppData\\Local\\Programs\\Python\\Python311\\Lib\\multiprocessing\\reduction.py',
   'PYMODULE'),
  ('multiprocessing.popen_fork',
   'C:\\Users\\nidxegg.RKC\\AppData\\Local\\Programs\\Python\\Python311\\Lib\\multiprocessing\\popen_fork.py',
   'PYMODULE'),
  ('multiprocessing.popen_spawn_win32',
   'C:\\Users\\nidxegg.RKC\\AppData\\Local\\Programs\\Python\\Python311\\Lib\\multiprocessing\\popen_spawn_win32.py',
   'PYMODULE'),
  ('subprocess',
   'C:\\Users\\nidxegg.RKC\\AppData\\Local\\Programs\\Python\\Python311\\Lib\\subprocess.py',
   'PYMODULE'),
  ('multiprocessing.spawn',
   'C:\\Users\\nidxegg.RKC\\AppData\\Local\\Programs\\Python\\Python311\\Lib\\multiprocessing\\spawn.py',
   'PYMODULE'),
  ('runpy',
   'C:\\Users\\nidxegg.RKC\\AppData\\Local\\Programs\\Python\\Python311\\Lib\\runpy.py',
   'PYMODULE'),
  ('pkgutil',
   'C:\\Users\\nidxegg.RKC\\AppData\\Local\\Programs\\Python\\Python311\\Lib\\pkgutil.py',
   'PYMODULE'),
  ('zipimport',
   'C:\\Users\\nidxegg.RKC\\AppData\\Local\\Programs\\Python\\Python311\\Lib\\zipimport.py',
   'PYMODULE'),
  ('multiprocessing',
   'C:\\Users\\nidxegg.RKC\\AppData\\Local\\Programs\\Python\\Python311\\Lib\\multiprocessing\\__init__.py',
   'PYMODULE'),
  ('threading',
   'C:\\Users\\nidxegg.RKC\\AppData\\Local\\Programs\\Python\\Python311\\Lib\\threading.py',
   'PYMODULE'),
  ('_threading_local',
   'C:\\Users\\nidxegg.RKC\\AppData\\Local\\Programs\\Python\\Python311\\Lib\\_threading_local.py',
   'PYMODULE'),
  ('_py_abc',
   'C:\\Users\\nidxegg.RKC\\AppData\\Local\\Programs\\Python\\Python311\\Lib\\_py_abc.py',
   'PYMODULE'),
  ('tracemalloc',
   'C:\\Users\\nidxegg.RKC\\AppData\\Local\\Programs\\Python\\Python311\\Lib\\tracemalloc.py',
   'PYMODULE'),
  ('stringprep',
   'C:\\Users\\nidxegg.RKC\\AppData\\Local\\Programs\\Python\\Python311\\Lib\\stringprep.py',
   'PYMODULE'),
  ('getpass',
   'C:\\Users\\nidxegg.RKC\\AppData\\Local\\Programs\\Python\\Python311\\Lib\\getpass.py',
   'PYMODULE'),
  ('nturl2path',
   'C:\\Users\\nidxegg.RKC\\AppData\\Local\\Programs\\Python\\Python311\\Lib\\nturl2path.py',
   'PYMODULE'),
  ('ftplib',
   'C:\\Users\\nidxegg.RKC\\AppData\\Local\\Programs\\Python\\Python311\\Lib\\ftplib.py',
   'PYMODULE'),
  ('netrc',
   'C:\\Users\\nidxegg.RKC\\AppData\\Local\\Programs\\Python\\Python311\\Lib\\netrc.py',
   'PYMODULE'),
  ('shlex',
   'C:\\Users\\nidxegg.RKC\\AppData\\Local\\Programs\\Python\\Python311\\Lib\\shlex.py',
   'PYMODULE'),
  ('mimetypes',
   'C:\\Users\\nidxegg.RKC\\AppData\\Local\\Programs\\Python\\Python311\\Lib\\mimetypes.py',
   'PYMODULE'),
  ('http.cookiejar',
   'C:\\Users\\nidxegg.RKC\\AppData\\Local\\Programs\\Python\\Python311\\Lib\\http\\cookiejar.py',
   'PYMODULE'),
  ('shredder_template',
   'D:\\Python\\prohorenok_pyqt6\\project\\shredder\\shredder_template.py',
   'PYMODULE'),
  ('PyQt6',
   'D:\\Python\\prohorenok_pyqt6\\venv\\Lib\\site-packages\\PyQt6\\__init__.py',
   'PYMODULE'),
  ('qt_material',
   'D:\\Python\\prohorenok_pyqt6\\venv\\Lib\\site-packages\\qt_material\\__init__.py',
   'PYMODULE'),
  ('jinja2',
   'D:\\Python\\prohorenok_pyqt6\\venv\\Lib\\site-packages\\jinja2\\__init__.py',
   'PYMODULE'),
  ('jinja2.ext',
   'D:\\Python\\prohorenok_pyqt6\\venv\\Lib\\site-packages\\jinja2\\ext.py',
   'PYMODULE'),
  ('jinja2.parser',
   'D:\\Python\\prohorenok_pyqt6\\venv\\Lib\\site-packages\\jinja2\\parser.py',
   'PYMODULE'),
  ('jinja2.lexer',
   'D:\\Python\\prohorenok_pyqt6\\venv\\Lib\\site-packages\\jinja2\\lexer.py',
   'PYMODULE'),
  ('jinja2._identifier',
   'D:\\Python\\prohorenok_pyqt6\\venv\\Lib\\site-packages\\jinja2\\_identifier.py',
   'PYMODULE'),
  ('jinja2.defaults',
   'D:\\Python\\prohorenok_pyqt6\\venv\\Lib\\site-packages\\jinja2\\defaults.py',
   'PYMODULE'),
  ('jinja2.tests',
   'D:\\Python\\prohorenok_pyqt6\\venv\\Lib\\site-packages\\jinja2\\tests.py',
   'PYMODULE'),
  ('jinja2.filters',
   'D:\\Python\\prohorenok_pyqt6\\venv\\Lib\\site-packages\\jinja2\\filters.py',
   'PYMODULE'),
  ('jinja2.sandbox',
   'D:\\Python\\prohorenok_pyqt6\\venv\\Lib\\site-packages\\jinja2\\sandbox.py',
   'PYMODULE'),
  ('jinja2.async_utils',
   'D:\\Python\\prohorenok_pyqt6\\venv\\Lib\\site-packages\\jinja2\\async_utils.py',
   'PYMODULE'),
  ('markupsafe',
   'D:\\Python\\prohorenok_pyqt6\\venv\\Lib\\site-packages\\markupsafe\\__init__.py',
   'PYMODULE'),
  ('markupsafe._native',
   'D:\\Python\\prohorenok_pyqt6\\venv\\Lib\\site-packages\\markupsafe\\_native.py',
   'PYMODULE'),
  ('html',
   'C:\\Users\\nidxegg.RKC\\AppData\\Local\\Programs\\Python\\Python311\\Lib\\html\\__init__.py',
   'PYMODULE'),
  ('html.entities',
   'C:\\Users\\nidxegg.RKC\\AppData\\Local\\Programs\\Python\\Python311\\Lib\\html\\entities.py',
   'PYMODULE'),
  ('jinja2.utils',
   'D:\\Python\\prohorenok_pyqt6\\venv\\Lib\\site-packages\\jinja2\\utils.py',
   'PYMODULE'),
  ('jinja2.constants',
   'D:\\Python\\prohorenok_pyqt6\\venv\\Lib\\site-packages\\jinja2\\constants.py',
   'PYMODULE'),
  ('json',
   'C:\\Users\\nidxegg.RKC\\AppData\\Local\\Programs\\Python\\Python311\\Lib\\json\\__init__.py',
   'PYMODULE'),
  ('json.encoder',
   'C:\\Users\\nidxegg.RKC\\AppData\\Local\\Programs\\Python\\Python311\\Lib\\json\\encoder.py',
   'PYMODULE'),
  ('json.decoder',
   'C:\\Users\\nidxegg.RKC\\AppData\\Local\\Programs\\Python\\Python311\\Lib\\json\\decoder.py',
   'PYMODULE'),
  ('json.scanner',
   'C:\\Users\\nidxegg.RKC\\AppData\\Local\\Programs\\Python\\Python311\\Lib\\json\\scanner.py',
   'PYMODULE'),
  ('jinja2.runtime',
   'D:\\Python\\prohorenok_pyqt6\\venv\\Lib\\site-packages\\jinja2\\runtime.py',
   'PYMODULE'),
  ('jinja2.loaders',
   'D:\\Python\\prohorenok_pyqt6\\venv\\Lib\\site-packages\\jinja2\\loaders.py',
   'PYMODULE'),
  ('jinja2.exceptions',
   'D:\\Python\\prohorenok_pyqt6\\venv\\Lib\\site-packages\\jinja2\\exceptions.py',
   'PYMODULE'),
  ('jinja2.environment',
   'D:\\Python\\prohorenok_pyqt6\\venv\\Lib\\site-packages\\jinja2\\environment.py',
   'PYMODULE'),
  ('asyncio',
   'C:\\Users\\nidxegg.RKC\\AppData\\Local\\Programs\\Python\\Python311\\Lib\\asyncio\\__init__.py',
   'PYMODULE'),
  ('asyncio.unix_events',
   'C:\\Users\\nidxegg.RKC\\AppData\\Local\\Programs\\Python\\Python311\\Lib\\asyncio\\unix_events.py',
   'PYMODULE'),
  ('asyncio.log',
   'C:\\Users\\nidxegg.RKC\\AppData\\Local\\Programs\\Python\\Python311\\Lib\\asyncio\\log.py',
   'PYMODULE'),
  ('asyncio.windows_events',
   'C:\\Users\\nidxegg.RKC\\AppData\\Local\\Programs\\Python\\Python311\\Lib\\asyncio\\windows_events.py',
   'PYMODULE'),
  ('asyncio.windows_utils',
   'C:\\Users\\nidxegg.RKC\\AppData\\Local\\Programs\\Python\\Python311\\Lib\\asyncio\\windows_utils.py',
   'PYMODULE'),
  ('asyncio.selector_events',
   'C:\\Users\\nidxegg.RKC\\AppData\\Local\\Programs\\Python\\Python311\\Lib\\asyncio\\selector_events.py',
   'PYMODULE'),
  ('asyncio.proactor_events',
   'C:\\Users\\nidxegg.RKC\\AppData\\Local\\Programs\\Python\\Python311\\Lib\\asyncio\\proactor_events.py',
   'PYMODULE'),
  ('asyncio.base_subprocess',
   'C:\\Users\\nidxegg.RKC\\AppData\\Local\\Programs\\Python\\Python311\\Lib\\asyncio\\base_subprocess.py',
   'PYMODULE'),
  ('asyncio.threads',
   'C:\\Users\\nidxegg.RKC\\AppData\\Local\\Programs\\Python\\Python311\\Lib\\asyncio\\threads.py',
   'PYMODULE'),
  ('asyncio.timeouts',
   'C:\\Users\\nidxegg.RKC\\AppData\\Local\\Programs\\Python\\Python311\\Lib\\asyncio\\timeouts.py',
   'PYMODULE'),
  ('asyncio.taskgroups',
   'C:\\Users\\nidxegg.RKC\\AppData\\Local\\Programs\\Python\\Python311\\Lib\\asyncio\\taskgroups.py',
   'PYMODULE'),
  ('asyncio.subprocess',
   'C:\\Users\\nidxegg.RKC\\AppData\\Local\\Programs\\Python\\Python311\\Lib\\asyncio\\subprocess.py',
   'PYMODULE'),
  ('asyncio.streams',
   'C:\\Users\\nidxegg.RKC\\AppData\\Local\\Programs\\Python\\Python311\\Lib\\asyncio\\streams.py',
   'PYMODULE'),
  ('asyncio.queues',
   'C:\\Users\\nidxegg.RKC\\AppData\\Local\\Programs\\Python\\Python311\\Lib\\asyncio\\queues.py',
   'PYMODULE'),
  ('asyncio.runners',
   'C:\\Users\\nidxegg.RKC\\AppData\\Local\\Programs\\Python\\Python311\\Lib\\asyncio\\runners.py',
   'PYMODULE'),
  ('asyncio.base_events',
   'C:\\Users\\nidxegg.RKC\\AppData\\Local\\Programs\\Python\\Python311\\Lib\\asyncio\\base_events.py',
   'PYMODULE'),
  ('concurrent.futures',
   'C:\\Users\\nidxegg.RKC\\AppData\\Local\\Programs\\Python\\Python311\\Lib\\concurrent\\futures\\__init__.py',
   'PYMODULE'),
  ('concurrent.futures.thread',
   'C:\\Users\\nidxegg.RKC\\AppData\\Local\\Programs\\Python\\Python311\\Lib\\concurrent\\futures\\thread.py',
   'PYMODULE'),
  ('concurrent.futures.process',
   'C:\\Users\\nidxegg.RKC\\AppData\\Local\\Programs\\Python\\Python311\\Lib\\concurrent\\futures\\process.py',
   'PYMODULE'),
  ('concurrent.futures._base',
   'C:\\Users\\nidxegg.RKC\\AppData\\Local\\Programs\\Python\\Python311\\Lib\\concurrent\\futures\\_base.py',
   'PYMODULE'),
  ('concurrent',
   'C:\\Users\\nidxegg.RKC\\AppData\\Local\\Programs\\Python\\Python311\\Lib\\concurrent\\__init__.py',
   'PYMODULE'),
  ('asyncio.trsock',
   'C:\\Users\\nidxegg.RKC\\AppData\\Local\\Programs\\Python\\Python311\\Lib\\asyncio\\trsock.py',
   'PYMODULE'),
  ('asyncio.staggered',
   'C:\\Users\\nidxegg.RKC\\AppData\\Local\\Programs\\Python\\Python311\\Lib\\asyncio\\staggered.py',
   'PYMODULE'),
  ('asyncio.tasks',
   'C:\\Users\\nidxegg.RKC\\AppData\\Local\\Programs\\Python\\Python311\\Lib\\asyncio\\tasks.py',
   'PYMODULE'),
  ('asyncio.locks',
   'C:\\Users\\nidxegg.RKC\\AppData\\Local\\Programs\\Python\\Python311\\Lib\\asyncio\\locks.py',
   'PYMODULE'),
  ('asyncio.base_tasks',
   'C:\\Users\\nidxegg.RKC\\AppData\\Local\\Programs\\Python\\Python311\\Lib\\asyncio\\base_tasks.py',
   'PYMODULE'),
  ('asyncio.mixins',
   'C:\\Users\\nidxegg.RKC\\AppData\\Local\\Programs\\Python\\Python311\\Lib\\asyncio\\mixins.py',
   'PYMODULE'),
  ('asyncio.sslproto',
   'C:\\Users\\nidxegg.RKC\\AppData\\Local\\Programs\\Python\\Python311\\Lib\\asyncio\\sslproto.py',
   'PYMODULE'),
  ('asyncio.transports',
   'C:\\Users\\nidxegg.RKC\\AppData\\Local\\Programs\\Python\\Python311\\Lib\\asyncio\\transports.py',
   'PYMODULE'),
  ('asyncio.protocols',
   'C:\\Users\\nidxegg.RKC\\AppData\\Local\\Programs\\Python\\Python311\\Lib\\asyncio\\protocols.py',
   'PYMODULE'),
  ('asyncio.futures',
   'C:\\Users\\nidxegg.RKC\\AppData\\Local\\Programs\\Python\\Python311\\Lib\\asyncio\\futures.py',
   'PYMODULE'),
  ('asyncio.base_futures',
   'C:\\Users\\nidxegg.RKC\\AppData\\Local\\Programs\\Python\\Python311\\Lib\\asyncio\\base_futures.py',
   'PYMODULE'),
  ('asyncio.exceptions',
   'C:\\Users\\nidxegg.RKC\\AppData\\Local\\Programs\\Python\\Python311\\Lib\\asyncio\\exceptions.py',
   'PYMODULE'),
  ('asyncio.events',
   'C:\\Users\\nidxegg.RKC\\AppData\\Local\\Programs\\Python\\Python311\\Lib\\asyncio\\events.py',
   'PYMODULE'),
  ('asyncio.format_helpers',
   'C:\\Users\\nidxegg.RKC\\AppData\\Local\\Programs\\Python\\Python311\\Lib\\asyncio\\format_helpers.py',
   'PYMODULE'),
  ('asyncio.coroutines',
   'C:\\Users\\nidxegg.RKC\\AppData\\Local\\Programs\\Python\\Python311\\Lib\\asyncio\\coroutines.py',
   'PYMODULE'),
  ('asyncio.constants',
   'C:\\Users\\nidxegg.RKC\\AppData\\Local\\Programs\\Python\\Python311\\Lib\\asyncio\\constants.py',
   'PYMODULE'),
  ('jinja2.debug',
   'D:\\Python\\prohorenok_pyqt6\\venv\\Lib\\site-packages\\jinja2\\debug.py',
   'PYMODULE'),
  ('jinja2.compiler',
   'D:\\Python\\prohorenok_pyqt6\\venv\\Lib\\site-packages\\jinja2\\compiler.py',
   'PYMODULE'),
  ('jinja2.visitor',
   'D:\\Python\\prohorenok_pyqt6\\venv\\Lib\\site-packages\\jinja2\\visitor.py',
   'PYMODULE'),
  ('jinja2.optimizer',
   'D:\\Python\\prohorenok_pyqt6\\venv\\Lib\\site-packages\\jinja2\\optimizer.py',
   'PYMODULE'),
  ('jinja2.idtracking',
   'D:\\Python\\prohorenok_pyqt6\\venv\\Lib\\site-packages\\jinja2\\idtracking.py',
   'PYMODULE'),
  ('jinja2.bccache',
   'D:\\Python\\prohorenok_pyqt6\\venv\\Lib\\site-packages\\jinja2\\bccache.py',
   'PYMODULE'),
  ('jinja2.nodes',
   'D:\\Python\\prohorenok_pyqt6\\venv\\Lib\\site-packages\\jinja2\\nodes.py',
   'PYMODULE'),
  ('PyQt6.uic',
   'D:\\Python\\prohorenok_pyqt6\\venv\\Lib\\site-packages\\PyQt6\\uic\\__init__.py',
   'PYMODULE'),
  ('PyQt6.uic.ui_file',
   'D:\\Python\\prohorenok_pyqt6\\venv\\Lib\\site-packages\\PyQt6\\uic\\ui_file.py',
   'PYMODULE'),
  ('PyQt6.uic.exceptions',
   'D:\\Python\\prohorenok_pyqt6\\venv\\Lib\\site-packages\\PyQt6\\uic\\exceptions.py',
   'PYMODULE'),
  ('xml.etree.ElementTree',
   'C:\\Users\\nidxegg.RKC\\AppData\\Local\\Programs\\Python\\Python311\\Lib\\xml\\etree\\ElementTree.py',
   'PYMODULE'),
  ('xml.etree.cElementTree',
   'C:\\Users\\nidxegg.RKC\\AppData\\Local\\Programs\\Python\\Python311\\Lib\\xml\\etree\\cElementTree.py',
   'PYMODULE'),
  ('xml.etree.ElementInclude',
   'C:\\Users\\nidxegg.RKC\\AppData\\Local\\Programs\\Python\\Python311\\Lib\\xml\\etree\\ElementInclude.py',
   'PYMODULE'),
  ('xml.etree.ElementPath',
   'C:\\Users\\nidxegg.RKC\\AppData\\Local\\Programs\\Python\\Python311\\Lib\\xml\\etree\\ElementPath.py',
   'PYMODULE'),
  ('xml.etree',
   'C:\\Users\\nidxegg.RKC\\AppData\\Local\\Programs\\Python\\Python311\\Lib\\xml\\etree\\__init__.py',
   'PYMODULE'),
  ('PyQt6.uic.objcreator',
   'D:\\Python\\prohorenok_pyqt6\\venv\\Lib\\site-packages\\PyQt6\\uic\\objcreator.py',
   'PYMODULE'),
  ('PyQt6.uic.load_ui',
   'D:\\Python\\prohorenok_pyqt6\\venv\\Lib\\site-packages\\PyQt6\\uic\\load_ui.py',
   'PYMODULE'),
  ('PyQt6.uic.Loader.loader',
   'D:\\Python\\prohorenok_pyqt6\\venv\\Lib\\site-packages\\PyQt6\\uic\\Loader\\loader.py',
   'PYMODULE'),
  ('PyQt6.uic.Loader',
   'D:\\Python\\prohorenok_pyqt6\\venv\\Lib\\site-packages\\PyQt6\\uic\\Loader\\__init__.py',
   'PYMODULE'),
  ('PyQt6.uic.Loader.qobjectcreator',
   'D:\\Python\\prohorenok_pyqt6\\venv\\Lib\\site-packages\\PyQt6\\uic\\Loader\\qobjectcreator.py',
   'PYMODULE'),
  ('PyQt6.uic.uiparser',
   'D:\\Python\\prohorenok_pyqt6\\venv\\Lib\\site-packages\\PyQt6\\uic\\uiparser.py',
   'PYMODULE'),
  ('PyQt6.uic.Compiler.compiler',
   'D:\\Python\\prohorenok_pyqt6\\venv\\Lib\\site-packages\\PyQt6\\uic\\Compiler\\compiler.py',
   'PYMODULE'),
  ('PyQt6.uic.Compiler.qobjectcreator',
   'D:\\Python\\prohorenok_pyqt6\\venv\\Lib\\site-packages\\PyQt6\\uic\\Compiler\\qobjectcreator.py',
   'PYMODULE'),
  ('PyQt6.uic.Compiler.as_string',
   'D:\\Python\\prohorenok_pyqt6\\venv\\Lib\\site-packages\\PyQt6\\uic\\Compiler\\as_string.py',
   'PYMODULE'),
  ('PyQt6.uic.Compiler.indenter',
   'D:\\Python\\prohorenok_pyqt6\\venv\\Lib\\site-packages\\PyQt6\\uic\\Compiler\\indenter.py',
   'PYMODULE'),
  ('PyQt6.uic.Compiler.qtproxies',
   'D:\\Python\\prohorenok_pyqt6\\venv\\Lib\\site-packages\\PyQt6\\uic\\Compiler\\qtproxies.py',
   'PYMODULE'),
  ('PyQt6.uic.Compiler.proxy_metaclass',
   'D:\\Python\\prohorenok_pyqt6\\venv\\Lib\\site-packages\\PyQt6\\uic\\Compiler\\proxy_metaclass.py',
   'PYMODULE'),
  ('PyQt6.uic.Compiler.misc',
   'D:\\Python\\prohorenok_pyqt6\\venv\\Lib\\site-packages\\PyQt6\\uic\\Compiler\\misc.py',
   'PYMODULE'),
  ('PyQt6.uic.Compiler',
   'D:\\Python\\prohorenok_pyqt6\\venv\\Lib\\site-packages\\PyQt6\\uic\\Compiler\\__init__.py',
   'PYMODULE'),
  ('PyQt6.uic.compile_ui',
   'D:\\Python\\prohorenok_pyqt6\\venv\\Lib\\site-packages\\PyQt6\\uic\\compile_ui.py',
   'PYMODULE'),
  ('PySide6',
   'D:\\Python\\prohorenok_pyqt6\\venv\\Lib\\site-packages\\PySide6\\__init__.py',
   'PYMODULE'),
  ('PySide6.support.deprecated',
   'D:\\Python\\prohorenok_pyqt6\\venv\\Lib\\site-packages\\PySide6\\support\\deprecated.py',
   'PYMODULE'),
  ('PySide6.support',
   'D:\\Python\\prohorenok_pyqt6\\venv\\Lib\\site-packages\\PySide6\\support\\__init__.py',
   'PYMODULE'),
  ('rlcompleter',
   'C:\\Users\\nidxegg.RKC\\AppData\\Local\\Programs\\Python\\Python311\\Lib\\rlcompleter.py',
   'PYMODULE'),
  ('shiboken6',
   'D:\\Python\\prohorenok_pyqt6\\venv\\Lib\\site-packages\\shiboken6\\__init__.py',
   'PYMODULE'),
  ('qt_material.resources',
   'D:\\Python\\prohorenok_pyqt6\\venv\\Lib\\site-packages\\qt_material\\resources\\__init__.py',
   'PYMODULE'),
  ('qt_material.resources.generate',
   'D:\\Python\\prohorenok_pyqt6\\venv\\Lib\\site-packages\\qt_material\\resources\\generate.py',
   'PYMODULE'),
  ('xml.dom.minidom',
   'C:\\Users\\nidxegg.RKC\\AppData\\Local\\Programs\\Python\\Python311\\Lib\\xml\\dom\\minidom.py',
   'PYMODULE'),
  ('xml.dom.pulldom',
   'C:\\Users\\nidxegg.RKC\\AppData\\Local\\Programs\\Python\\Python311\\Lib\\xml\\dom\\pulldom.py',
   'PYMODULE'),
  ('xml.dom.expatbuilder',
   'C:\\Users\\nidxegg.RKC\\AppData\\Local\\Programs\\Python\\Python311\\Lib\\xml\\dom\\expatbuilder.py',
   'PYMODULE'),
  ('xml.dom.NodeFilter',
   'C:\\Users\\nidxegg.RKC\\AppData\\Local\\Programs\\Python\\Python311\\Lib\\xml\\dom\\NodeFilter.py',
   'PYMODULE'),
  ('xml.dom.xmlbuilder',
   'C:\\Users\\nidxegg.RKC\\AppData\\Local\\Programs\\Python\\Python311\\Lib\\xml\\dom\\xmlbuilder.py',
   'PYMODULE'),
  ('xml.dom.minicompat',
   'C:\\Users\\nidxegg.RKC\\AppData\\Local\\Programs\\Python\\Python311\\Lib\\xml\\dom\\minicompat.py',
   'PYMODULE'),
  ('xml.dom.domreg',
   'C:\\Users\\nidxegg.RKC\\AppData\\Local\\Programs\\Python\\Python311\\Lib\\xml\\dom\\domreg.py',
   'PYMODULE'),
  ('xml.dom',
   'C:\\Users\\nidxegg.RKC\\AppData\\Local\\Programs\\Python\\Python311\\Lib\\xml\\dom\\__init__.py',
   'PYMODULE'),
  ('platform',
   'C:\\Users\\nidxegg.RKC\\AppData\\Local\\Programs\\Python\\Python311\\Lib\\platform.py',
   'PYMODULE'),
  ('PyQt6.uic.properties',
   'D:\\Python\\prohorenok_pyqt6\\venv\\Lib\\site-packages\\PyQt6\\uic\\properties.py',
   'PYMODULE'),
  ('PyQt6.uic.icon_cache',
   'D:\\Python\\prohorenok_pyqt6\\venv\\Lib\\site-packages\\PyQt6\\uic\\icon_cache.py',
   'PYMODULE'),
  ('PyQt6.uic.enum_map',
   'D:\\Python\\prohorenok_pyqt6\\venv\\Lib\\site-packages\\PyQt6\\uic\\enum_map.py',
   'PYMODULE'),
  ('pypyodbc',
   'D:\\Python\\prohorenok_pyqt6\\venv\\Lib\\site-packages\\pypyodbc.py',
   'PYMODULE'),
  ('ctypes.util',
   'C:\\Users\\nidxegg.RKC\\AppData\\Local\\Programs\\Python\\Python311\\Lib\\ctypes\\util.py',
   'PYMODULE'),
  ('ctypes._aix',
   'C:\\Users\\nidxegg.RKC\\AppData\\Local\\Programs\\Python\\Python311\\Lib\\ctypes\\_aix.py',
   'PYMODULE'),
  ('ctypes.macholib.dyld',
   'C:\\Users\\nidxegg.RKC\\AppData\\Local\\Programs\\Python\\Python311\\Lib\\ctypes\\macholib\\dyld.py',
   'PYMODULE'),
  ('ctypes.macholib',
   'C:\\Users\\nidxegg.RKC\\AppData\\Local\\Programs\\Python\\Python311\\Lib\\ctypes\\macholib\\__init__.py',
   'PYMODULE'),
  ('ctypes.macholib.dylib',
   'C:\\Users\\nidxegg.RKC\\AppData\\Local\\Programs\\Python\\Python311\\Lib\\ctypes\\macholib\\dylib.py',
   'PYMODULE'),
  ('ctypes.macholib.framework',
   'C:\\Users\\nidxegg.RKC\\AppData\\Local\\Programs\\Python\\Python311\\Lib\\ctypes\\macholib\\framework.py',
   'PYMODULE')],
 [('api-ms-win-crt-heap-l1-1-0.dll',
   'D:\\Anaconda3\\api-ms-win-crt-heap-l1-1-0.dll',
   'BINARY'),
  ('python311.dll',
   'C:\\Users\\nidxegg.RKC\\AppData\\Local\\Programs\\Python\\Python311\\python311.dll',
   'BINARY'),
  ('api-ms-win-crt-math-l1-1-0.dll',
   'D:\\Anaconda3\\api-ms-win-crt-math-l1-1-0.dll',
   'BINARY'),
  ('VCRUNTIME140.dll',
   'C:\\Users\\nidxegg.RKC\\AppData\\Local\\Programs\\Python\\Python311\\VCRUNTIME140.dll',
   'BINARY'),
  ('api-ms-win-crt-stdio-l1-1-0.dll',
   'D:\\Anaconda3\\api-ms-win-crt-stdio-l1-1-0.dll',
   'BINARY'),
  ('api-ms-win-crt-runtime-l1-1-0.dll',
   'D:\\Anaconda3\\api-ms-win-crt-runtime-l1-1-0.dll',
   'BINARY'),
  ('api-ms-win-crt-locale-l1-1-0.dll',
   'D:\\Anaconda3\\api-ms-win-crt-locale-l1-1-0.dll',
   'BINARY'),
  ('ucrtbase.dll', 'D:\\Anaconda3\\ucrtbase.dll', 'BINARY'),
  ('api-ms-win-crt-environment-l1-1-0.dll',
   'D:\\Anaconda3\\api-ms-win-crt-environment-l1-1-0.dll',
   'BINARY'),
  ('api-ms-win-crt-time-l1-1-0.dll',
   'D:\\Anaconda3\\api-ms-win-crt-time-l1-1-0.dll',
   'BINARY'),
  ('api-ms-win-crt-convert-l1-1-0.dll',
   'D:\\Anaconda3\\api-ms-win-crt-convert-l1-1-0.dll',
   'BINARY'),
  ('api-ms-win-crt-filesystem-l1-1-0.dll',
   'D:\\Anaconda3\\api-ms-win-crt-filesystem-l1-1-0.dll',
   'BINARY'),
  ('api-ms-win-crt-conio-l1-1-0.dll',
   'D:\\Anaconda3\\api-ms-win-crt-conio-l1-1-0.dll',
   'BINARY'),
  ('api-ms-win-crt-process-l1-1-0.dll',
   'D:\\Anaconda3\\api-ms-win-crt-process-l1-1-0.dll',
   'BINARY'),
  ('api-ms-win-crt-string-l1-1-0.dll',
   'D:\\Anaconda3\\api-ms-win-crt-string-l1-1-0.dll',
   'BINARY'),
  ('api-ms-win-core-interlocked-l1-1-0.dll',
   'D:\\Anaconda3\\api-ms-win-core-interlocked-l1-1-0.dll',
   'BINARY'),
  ('api-ms-win-core-file-l1-1-0.dll',
   'D:\\Anaconda3\\api-ms-win-core-file-l1-1-0.dll',
   'BINARY'),
  ('api-ms-win-core-processthreads-l1-1-0.dll',
   'D:\\Anaconda3\\api-ms-win-core-processthreads-l1-1-0.dll',
   'BINARY'),
  ('api-ms-win-core-processenvironment-l1-1-0.dll',
   'D:\\Anaconda3\\api-ms-win-core-processenvironment-l1-1-0.dll',
   'BINARY'),
  ('api-ms-win-core-string-l1-1-0.dll',
   'D:\\Anaconda3\\api-ms-win-core-string-l1-1-0.dll',
   'BINARY'),
  ('api-ms-win-core-util-l1-1-0.dll',
   'D:\\Anaconda3\\api-ms-win-core-util-l1-1-0.dll',
   'BINARY'),
  ('api-ms-win-core-handle-l1-1-0.dll',
   'D:\\Anaconda3\\api-ms-win-core-handle-l1-1-0.dll',
   'BINARY'),
  ('api-ms-win-core-localization-l1-2-0.dll',
   'D:\\Anaconda3\\api-ms-win-core-localization-l1-2-0.dll',
   'BINARY'),
  ('api-ms-win-core-rtlsupport-l1-1-0.dll',
   'D:\\Anaconda3\\api-ms-win-core-rtlsupport-l1-1-0.dll',
   'BINARY'),
  ('api-ms-win-core-heap-l1-1-0.dll',
   'D:\\Anaconda3\\api-ms-win-core-heap-l1-1-0.dll',
   'BINARY'),
  ('api-ms-win-core-synch-l1-1-0.dll',
   'D:\\Anaconda3\\api-ms-win-core-synch-l1-1-0.dll',
   'BINARY'),
  ('api-ms-win-core-libraryloader-l1-1-0.dll',
   'D:\\Anaconda3\\api-ms-win-core-libraryloader-l1-1-0.dll',
   'BINARY'),
  ('api-ms-win-core-debug-l1-1-0.dll',
   'D:\\Anaconda3\\api-ms-win-core-debug-l1-1-0.dll',
   'BINARY'),
  ('api-ms-win-core-console-l1-1-0.dll',
   'D:\\Anaconda3\\api-ms-win-core-console-l1-1-0.dll',
   'BINARY'),
  ('api-ms-win-core-file-l2-1-0.dll',
   'D:\\Anaconda3\\api-ms-win-core-file-l2-1-0.dll',
   'BINARY'),
  ('api-ms-win-core-timezone-l1-1-0.dll',
   'D:\\Anaconda3\\api-ms-win-core-timezone-l1-1-0.dll',
   'BINARY'),
  ('api-ms-win-core-file-l1-2-0.dll',
   'D:\\Anaconda3\\api-ms-win-core-file-l1-2-0.dll',
   'BINARY'),
  ('api-ms-win-core-errorhandling-l1-1-0.dll',
   'D:\\Anaconda3\\api-ms-win-core-errorhandling-l1-1-0.dll',
   'BINARY'),
  ('api-ms-win-core-processthreads-l1-1-1.dll',
   'D:\\Anaconda3\\api-ms-win-core-processthreads-l1-1-1.dll',
   'BINARY'),
  ('api-ms-win-core-memory-l1-1-0.dll',
   'D:\\Anaconda3\\api-ms-win-core-memory-l1-1-0.dll',
   'BINARY'),
  ('api-ms-win-core-namedpipe-l1-1-0.dll',
   'D:\\Anaconda3\\api-ms-win-core-namedpipe-l1-1-0.dll',
   'BINARY'),
  ('api-ms-win-core-datetime-l1-1-0.dll',
   'D:\\Anaconda3\\api-ms-win-core-datetime-l1-1-0.dll',
   'BINARY'),
  ('api-ms-win-core-synch-l1-2-0.dll',
   'D:\\Anaconda3\\api-ms-win-core-synch-l1-2-0.dll',
   'BINARY'),
  ('api-ms-win-core-sysinfo-l1-1-0.dll',
   'D:\\Anaconda3\\api-ms-win-core-sysinfo-l1-1-0.dll',
   'BINARY'),
  ('api-ms-win-core-profile-l1-1-0.dll',
   'D:\\Anaconda3\\api-ms-win-core-profile-l1-1-0.dll',
   'BINARY'),
  ('PySide6\\plugins\\platforms\\qdirect2d.dll',
   'D:\\Python\\prohorenok_pyqt6\\venv\\Lib\\site-packages\\PySide6\\plugins\\platforms\\qdirect2d.dll',
   'BINARY'),
  ('PyQt6\\Qt6\\plugins\\imageformats\\qpdf.dll',
   'D:\\Python\\prohorenok_pyqt6\\venv\\Lib\\site-packages\\PyQt6\\Qt6\\plugins\\imageformats\\qpdf.dll',
   'BINARY'),
  ('PySide6\\plugins\\tls\\qopensslbackend.dll',
   'D:\\Python\\prohorenok_pyqt6\\venv\\Lib\\site-packages\\PySide6\\plugins\\tls\\qopensslbackend.dll',
   'BINARY'),
  ('PySide6\\plugins\\imageformats\\qgif.dll',
   'D:\\Python\\prohorenok_pyqt6\\venv\\Lib\\site-packages\\PySide6\\plugins\\imageformats\\qgif.dll',
   'BINARY'),
  ('PyQt6\\Qt6\\plugins\\styles\\qwindowsvistastyle.dll',
   'D:\\Python\\prohorenok_pyqt6\\venv\\Lib\\site-packages\\PyQt6\\Qt6\\plugins\\styles\\qwindowsvistastyle.dll',
   'BINARY'),
  ('PySide6\\opengl32sw.dll',
   'D:\\Python\\prohorenok_pyqt6\\venv\\Lib\\site-packages\\PySide6\\opengl32sw.dll',
   'BINARY'),
  ('PySide6\\plugins\\platforms\\qoffscreen.dll',
   'D:\\Python\\prohorenok_pyqt6\\venv\\Lib\\site-packages\\PySide6\\plugins\\platforms\\qoffscreen.dll',
   'BINARY'),
  ('PySide6\\plugins\\imageformats\\qpdf.dll',
   'D:\\Python\\prohorenok_pyqt6\\venv\\Lib\\site-packages\\PySide6\\plugins\\imageformats\\qpdf.dll',
   'BINARY'),
  ('PyQt6\\Qt6\\plugins\\platforms\\qoffscreen.dll',
   'D:\\Python\\prohorenok_pyqt6\\venv\\Lib\\site-packages\\PyQt6\\Qt6\\plugins\\platforms\\qoffscreen.dll',
   'BINARY'),
  ('PySide6\\plugins\\networkinformation\\qnetworklistmanager.dll',
   'D:\\Python\\prohorenok_pyqt6\\venv\\Lib\\site-packages\\PySide6\\plugins\\networkinformation\\qnetworklistmanager.dll',
   'BINARY'),
  ('PySide6\\plugins\\tls\\qschannelbackend.dll',
   'D:\\Python\\prohorenok_pyqt6\\venv\\Lib\\site-packages\\PySide6\\plugins\\tls\\qschannelbackend.dll',
   'BINARY'),
  ('PyQt6\\Qt6\\plugins\\platforms\\qwindows.dll',
   'D:\\Python\\prohorenok_pyqt6\\venv\\Lib\\site-packages\\PyQt6\\Qt6\\plugins\\platforms\\qwindows.dll',
   'BINARY'),
  ('PySide6\\plugins\\generic\\qtuiotouchplugin.dll',
   'D:\\Python\\prohorenok_pyqt6\\venv\\Lib\\site-packages\\PySide6\\plugins\\generic\\qtuiotouchplugin.dll',
   'BINARY'),
  ('PyQt6\\Qt6\\plugins\\imageformats\\qwbmp.dll',
   'D:\\Python\\prohorenok_pyqt6\\venv\\Lib\\site-packages\\PyQt6\\Qt6\\plugins\\imageformats\\qwbmp.dll',
   'BINARY'),
  ('PySide6\\plugins\\imageformats\\qsvg.dll',
   'D:\\Python\\prohorenok_pyqt6\\venv\\Lib\\site-packages\\PySide6\\plugins\\imageformats\\qsvg.dll',
   'BINARY'),
  ('PySide6\\plugins\\iconengines\\qsvgicon.dll',
   'D:\\Python\\prohorenok_pyqt6\\venv\\Lib\\site-packages\\PySide6\\plugins\\iconengines\\qsvgicon.dll',
   'BINARY'),
  ('PyQt6\\Qt6\\plugins\\imageformats\\qico.dll',
   'D:\\Python\\prohorenok_pyqt6\\venv\\Lib\\site-packages\\PyQt6\\Qt6\\plugins\\imageformats\\qico.dll',
   'BINARY'),
  ('PySide6\\plugins\\styles\\qwindowsvistastyle.dll',
   'D:\\Python\\prohorenok_pyqt6\\venv\\Lib\\site-packages\\PySide6\\plugins\\styles\\qwindowsvistastyle.dll',
   'BINARY'),
  ('PyQt6\\Qt6\\plugins\\imageformats\\qtiff.dll',
   'D:\\Python\\prohorenok_pyqt6\\venv\\Lib\\site-packages\\PyQt6\\Qt6\\plugins\\imageformats\\qtiff.dll',
   'BINARY'),
  ('PyQt6\\Qt6\\plugins\\imageformats\\qtga.dll',
   'D:\\Python\\prohorenok_pyqt6\\venv\\Lib\\site-packages\\PyQt6\\Qt6\\plugins\\imageformats\\qtga.dll',
   'BINARY'),
  ('PyQt6\\Qt6\\plugins\\imageformats\\qwebp.dll',
   'D:\\Python\\prohorenok_pyqt6\\venv\\Lib\\site-packages\\PyQt6\\Qt6\\plugins\\imageformats\\qwebp.dll',
   'BINARY'),
  ('PySide6\\plugins\\imageformats\\qjpeg.dll',
   'D:\\Python\\prohorenok_pyqt6\\venv\\Lib\\site-packages\\PySide6\\plugins\\imageformats\\qjpeg.dll',
   'BINARY'),
  ('PyQt6\\Qt6\\plugins\\iconengines\\qsvgicon.dll',
   'D:\\Python\\prohorenok_pyqt6\\venv\\Lib\\site-packages\\PyQt6\\Qt6\\plugins\\iconengines\\qsvgicon.dll',
   'BINARY'),
  ('PySide6\\plugins\\imageformats\\qico.dll',
   'D:\\Python\\prohorenok_pyqt6\\venv\\Lib\\site-packages\\PySide6\\plugins\\imageformats\\qico.dll',
   'BINARY'),
  ('PySide6\\plugins\\platforms\\qwindows.dll',
   'D:\\Python\\prohorenok_pyqt6\\venv\\Lib\\site-packages\\PySide6\\plugins\\platforms\\qwindows.dll',
   'BINARY'),
  ('PyQt6\\Qt6\\plugins\\imageformats\\qicns.dll',
   'D:\\Python\\prohorenok_pyqt6\\venv\\Lib\\site-packages\\PyQt6\\Qt6\\plugins\\imageformats\\qicns.dll',
   'BINARY'),
  ('PySide6\\plugins\\tls\\qcertonlybackend.dll',
   'D:\\Python\\prohorenok_pyqt6\\venv\\Lib\\site-packages\\PySide6\\plugins\\tls\\qcertonlybackend.dll',
   'BINARY'),
  ('PyQt6\\Qt6\\plugins\\imageformats\\qgif.dll',
   'D:\\Python\\prohorenok_pyqt6\\venv\\Lib\\site-packages\\PyQt6\\Qt6\\plugins\\imageformats\\qgif.dll',
   'BINARY'),
  ('PyQt6\\Qt6\\plugins\\platforms\\qminimal.dll',
   'D:\\Python\\prohorenok_pyqt6\\venv\\Lib\\site-packages\\PyQt6\\Qt6\\plugins\\platforms\\qminimal.dll',
   'BINARY'),
  ('PyQt6\\Qt6\\bin\\opengl32sw.dll',
   'D:\\Python\\prohorenok_pyqt6\\venv\\Lib\\site-packages\\PyQt6\\Qt6\\bin\\opengl32sw.dll',
   'BINARY'),
  ('PySide6\\plugins\\imageformats\\qtga.dll',
   'D:\\Python\\prohorenok_pyqt6\\venv\\Lib\\site-packages\\PySide6\\plugins\\imageformats\\qtga.dll',
   'BINARY'),
  ('PySide6\\plugins\\platforms\\qminimal.dll',
   'D:\\Python\\prohorenok_pyqt6\\venv\\Lib\\site-packages\\PySide6\\plugins\\platforms\\qminimal.dll',
   'BINARY'),
  ('PyQt6\\Qt6\\plugins\\imageformats\\qjpeg.dll',
   'D:\\Python\\prohorenok_pyqt6\\venv\\Lib\\site-packages\\PyQt6\\Qt6\\plugins\\imageformats\\qjpeg.dll',
   'BINARY'),
  ('PySide6\\plugins\\imageformats\\qwebp.dll',
   'D:\\Python\\prohorenok_pyqt6\\venv\\Lib\\site-packages\\PySide6\\plugins\\imageformats\\qwebp.dll',
   'BINARY'),
  ('PySide6\\plugins\\imageformats\\qicns.dll',
   'D:\\Python\\prohorenok_pyqt6\\venv\\Lib\\site-packages\\PySide6\\plugins\\imageformats\\qicns.dll',
   'BINARY'),
  ('PyQt6\\Qt6\\plugins\\imageformats\\qsvg.dll',
   'D:\\Python\\prohorenok_pyqt6\\venv\\Lib\\site-packages\\PyQt6\\Qt6\\plugins\\imageformats\\qsvg.dll',
   'BINARY'),
  ('PyQt6\\Qt6\\plugins\\generic\\qtuiotouchplugin.dll',
   'D:\\Python\\prohorenok_pyqt6\\venv\\Lib\\site-packages\\PyQt6\\Qt6\\plugins\\generic\\qtuiotouchplugin.dll',
   'BINARY'),
  ('PySide6\\plugins\\imageformats\\qtiff.dll',
   'D:\\Python\\prohorenok_pyqt6\\venv\\Lib\\site-packages\\PySide6\\plugins\\imageformats\\qtiff.dll',
   'BINARY'),
  ('PySide6\\plugins\\platforminputcontexts\\qtvirtualkeyboardplugin.dll',
   'D:\\Python\\prohorenok_pyqt6\\venv\\Lib\\site-packages\\PySide6\\plugins\\platforminputcontexts\\qtvirtualkeyboardplugin.dll',
   'BINARY'),
  ('PySide6\\plugins\\imageformats\\qwbmp.dll',
   'D:\\Python\\prohorenok_pyqt6\\venv\\Lib\\site-packages\\PySide6\\plugins\\imageformats\\qwbmp.dll',
   'BINARY'),
  ('_multiprocessing.pyd',
   'C:\\Users\\nidxegg.RKC\\AppData\\Local\\Programs\\Python\\Python311\\DLLs\\_multiprocessing.pyd',
   'EXTENSION'),
  ('pyexpat.pyd',
   'C:\\Users\\nidxegg.RKC\\AppData\\Local\\Programs\\Python\\Python311\\DLLs\\pyexpat.pyd',
   'EXTENSION'),
  ('_ssl.pyd',
   'C:\\Users\\nidxegg.RKC\\AppData\\Local\\Programs\\Python\\Python311\\DLLs\\_ssl.pyd',
   'EXTENSION'),
  ('_hashlib.pyd',
   'C:\\Users\\nidxegg.RKC\\AppData\\Local\\Programs\\Python\\Python311\\DLLs\\_hashlib.pyd',
   'EXTENSION'),
  ('_decimal.pyd',
   'C:\\Users\\nidxegg.RKC\\AppData\\Local\\Programs\\Python\\Python311\\DLLs\\_decimal.pyd',
   'EXTENSION'),
  ('_socket.pyd',
   'C:\\Users\\nidxegg.RKC\\AppData\\Local\\Programs\\Python\\Python311\\DLLs\\_socket.pyd',
   'EXTENSION'),
  ('select.pyd',
   'C:\\Users\\nidxegg.RKC\\AppData\\Local\\Programs\\Python\\Python311\\DLLs\\select.pyd',
   'EXTENSION'),
  ('_lzma.pyd',
   'C:\\Users\\nidxegg.RKC\\AppData\\Local\\Programs\\Python\\Python311\\DLLs\\_lzma.pyd',
   'EXTENSION'),
  ('_bz2.pyd',
   'C:\\Users\\nidxegg.RKC\\AppData\\Local\\Programs\\Python\\Python311\\DLLs\\_bz2.pyd',
   'EXTENSION'),
  ('_ctypes.pyd',
   'C:\\Users\\nidxegg.RKC\\AppData\\Local\\Programs\\Python\\Python311\\DLLs\\_ctypes.pyd',
   'EXTENSION'),
  ('_queue.pyd',
   'C:\\Users\\nidxegg.RKC\\AppData\\Local\\Programs\\Python\\Python311\\DLLs\\_queue.pyd',
   'EXTENSION'),
  ('unicodedata.pyd',
   'C:\\Users\\nidxegg.RKC\\AppData\\Local\\Programs\\Python\\Python311\\DLLs\\unicodedata.pyd',
   'EXTENSION'),
  ('PyQt6\\QtGui.pyd',
   'D:\\Python\\prohorenok_pyqt6\\venv\\Lib\\site-packages\\PyQt6\\QtGui.pyd',
   'EXTENSION'),
  ('PyQt6\\QtCore.pyd',
   'D:\\Python\\prohorenok_pyqt6\\venv\\Lib\\site-packages\\PyQt6\\QtCore.pyd',
   'EXTENSION'),
  ('PyQt6\\sip.cp311-win_amd64.pyd',
   'D:\\Python\\prohorenok_pyqt6\\venv\\Lib\\site-packages\\PyQt6\\sip.cp311-win_amd64.pyd',
   'EXTENSION'),
  ('markupsafe\\_speedups.cp311-win_amd64.pyd',
   'D:\\Python\\prohorenok_pyqt6\\venv\\Lib\\site-packages\\markupsafe\\_speedups.cp311-win_amd64.pyd',
   'EXTENSION'),
  ('_overlapped.pyd',
   'C:\\Users\\nidxegg.RKC\\AppData\\Local\\Programs\\Python\\Python311\\DLLs\\_overlapped.pyd',
   'EXTENSION'),
  ('_asyncio.pyd',
   'C:\\Users\\nidxegg.RKC\\AppData\\Local\\Programs\\Python\\Python311\\DLLs\\_asyncio.pyd',
   'EXTENSION'),
  ('_elementtree.pyd',
   'C:\\Users\\nidxegg.RKC\\AppData\\Local\\Programs\\Python\\Python311\\DLLs\\_elementtree.pyd',
   'EXTENSION'),
  ('PySide6\\QtCore.pyd',
   'D:\\Python\\prohorenok_pyqt6\\venv\\Lib\\site-packages\\PySide6\\QtCore.pyd',
   'EXTENSION'),
  ('PySide6\\QtNetwork.pyd',
   'D:\\Python\\prohorenok_pyqt6\\venv\\Lib\\site-packages\\PySide6\\QtNetwork.pyd',
   'EXTENSION'),
  ('shiboken6\\Shiboken.pyd',
   'D:\\Python\\prohorenok_pyqt6\\venv\\Lib\\site-packages\\shiboken6\\Shiboken.pyd',
   'EXTENSION'),
  ('PySide6\\QtUiTools.pyd',
   'D:\\Python\\prohorenok_pyqt6\\venv\\Lib\\site-packages\\PySide6\\QtUiTools.pyd',
   'EXTENSION'),
  ('PySide6\\QtOpenGLWidgets.pyd',
   'D:\\Python\\prohorenok_pyqt6\\venv\\Lib\\site-packages\\PySide6\\QtOpenGLWidgets.pyd',
   'EXTENSION'),
  ('PySide6\\QtOpenGL.pyd',
   'D:\\Python\\prohorenok_pyqt6\\venv\\Lib\\site-packages\\PySide6\\QtOpenGL.pyd',
   'EXTENSION'),
  ('PySide6\\QtWidgets.pyd',
   'D:\\Python\\prohorenok_pyqt6\\venv\\Lib\\site-packages\\PySide6\\QtWidgets.pyd',
   'EXTENSION'),
  ('PySide6\\QtGui.pyd',
   'D:\\Python\\prohorenok_pyqt6\\venv\\Lib\\site-packages\\PySide6\\QtGui.pyd',
   'EXTENSION'),
  ('PyQt6\\QtWidgets.pyd',
   'D:\\Python\\prohorenok_pyqt6\\venv\\Lib\\site-packages\\PyQt6\\QtWidgets.pyd',
   'EXTENSION'),
  ('pyodbc.cp311-win_amd64.pyd',
   'D:\\Python\\prohorenok_pyqt6\\venv\\Lib\\site-packages\\pyodbc.cp311-win_amd64.pyd',
   'EXTENSION'),
  ('VCRUNTIME140_1.dll',
   'C:\\Users\\nidxegg.RKC\\AppData\\Local\\Programs\\Python\\Python311\\VCRUNTIME140_1.dll',
   'BINARY'),
  ('PyQt6\\Qt6\\bin\\Qt6Core.dll',
   'D:\\Python\\prohorenok_pyqt6\\venv\\Lib\\site-packages\\PyQt6\\Qt6\\bin\\Qt6Core.dll',
   'BINARY'),
  ('PyQt6\\Qt6\\bin\\Qt6Gui.dll',
   'D:\\Python\\prohorenok_pyqt6\\venv\\Lib\\site-packages\\PyQt6\\Qt6\\bin\\Qt6Gui.dll',
   'BINARY'),
  ('PyQt6\\Qt6\\bin\\MSVCP140.dll',
   'D:\\Python\\prohorenok_pyqt6\\venv\\Lib\\site-packages\\PyQt6\\Qt6\\bin\\MSVCP140.dll',
   'BINARY'),
  ('PyQt6\\Qt6\\bin\\Qt6Pdf.dll',
   'D:\\Python\\prohorenok_pyqt6\\venv\\Lib\\site-packages\\PyQt6\\Qt6\\bin\\Qt6Pdf.dll',
   'BINARY'),
  ('PyQt6\\Qt6\\bin\\Qt6Network.dll',
   'D:\\Python\\prohorenok_pyqt6\\venv\\Lib\\site-packages\\PyQt6\\Qt6\\bin\\Qt6Network.dll',
   'BINARY'),
  ('PyQt6\\Qt6\\bin\\Qt6Widgets.dll',
   'D:\\Python\\prohorenok_pyqt6\\venv\\Lib\\site-packages\\PyQt6\\Qt6\\bin\\Qt6Widgets.dll',
   'BINARY'),
  ('PyQt6\\Qt6\\bin\\Qt6Svg.dll',
   'D:\\Python\\prohorenok_pyqt6\\venv\\Lib\\site-packages\\PyQt6\\Qt6\\bin\\Qt6Svg.dll',
   'BINARY'),
  ('api-ms-win-crt-utility-l1-1-0.dll',
   'D:\\Anaconda3\\api-ms-win-crt-utility-l1-1-0.dll',
   'BINARY'),
  ('PySide6\\Qt6VirtualKeyboard.dll',
   'D:\\Python\\prohorenok_pyqt6\\venv\\Lib\\site-packages\\PySide6\\Qt6VirtualKeyboard.dll',
   'BINARY'),
  ('libcrypto-1_1.dll',
   'C:\\Users\\nidxegg.RKC\\AppData\\Local\\Programs\\Python\\Python311\\DLLs\\libcrypto-1_1.dll',
   'BINARY'),
  ('libssl-1_1.dll',
   'C:\\Users\\nidxegg.RKC\\AppData\\Local\\Programs\\Python\\Python311\\DLLs\\libssl-1_1.dll',
   'BINARY'),
  ('libffi-8.dll',
   'C:\\Users\\nidxegg.RKC\\AppData\\Local\\Programs\\Python\\Python311\\DLLs\\libffi-8.dll',
   'BINARY'),
  ('python3.dll',
   'C:\\Users\\nidxegg.RKC\\AppData\\Local\\Programs\\Python\\Python311\\python3.dll',
   'BINARY'),
  ('PyQt6\\Qt6\\bin\\MSVCP140_2.dll',
   'D:\\Python\\prohorenok_pyqt6\\venv\\Lib\\site-packages\\PyQt6\\Qt6\\bin\\MSVCP140_2.dll',
   'BINARY'),
  ('PySide6\\pyside6.abi3.dll',
   'D:\\Python\\prohorenok_pyqt6\\venv\\Lib\\site-packages\\PySide6\\pyside6.abi3.dll',
   'BINARY'),
  ('PySide6\\Qt6Core.dll',
   'D:\\Python\\prohorenok_pyqt6\\venv\\Lib\\site-packages\\PySide6\\Qt6Core.dll',
   'BINARY'),
  ('shiboken6\\shiboken6.abi3.dll',
   'D:\\Python\\prohorenok_pyqt6\\venv\\Lib\\site-packages\\shiboken6\\shiboken6.abi3.dll',
   'BINARY'),
  ('PySide6\\Qt6Network.dll',
   'D:\\Python\\prohorenok_pyqt6\\venv\\Lib\\site-packages\\PySide6\\Qt6Network.dll',
   'BINARY'),
  ('shiboken6\\VCRUNTIME140_1.dll',
   'D:\\Python\\prohorenok_pyqt6\\venv\\Lib\\site-packages\\shiboken6\\VCRUNTIME140_1.dll',
   'BINARY'),
  ('PySide6\\Qt6Gui.dll',
   'D:\\Python\\prohorenok_pyqt6\\venv\\Lib\\site-packages\\PySide6\\Qt6Gui.dll',
   'BINARY'),
  ('PySide6\\Qt6UiTools.dll',
   'D:\\Python\\prohorenok_pyqt6\\venv\\Lib\\site-packages\\PySide6\\Qt6UiTools.dll',
   'BINARY'),
  ('PySide6\\Qt6OpenGLWidgets.dll',
   'D:\\Python\\prohorenok_pyqt6\\venv\\Lib\\site-packages\\PySide6\\Qt6OpenGLWidgets.dll',
   'BINARY'),
  ('PySide6\\Qt6Widgets.dll',
   'D:\\Python\\prohorenok_pyqt6\\venv\\Lib\\site-packages\\PySide6\\Qt6Widgets.dll',
   'BINARY'),
  ('PySide6\\Qt6OpenGL.dll',
   'D:\\Python\\prohorenok_pyqt6\\venv\\Lib\\site-packages\\PySide6\\Qt6OpenGL.dll',
   'BINARY'),
  ('PyQt6\\Qt6\\bin\\MSVCP140_1.dll',
   'D:\\Python\\prohorenok_pyqt6\\venv\\Lib\\site-packages\\PyQt6\\Qt6\\bin\\MSVCP140_1.dll',
   'BINARY'),
  ('PySide6\\Qt6Quick.dll',
   'D:\\Python\\prohorenok_pyqt6\\venv\\Lib\\site-packages\\PySide6\\Qt6Quick.dll',
   'BINARY'),
  ('PySide6\\Qt6Qml.dll',
   'D:\\Python\\prohorenok_pyqt6\\venv\\Lib\\site-packages\\PySide6\\Qt6Qml.dll',
   'BINARY'),
  ('shiboken6\\MSVCP140.dll',
   'D:\\Python\\prohorenok_pyqt6\\venv\\Lib\\site-packages\\shiboken6\\MSVCP140.dll',
   'BINARY'),
  ('PySide6\\Qt6QmlModels.dll',
   'D:\\Python\\prohorenok_pyqt6\\venv\\Lib\\site-packages\\PySide6\\Qt6QmlModels.dll',
   'BINARY')],
 [],
 [],
 [('base_library.zip',
   'D:\\Python\\prohorenok_pyqt6\\project\\shredder\\build\\shredder\\base_library.zip',
   'DATA'),
  ('qt_material\\themes\\light_amber.xml',
   'D:\\Python\\prohorenok_pyqt6\\venv\\Lib\\site-packages\\qt_material\\themes\\light_amber.xml',
   'DATA'),
  ('qt_material\\resources\\source\\radiobutton_checked_invert.svg',
   'D:\\Python\\prohorenok_pyqt6\\venv\\Lib\\site-packages\\qt_material\\resources\\source\\radiobutton_checked_invert.svg',
   'DATA'),
  ('qt_material\\resources\\source\\checkbox_unchecked.svg',
   'D:\\Python\\prohorenok_pyqt6\\venv\\Lib\\site-packages\\qt_material\\resources\\source\\checkbox_unchecked.svg',
   'DATA'),
  ('qt_material\\resources\\source\\radiobutton_unchecked_invert.svg',
   'D:\\Python\\prohorenok_pyqt6\\venv\\Lib\\site-packages\\qt_material\\resources\\source\\radiobutton_unchecked_invert.svg',
   'DATA'),
  ('PySide6\\translations\\qtbase_hr.qm',
   'D:\\Python\\prohorenok_pyqt6\\venv\\Lib\\site-packages\\PySide6\\translations\\qtbase_hr.qm',
   'DATA'),
  ('qt_material\\themes\\light_purple_500.xml',
   'D:\\Python\\prohorenok_pyqt6\\venv\\Lib\\site-packages\\qt_material\\themes\\light_purple_500.xml',
   'DATA'),
  ('qt_material\\themes\\light_pink.xml',
   'D:\\Python\\prohorenok_pyqt6\\venv\\Lib\\site-packages\\qt_material\\themes\\light_pink.xml',
   'DATA'),
  ('qt_material\\themes\\dark_blue.xml',
   'D:\\Python\\prohorenok_pyqt6\\venv\\Lib\\site-packages\\qt_material\\themes\\dark_blue.xml',
   'DATA'),
  ('PyQt6\\Qt6\\translations\\qtbase_de.qm',
   'D:\\Python\\prohorenok_pyqt6\\venv\\Lib\\site-packages\\PyQt6\\Qt6\\translations\\qtbase_de.qm',
   'DATA'),
  ('qt_material\\resources\\logo\\logo.svg',
   'D:\\Python\\prohorenok_pyqt6\\venv\\Lib\\site-packages\\qt_material\\resources\\logo\\logo.svg',
   'DATA'),
  ('PyQt6\\Qt6\\translations\\qtbase_zh_CN.qm',
   'D:\\Python\\prohorenok_pyqt6\\venv\\Lib\\site-packages\\PyQt6\\Qt6\\translations\\qtbase_zh_CN.qm',
   'DATA'),
  ('qt_material\\resources\\source\\branch-closed.svg',
   'D:\\Python\\prohorenok_pyqt6\\venv\\Lib\\site-packages\\qt_material\\resources\\source\\branch-closed.svg',
   'DATA'),
  ('PyQt6\\Qt6\\translations\\qtbase_lv.qm',
   'D:\\Python\\prohorenok_pyqt6\\venv\\Lib\\site-packages\\PyQt6\\Qt6\\translations\\qtbase_lv.qm',
   'DATA'),
  ('PyQt6\\uic\\widget-plugins\\__pycache__\\qtwebenginewidgets.cpython-311.pyc',
   'D:\\Python\\prohorenok_pyqt6\\venv\\Lib\\site-packages\\PyQt6\\uic\\widget-plugins\\__pycache__\\qtwebenginewidgets.cpython-311.pyc',
   'DATA'),
  ('PyQt6\\Qt6\\translations\\qtbase_nn.qm',
   'D:\\Python\\prohorenok_pyqt6\\venv\\Lib\\site-packages\\PyQt6\\Qt6\\translations\\qtbase_nn.qm',
   'DATA'),
  ('qt_material\\themes\\light_cyan.xml',
   'D:\\Python\\prohorenok_pyqt6\\venv\\Lib\\site-packages\\qt_material\\themes\\light_cyan.xml',
   'DATA'),
  ('qt_material\\themes\\light_yellow.xml',
   'D:\\Python\\prohorenok_pyqt6\\venv\\Lib\\site-packages\\qt_material\\themes\\light_yellow.xml',
   'DATA'),
  ('PyQt6\\uic\\widget-plugins\\qaxcontainer.py',
   'D:\\Python\\prohorenok_pyqt6\\venv\\Lib\\site-packages\\PyQt6\\uic\\widget-plugins\\qaxcontainer.py',
   'DATA'),
  ('PyQt6\\uic\\widget-plugins\\qtcharts.py',
   'D:\\Python\\prohorenok_pyqt6\\venv\\Lib\\site-packages\\PyQt6\\uic\\widget-plugins\\qtcharts.py',
   'DATA'),
  ('PySide6\\translations\\qtbase_nn.qm',
   'D:\\Python\\prohorenok_pyqt6\\venv\\Lib\\site-packages\\PySide6\\translations\\qtbase_nn.qm',
   'DATA'),
  ('qt_material\\fonts\\roboto\\RobotoCondensed-Light.ttf',
   'D:\\Python\\prohorenok_pyqt6\\venv\\Lib\\site-packages\\qt_material\\fonts\\roboto\\RobotoCondensed-Light.ttf',
   'DATA'),
  ('PyQt6\\uic\\widget-plugins\\__pycache__\\qaxcontainer.cpython-311.pyc',
   'D:\\Python\\prohorenok_pyqt6\\venv\\Lib\\site-packages\\PyQt6\\uic\\widget-plugins\\__pycache__\\qaxcontainer.cpython-311.pyc',
   'DATA'),
  ('PySide6\\translations\\qtbase_ja.qm',
   'D:\\Python\\prohorenok_pyqt6\\venv\\Lib\\site-packages\\PySide6\\translations\\qtbase_ja.qm',
   'DATA'),
  ('PySide6\\translations\\qtbase_ko.qm',
   'D:\\Python\\prohorenok_pyqt6\\venv\\Lib\\site-packages\\PySide6\\translations\\qtbase_ko.qm',
   'DATA'),
  ('qt_material\\dock_theme.ui',
   'D:\\Python\\prohorenok_pyqt6\\venv\\Lib\\site-packages\\qt_material\\dock_theme.ui',
   'DATA'),
  ('qt_material\\resources\\source\\slider.svg',
   'D:\\Python\\prohorenok_pyqt6\\venv\\Lib\\site-packages\\qt_material\\resources\\source\\slider.svg',
   'DATA'),
  ('PySide6\\translations\\qtbase_ru.qm',
   'D:\\Python\\prohorenok_pyqt6\\venv\\Lib\\site-packages\\PySide6\\translations\\qtbase_ru.qm',
   'DATA'),
  ('qt_material\\fonts\\roboto\\Roboto-BoldItalic.ttf',
   'D:\\Python\\prohorenok_pyqt6\\venv\\Lib\\site-packages\\qt_material\\fonts\\roboto\\Roboto-BoldItalic.ttf',
   'DATA'),
  ('PySide6\\translations\\qtbase_de.qm',
   'D:\\Python\\prohorenok_pyqt6\\venv\\Lib\\site-packages\\PySide6\\translations\\qtbase_de.qm',
   'DATA'),
  ('PySide6\\translations\\qtbase_it.qm',
   'D:\\Python\\prohorenok_pyqt6\\venv\\Lib\\site-packages\\PySide6\\translations\\qtbase_it.qm',
   'DATA'),
  ('qt_material\\themes\\light_cyan_500.xml',
   'D:\\Python\\prohorenok_pyqt6\\venv\\Lib\\site-packages\\qt_material\\themes\\light_cyan_500.xml',
   'DATA'),
  ('qt_material\\resources\\source\\vline.svg',
   'D:\\Python\\prohorenok_pyqt6\\venv\\Lib\\site-packages\\qt_material\\resources\\source\\vline.svg',
   'DATA'),
  ('PySide6\\translations\\qtbase_nl.qm',
   'D:\\Python\\prohorenok_pyqt6\\venv\\Lib\\site-packages\\PySide6\\translations\\qtbase_nl.qm',
   'DATA'),
  ('qt_material\\themes\\dark_yellow.xml',
   'D:\\Python\\prohorenok_pyqt6\\venv\\Lib\\site-packages\\qt_material\\themes\\dark_yellow.xml',
   'DATA'),
  ('qt_material\\resources\\source\\checklist_invert.svg',
   'D:\\Python\\prohorenok_pyqt6\\venv\\Lib\\site-packages\\qt_material\\resources\\source\\checklist_invert.svg',
   'DATA'),
  ('qt_material\\fonts\\roboto\\Roboto-Light.ttf',
   'D:\\Python\\prohorenok_pyqt6\\venv\\Lib\\site-packages\\qt_material\\fonts\\roboto\\Roboto-Light.ttf',
   'DATA'),
  ('qt_material\\fonts\\roboto\\Roboto-Bold.ttf',
   'D:\\Python\\prohorenok_pyqt6\\venv\\Lib\\site-packages\\qt_material\\fonts\\roboto\\Roboto-Bold.ttf',
   'DATA'),
  ('qt_material\\resources\\source\\uparrow2.svg',
   'D:\\Python\\prohorenok_pyqt6\\venv\\Lib\\site-packages\\qt_material\\resources\\source\\uparrow2.svg',
   'DATA'),
  ('qt_material\\fonts\\roboto\\RobotoCondensed-BoldItalic.ttf',
   'D:\\Python\\prohorenok_pyqt6\\venv\\Lib\\site-packages\\qt_material\\fonts\\roboto\\RobotoCondensed-BoldItalic.ttf',
   'DATA'),
  ('PyQt6\\Qt6\\translations\\qtbase_zh_TW.qm',
   'D:\\Python\\prohorenok_pyqt6\\venv\\Lib\\site-packages\\PyQt6\\Qt6\\translations\\qtbase_zh_TW.qm',
   'DATA'),
  ('PyQt6\\Qt6\\translations\\qtbase_pt_BR.qm',
   'D:\\Python\\prohorenok_pyqt6\\venv\\Lib\\site-packages\\PyQt6\\Qt6\\translations\\qtbase_pt_BR.qm',
   'DATA'),
  ('qt_material\\resources\\source\\radiobutton_unchecked.svg',
   'D:\\Python\\prohorenok_pyqt6\\venv\\Lib\\site-packages\\qt_material\\resources\\source\\radiobutton_unchecked.svg',
   'DATA'),
  ('PySide6\\translations\\qtbase_zh_TW.qm',
   'D:\\Python\\prohorenok_pyqt6\\venv\\Lib\\site-packages\\PySide6\\translations\\qtbase_zh_TW.qm',
   'DATA'),
  ('qt_material\\themes\\dark_medical.xml',
   'D:\\Python\\prohorenok_pyqt6\\venv\\Lib\\site-packages\\qt_material\\themes\\dark_medical.xml',
   'DATA'),
  ('qt_material\\fonts\\roboto\\Roboto-LightItalic.ttf',
   'D:\\Python\\prohorenok_pyqt6\\venv\\Lib\\site-packages\\qt_material\\fonts\\roboto\\Roboto-LightItalic.ttf',
   'DATA'),
  ('PyQt6\\Qt6\\translations\\qtbase_gd.qm',
   'D:\\Python\\prohorenok_pyqt6\\venv\\Lib\\site-packages\\PyQt6\\Qt6\\translations\\qtbase_gd.qm',
   'DATA'),
  ('qt_material\\resources\\source\\float.svg',
   'D:\\Python\\prohorenok_pyqt6\\venv\\Lib\\site-packages\\qt_material\\resources\\source\\float.svg',
   'DATA'),
  ('qt_material\\themes\\dark_lightgreen.xml',
   'D:\\Python\\prohorenok_pyqt6\\venv\\Lib\\site-packages\\qt_material\\themes\\dark_lightgreen.xml',
   'DATA'),
  ('PyQt6\\Qt6\\translations\\qtbase_ko.qm',
   'D:\\Python\\prohorenok_pyqt6\\venv\\Lib\\site-packages\\PyQt6\\Qt6\\translations\\qtbase_ko.qm',
   'DATA'),
  ('qt_material\\resources\\source\\radiobutton_checked.svg',
   'D:\\Python\\prohorenok_pyqt6\\venv\\Lib\\site-packages\\qt_material\\resources\\source\\radiobutton_checked.svg',
   'DATA'),
  ('PySide6\\translations\\qtbase_he.qm',
   'D:\\Python\\prohorenok_pyqt6\\venv\\Lib\\site-packages\\PySide6\\translations\\qtbase_he.qm',
   'DATA'),
  ('qt_material\\fonts\\roboto\\Roboto-Thin.ttf',
   'D:\\Python\\prohorenok_pyqt6\\venv\\Lib\\site-packages\\qt_material\\fonts\\roboto\\Roboto-Thin.ttf',
   'DATA'),
  ('PyQt6\\Qt6\\translations\\qtbase_uk.qm',
   'D:\\Python\\prohorenok_pyqt6\\venv\\Lib\\site-packages\\PyQt6\\Qt6\\translations\\qtbase_uk.qm',
   'DATA'),
  ('PyQt6\\Qt6\\translations\\qtbase_ru.qm',
   'D:\\Python\\prohorenok_pyqt6\\venv\\Lib\\site-packages\\PyQt6\\Qt6\\translations\\qtbase_ru.qm',
   'DATA'),
  ('qt_material\\resources\\source\\splitter-vertical.svg',
   'D:\\Python\\prohorenok_pyqt6\\venv\\Lib\\site-packages\\qt_material\\resources\\source\\splitter-vertical.svg',
   'DATA'),
  ('PyQt6\\Qt6\\translations\\qtbase_en.qm',
   'D:\\Python\\prohorenok_pyqt6\\venv\\Lib\\site-packages\\PyQt6\\Qt6\\translations\\qtbase_en.qm',
   'DATA'),
  ('PySide6\\translations\\qtbase_gd.qm',
   'D:\\Python\\prohorenok_pyqt6\\venv\\Lib\\site-packages\\PySide6\\translations\\qtbase_gd.qm',
   'DATA'),
  ('PySide6\\translations\\qtbase_tr.qm',
   'D:\\Python\\prohorenok_pyqt6\\venv\\Lib\\site-packages\\PySide6\\translations\\qtbase_tr.qm',
   'DATA'),
  ('PySide6\\translations\\qtbase_fa.qm',
   'D:\\Python\\prohorenok_pyqt6\\venv\\Lib\\site-packages\\PySide6\\translations\\qtbase_fa.qm',
   'DATA'),
  ('qt_material\\resources\\source\\__pycache__\\__init__.cpython-311.pyc',
   'D:\\Python\\prohorenok_pyqt6\\venv\\Lib\\site-packages\\qt_material\\resources\\source\\__pycache__\\__init__.cpython-311.pyc',
   'DATA'),
  ('qt_material\\resources\\source\\branch-open.svg',
   'D:\\Python\\prohorenok_pyqt6\\venv\\Lib\\site-packages\\qt_material\\resources\\source\\branch-open.svg',
   'DATA'),
  ('qt_material\\resources\\source\\checkbox_indeterminate_invert.svg',
   'D:\\Python\\prohorenok_pyqt6\\venv\\Lib\\site-packages\\qt_material\\resources\\source\\checkbox_indeterminate_invert.svg',
   'DATA'),
  ('qt_material\\resources\\source\\branch-more.svg',
   'D:\\Python\\prohorenok_pyqt6\\venv\\Lib\\site-packages\\qt_material\\resources\\source\\branch-more.svg',
   'DATA'),
  ('PyQt6\\uic\\widget-plugins\\__pycache__\\qscintilla.cpython-311.pyc',
   'D:\\Python\\prohorenok_pyqt6\\venv\\Lib\\site-packages\\PyQt6\\uic\\widget-plugins\\__pycache__\\qscintilla.cpython-311.pyc',
   'DATA'),
  ('PyQt6\\Qt6\\translations\\qtbase_it.qm',
   'D:\\Python\\prohorenok_pyqt6\\venv\\Lib\\site-packages\\PyQt6\\Qt6\\translations\\qtbase_it.qm',
   'DATA'),
  ('qt_material\\resources\\source\\__init__.py',
   'D:\\Python\\prohorenok_pyqt6\\venv\\Lib\\site-packages\\qt_material\\resources\\source\\__init__.py',
   'DATA'),
  ('qt_material\\resources\\source\\checklist.svg',
   'D:\\Python\\prohorenok_pyqt6\\venv\\Lib\\site-packages\\qt_material\\resources\\source\\checklist.svg',
   'DATA'),
  ('qt_material\\resources\\source\\checkbox_checked_invert.svg',
   'D:\\Python\\prohorenok_pyqt6\\venv\\Lib\\site-packages\\qt_material\\resources\\source\\checkbox_checked_invert.svg',
   'DATA'),
  ('qt_material\\themes\\light_red_500.xml',
   'D:\\Python\\prohorenok_pyqt6\\venv\\Lib\\site-packages\\qt_material\\themes\\light_red_500.xml',
   'DATA'),
  ('qt_material\\material.css.template',
   'D:\\Python\\prohorenok_pyqt6\\venv\\Lib\\site-packages\\qt_material\\material.css.template',
   'DATA'),
  ('qt_material\\resources\\source\\leftarrow2.svg',
   'D:\\Python\\prohorenok_pyqt6\\venv\\Lib\\site-packages\\qt_material\\resources\\source\\leftarrow2.svg',
   'DATA'),
  ('PyQt6\\Qt6\\translations\\qtbase_da.qm',
   'D:\\Python\\prohorenok_pyqt6\\venv\\Lib\\site-packages\\PyQt6\\Qt6\\translations\\qtbase_da.qm',
   'DATA'),
  ('qt_material\\themes\\dark_pink.xml',
   'D:\\Python\\prohorenok_pyqt6\\venv\\Lib\\site-packages\\qt_material\\themes\\dark_pink.xml',
   'DATA'),
  ('PyQt6\\uic\\widget-plugins\\qtwebenginewidgets.py',
   'D:\\Python\\prohorenok_pyqt6\\venv\\Lib\\site-packages\\PyQt6\\uic\\widget-plugins\\qtwebenginewidgets.py',
   'DATA'),
  ('qt_material\\themes\\light_purple.xml',
   'D:\\Python\\prohorenok_pyqt6\\venv\\Lib\\site-packages\\qt_material\\themes\\light_purple.xml',
   'DATA'),
  ('PySide6\\translations\\qtbase_uk.qm',
   'D:\\Python\\prohorenok_pyqt6\\venv\\Lib\\site-packages\\PySide6\\translations\\qtbase_uk.qm',
   'DATA'),
  ('PyQt6\\Qt6\\translations\\qtbase_fr.qm',
   'D:\\Python\\prohorenok_pyqt6\\venv\\Lib\\site-packages\\PyQt6\\Qt6\\translations\\qtbase_fr.qm',
   'DATA'),
  ('qt_material\\resources\\logo\\__init__.py',
   'D:\\Python\\prohorenok_pyqt6\\venv\\Lib\\site-packages\\qt_material\\resources\\logo\\__init__.py',
   'DATA'),
  ('qt_material\\resources\\source\\rightarrow.svg',
   'D:\\Python\\prohorenok_pyqt6\\venv\\Lib\\site-packages\\qt_material\\resources\\source\\rightarrow.svg',
   'DATA'),
  ('PyQt6\\Qt6\\translations\\qtbase_fa.qm',
   'D:\\Python\\prohorenok_pyqt6\\venv\\Lib\\site-packages\\PyQt6\\Qt6\\translations\\qtbase_fa.qm',
   'DATA'),
  ('PyQt6\\Qt6\\translations\\qtbase_sk.qm',
   'D:\\Python\\prohorenok_pyqt6\\venv\\Lib\\site-packages\\PyQt6\\Qt6\\translations\\qtbase_sk.qm',
   'DATA'),
  ('PySide6\\translations\\qtbase_fr.qm',
   'D:\\Python\\prohorenok_pyqt6\\venv\\Lib\\site-packages\\PySide6\\translations\\qtbase_fr.qm',
   'DATA'),
  ('qt_material\\fonts\\roboto\\Roboto-Italic.ttf',
   'D:\\Python\\prohorenok_pyqt6\\venv\\Lib\\site-packages\\qt_material\\fonts\\roboto\\Roboto-Italic.ttf',
   'DATA'),
  ('qt_material\\fonts\\roboto\\RobotoCondensed-Bold.ttf',
   'D:\\Python\\prohorenok_pyqt6\\venv\\Lib\\site-packages\\qt_material\\fonts\\roboto\\RobotoCondensed-Bold.ttf',
   'DATA'),
  ('qt_material\\resources\\source\\base.svg',
   'D:\\Python\\prohorenok_pyqt6\\venv\\Lib\\site-packages\\qt_material\\resources\\source\\base.svg',
   'DATA'),
  ('qt_material\\resources\\source\\checkbox_unchecked_invert.svg',
   'D:\\Python\\prohorenok_pyqt6\\venv\\Lib\\site-packages\\qt_material\\resources\\source\\checkbox_unchecked_invert.svg',
   'DATA'),
  ('qt_material\\themes\\light_lightgreen_500.xml',
   'D:\\Python\\prohorenok_pyqt6\\venv\\Lib\\site-packages\\qt_material\\themes\\light_lightgreen_500.xml',
   'DATA'),
  ('qt_material\\fonts\\roboto\\Roboto-ThinItalic.ttf',
   'D:\\Python\\prohorenok_pyqt6\\venv\\Lib\\site-packages\\qt_material\\fonts\\roboto\\Roboto-ThinItalic.ttf',
   'DATA'),
  ('qt_material\\resources\\source\\branch-end.svg',
   'D:\\Python\\prohorenok_pyqt6\\venv\\Lib\\site-packages\\qt_material\\resources\\source\\branch-end.svg',
   'DATA'),
  ('PyQt6\\uic\\widget-plugins\\__pycache__\\qtquickwidgets.cpython-311.pyc',
   'D:\\Python\\prohorenok_pyqt6\\venv\\Lib\\site-packages\\PyQt6\\uic\\widget-plugins\\__pycache__\\qtquickwidgets.cpython-311.pyc',
   'DATA'),
  ('PyQt6\\uic\\widget-plugins\\qscintilla.py',
   'D:\\Python\\prohorenok_pyqt6\\venv\\Lib\\site-packages\\PyQt6\\uic\\widget-plugins\\qscintilla.py',
   'DATA'),
  ('qt_material\\fonts\\roboto\\Roboto-BlackItalic.ttf',
   'D:\\Python\\prohorenok_pyqt6\\venv\\Lib\\site-packages\\qt_material\\fonts\\roboto\\Roboto-BlackItalic.ttf',
   'DATA'),
  ('qt_material\\resources\\source\\tab_close.svg',
   'D:\\Python\\prohorenok_pyqt6\\venv\\Lib\\site-packages\\qt_material\\resources\\source\\tab_close.svg',
   'DATA'),
  ('qt_material\\resources\\source\\toolbar-handle-horizontal.svg',
   'D:\\Python\\prohorenok_pyqt6\\venv\\Lib\\site-packages\\qt_material\\resources\\source\\toolbar-handle-horizontal.svg',
   'DATA'),
  ('qt_material\\resources\\logo\\logo_frame.svg',
   'D:\\Python\\prohorenok_pyqt6\\venv\\Lib\\site-packages\\qt_material\\resources\\logo\\logo_frame.svg',
   'DATA'),
  ('qt_material\\resources\\generate.py',
   'D:\\Python\\prohorenok_pyqt6\\venv\\Lib\\site-packages\\qt_material\\resources\\generate.py',
   'DATA'),
  ('PySide6\\translations\\qtbase_sk.qm',
   'D:\\Python\\prohorenok_pyqt6\\venv\\Lib\\site-packages\\PySide6\\translations\\qtbase_sk.qm',
   'DATA'),
  ('qt_material\\fonts\\roboto\\Roboto-MediumItalic.ttf',
   'D:\\Python\\prohorenok_pyqt6\\venv\\Lib\\site-packages\\qt_material\\fonts\\roboto\\Roboto-MediumItalic.ttf',
   'DATA'),
  ('qt_material\\resources\\source\\toolbar-handle-vertical.svg',
   'D:\\Python\\prohorenok_pyqt6\\venv\\Lib\\site-packages\\qt_material\\resources\\source\\toolbar-handle-vertical.svg',
   'DATA'),
  ('qt_material\\themes\\light_orange.xml',
   'D:\\Python\\prohorenok_pyqt6\\venv\\Lib\\site-packages\\qt_material\\themes\\light_orange.xml',
   'DATA'),
  ('PyQt6\\uic\\widget-plugins\\qtquickwidgets.py',
   'D:\\Python\\prohorenok_pyqt6\\venv\\Lib\\site-packages\\PyQt6\\uic\\widget-plugins\\qtquickwidgets.py',
   'DATA'),
  ('qt_material\\fonts\\roboto\\RobotoCondensed-Italic.ttf',
   'D:\\Python\\prohorenok_pyqt6\\venv\\Lib\\site-packages\\qt_material\\fonts\\roboto\\RobotoCondensed-Italic.ttf',
   'DATA'),
  ('qt_material\\themes\\dark_red.xml',
   'D:\\Python\\prohorenok_pyqt6\\venv\\Lib\\site-packages\\qt_material\\themes\\dark_red.xml',
   'DATA'),
  ('PySide6\\translations\\qtbase_ca.qm',
   'D:\\Python\\prohorenok_pyqt6\\venv\\Lib\\site-packages\\PySide6\\translations\\qtbase_ca.qm',
   'DATA'),
  ('PySide6\\translations\\qtbase_hu.qm',
   'D:\\Python\\prohorenok_pyqt6\\venv\\Lib\\site-packages\\PySide6\\translations\\qtbase_hu.qm',
   'DATA'),
  ('qt_material\\fonts\\roboto\\RobotoCondensed-Regular.ttf',
   'D:\\Python\\prohorenok_pyqt6\\venv\\Lib\\site-packages\\qt_material\\fonts\\roboto\\RobotoCondensed-Regular.ttf',
   'DATA'),
  ('qt_material\\resources\\source\\checklist_indeterminate_invert.svg',
   'D:\\Python\\prohorenok_pyqt6\\venv\\Lib\\site-packages\\qt_material\\resources\\source\\checklist_indeterminate_invert.svg',
   'DATA'),
  ('PyQt6\\uic\\widget-plugins\\__pycache__\\qtprintsupport.cpython-311.pyc',
   'D:\\Python\\prohorenok_pyqt6\\venv\\Lib\\site-packages\\PyQt6\\uic\\widget-plugins\\__pycache__\\qtprintsupport.cpython-311.pyc',
   'DATA'),
  ('qt_material\\fonts\\roboto\\Roboto-Black.ttf',
   'D:\\Python\\prohorenok_pyqt6\\venv\\Lib\\site-packages\\qt_material\\fonts\\roboto\\Roboto-Black.ttf',
   'DATA'),
  ('qt_material\\resources\\source\\checkbox_indeterminate.svg',
   'D:\\Python\\prohorenok_pyqt6\\venv\\Lib\\site-packages\\qt_material\\resources\\source\\checkbox_indeterminate.svg',
   'DATA'),
  ('qt_material\\fonts\\roboto\\Roboto-Regular.ttf',
   'D:\\Python\\prohorenok_pyqt6\\venv\\Lib\\site-packages\\qt_material\\fonts\\roboto\\Roboto-Regular.ttf',
   'DATA'),
  ('PyQt6\\Qt6\\translations\\qtbase_fi.qm',
   'D:\\Python\\prohorenok_pyqt6\\venv\\Lib\\site-packages\\PyQt6\\Qt6\\translations\\qtbase_fi.qm',
   'DATA'),
  ('PySide6\\translations\\qtbase_pl.qm',
   'D:\\Python\\prohorenok_pyqt6\\venv\\Lib\\site-packages\\PySide6\\translations\\qtbase_pl.qm',
   'DATA'),
  ('qt_material\\themes\\light_red.xml',
   'D:\\Python\\prohorenok_pyqt6\\venv\\Lib\\site-packages\\qt_material\\themes\\light_red.xml',
   'DATA'),
  ('qt_material\\fonts\\roboto\\RobotoCondensed-LightItalic.ttf',
   'D:\\Python\\prohorenok_pyqt6\\venv\\Lib\\site-packages\\qt_material\\fonts\\roboto\\RobotoCondensed-LightItalic.ttf',
   'DATA'),
  ('qt_material\\resources\\source\\close.svg',
   'D:\\Python\\prohorenok_pyqt6\\venv\\Lib\\site-packages\\qt_material\\resources\\source\\close.svg',
   'DATA'),
  ('PySide6\\translations\\qtbase_cs.qm',
   'D:\\Python\\prohorenok_pyqt6\\venv\\Lib\\site-packages\\PySide6\\translations\\qtbase_cs.qm',
   'DATA'),
  ('PyQt6\\Qt6\\translations\\qtbase_tr.qm',
   'D:\\Python\\prohorenok_pyqt6\\venv\\Lib\\site-packages\\PyQt6\\Qt6\\translations\\qtbase_tr.qm',
   'DATA'),
  ('PySide6\\translations\\qtbase_lv.qm',
   'D:\\Python\\prohorenok_pyqt6\\venv\\Lib\\site-packages\\PySide6\\translations\\qtbase_lv.qm',
   'DATA'),
  ('qt_material\\resources\\source\\sizegrip.svg',
   'D:\\Python\\prohorenok_pyqt6\\venv\\Lib\\site-packages\\qt_material\\resources\\source\\sizegrip.svg',
   'DATA'),
  ('qt_material\\themes\\light_blue_500.xml',
   'D:\\Python\\prohorenok_pyqt6\\venv\\Lib\\site-packages\\qt_material\\themes\\light_blue_500.xml',
   'DATA'),
  ('PyQt6\\Qt6\\translations\\qtbase_he.qm',
   'D:\\Python\\prohorenok_pyqt6\\venv\\Lib\\site-packages\\PyQt6\\Qt6\\translations\\qtbase_he.qm',
   'DATA'),
  ('qt_material\\resources\\source\\splitter-horizontal.svg',
   'D:\\Python\\prohorenok_pyqt6\\venv\\Lib\\site-packages\\qt_material\\resources\\source\\splitter-horizontal.svg',
   'DATA'),
  ('qt_material\\themes\\light_blue.xml',
   'D:\\Python\\prohorenok_pyqt6\\venv\\Lib\\site-packages\\qt_material\\themes\\light_blue.xml',
   'DATA'),
  ('qt_material\\themes\\light_pink_500.xml',
   'D:\\Python\\prohorenok_pyqt6\\venv\\Lib\\site-packages\\qt_material\\themes\\light_pink_500.xml',
   'DATA'),
  ('qt_material\\themes\\light_teal.xml',
   'D:\\Python\\prohorenok_pyqt6\\venv\\Lib\\site-packages\\qt_material\\themes\\light_teal.xml',
   'DATA'),
  ('qt_material\\themes\\light_lightgreen.xml',
   'D:\\Python\\prohorenok_pyqt6\\venv\\Lib\\site-packages\\qt_material\\themes\\light_lightgreen.xml',
   'DATA'),
  ('PyQt6\\Qt6\\translations\\qtbase_es.qm',
   'D:\\Python\\prohorenok_pyqt6\\venv\\Lib\\site-packages\\PyQt6\\Qt6\\translations\\qtbase_es.qm',
   'DATA'),
  ('qt_material\\resources\\source\\leftarrow.svg',
   'D:\\Python\\prohorenok_pyqt6\\venv\\Lib\\site-packages\\qt_material\\resources\\source\\leftarrow.svg',
   'DATA'),
  ('PyQt6\\uic\\widget-plugins\\__pycache__\\qtcharts.cpython-311.pyc',
   'D:\\Python\\prohorenok_pyqt6\\venv\\Lib\\site-packages\\PyQt6\\uic\\widget-plugins\\__pycache__\\qtcharts.cpython-311.pyc',
   'DATA'),
  ('qt_material\\themes\\dark_teal.xml',
   'D:\\Python\\prohorenok_pyqt6\\venv\\Lib\\site-packages\\qt_material\\themes\\dark_teal.xml',
   'DATA'),
  ('qt_material\\resources\\source\\checklist_indeterminate.svg',
   'D:\\Python\\prohorenok_pyqt6\\venv\\Lib\\site-packages\\qt_material\\resources\\source\\checklist_indeterminate.svg',
   'DATA'),
  ('qt_material\\resources\\source\\downarrow2.svg',
   'D:\\Python\\prohorenok_pyqt6\\venv\\Lib\\site-packages\\qt_material\\resources\\source\\downarrow2.svg',
   'DATA'),
  ('qt_material\\themes\\dark_purple.xml',
   'D:\\Python\\prohorenok_pyqt6\\venv\\Lib\\site-packages\\qt_material\\themes\\dark_purple.xml',
   'DATA'),
  ('PyQt6\\Qt6\\translations\\qtbase_hr.qm',
   'D:\\Python\\prohorenok_pyqt6\\venv\\Lib\\site-packages\\PyQt6\\Qt6\\translations\\qtbase_hr.qm',
   'DATA'),
  ('PyQt6\\Qt6\\translations\\qtbase_ar.qm',
   'D:\\Python\\prohorenok_pyqt6\\venv\\Lib\\site-packages\\PyQt6\\Qt6\\translations\\qtbase_ar.qm',
   'DATA'),
  ('PyQt6\\Qt6\\translations\\qtbase_hu.qm',
   'D:\\Python\\prohorenok_pyqt6\\venv\\Lib\\site-packages\\PyQt6\\Qt6\\translations\\qtbase_hu.qm',
   'DATA'),
  ('qt_material\\resources\\__pycache__\\__init__.cpython-311.pyc',
   'D:\\Python\\prohorenok_pyqt6\\venv\\Lib\\site-packages\\qt_material\\resources\\__pycache__\\__init__.cpython-311.pyc',
   'DATA'),
  ('qt_material\\resources\\__pycache__\\generate.cpython-311.pyc',
   'D:\\Python\\prohorenok_pyqt6\\venv\\Lib\\site-packages\\qt_material\\resources\\__pycache__\\generate.cpython-311.pyc',
   'DATA'),
  ('PySide6\\translations\\qtbase_ar.qm',
   'D:\\Python\\prohorenok_pyqt6\\venv\\Lib\\site-packages\\PySide6\\translations\\qtbase_ar.qm',
   'DATA'),
  ('PySide6\\translations\\qtbase_fi.qm',
   'D:\\Python\\prohorenok_pyqt6\\venv\\Lib\\site-packages\\PySide6\\translations\\qtbase_fi.qm',
   'DATA'),
  ('qt_material\\resources\\source\\rightarrow2.svg',
   'D:\\Python\\prohorenok_pyqt6\\venv\\Lib\\site-packages\\qt_material\\resources\\source\\rightarrow2.svg',
   'DATA'),
  ('qt_material\\resources\\source\\checkbox_checked.svg',
   'D:\\Python\\prohorenok_pyqt6\\venv\\Lib\\site-packages\\qt_material\\resources\\source\\checkbox_checked.svg',
   'DATA'),
  ('qt_material\\fonts\\roboto\\Roboto-Medium.ttf',
   'D:\\Python\\prohorenok_pyqt6\\venv\\Lib\\site-packages\\qt_material\\fonts\\roboto\\Roboto-Medium.ttf',
   'DATA'),
  ('PySide6\\translations\\qtbase_en.qm',
   'D:\\Python\\prohorenok_pyqt6\\venv\\Lib\\site-packages\\PySide6\\translations\\qtbase_en.qm',
   'DATA'),
  ('qt_material\\themes\\dark_cyan.xml',
   'D:\\Python\\prohorenok_pyqt6\\venv\\Lib\\site-packages\\qt_material\\themes\\dark_cyan.xml',
   'DATA'),
  ('PyQt6\\Qt6\\translations\\qtbase_ca.qm',
   'D:\\Python\\prohorenok_pyqt6\\venv\\Lib\\site-packages\\PyQt6\\Qt6\\translations\\qtbase_ca.qm',
   'DATA'),
  ('PySide6\\translations\\qtbase_pt_BR.qm',
   'D:\\Python\\prohorenok_pyqt6\\venv\\Lib\\site-packages\\PySide6\\translations\\qtbase_pt_BR.qm',
   'DATA'),
  ('qt_material\\themes\\dark_amber.xml',
   'D:\\Python\\prohorenok_pyqt6\\venv\\Lib\\site-packages\\qt_material\\themes\\dark_amber.xml',
   'DATA'),
  ('PySide6\\translations\\qtbase_zh_CN.qm',
   'D:\\Python\\prohorenok_pyqt6\\venv\\Lib\\site-packages\\PySide6\\translations\\qtbase_zh_CN.qm',
   'DATA'),
  ('qt_material\\resources\\source\\uparrow.svg',
   'D:\\Python\\prohorenok_pyqt6\\venv\\Lib\\site-packages\\qt_material\\resources\\source\\uparrow.svg',
   'DATA'),
  ('PyQt6\\uic\\widget-plugins\\qtprintsupport.py',
   'D:\\Python\\prohorenok_pyqt6\\venv\\Lib\\site-packages\\PyQt6\\uic\\widget-plugins\\qtprintsupport.py',
   'DATA'),
  ('PySide6\\translations\\qtbase_es.qm',
   'D:\\Python\\prohorenok_pyqt6\\venv\\Lib\\site-packages\\PySide6\\translations\\qtbase_es.qm',
   'DATA'),
  ('PySide6\\translations\\qtbase_bg.qm',
   'D:\\Python\\prohorenok_pyqt6\\venv\\Lib\\site-packages\\PySide6\\translations\\qtbase_bg.qm',
   'DATA'),
  ('PySide6\\translations\\qtbase_da.qm',
   'D:\\Python\\prohorenok_pyqt6\\venv\\Lib\\site-packages\\PySide6\\translations\\qtbase_da.qm',
   'DATA'),
  ('qt_material\\resources\\source\\downarrow.svg',
   'D:\\Python\\prohorenok_pyqt6\\venv\\Lib\\site-packages\\qt_material\\resources\\source\\downarrow.svg',
   'DATA'),
  ('qt_material\\resources\\__init__.py',
   'D:\\Python\\prohorenok_pyqt6\\venv\\Lib\\site-packages\\qt_material\\resources\\__init__.py',
   'DATA'),
  ('PyQt6\\Qt6\\translations\\qtbase_ja.qm',
   'D:\\Python\\prohorenok_pyqt6\\venv\\Lib\\site-packages\\PyQt6\\Qt6\\translations\\qtbase_ja.qm',
   'DATA'),
  ('PyQt6\\Qt6\\translations\\qtbase_nl.qm',
   'D:\\Python\\prohorenok_pyqt6\\venv\\Lib\\site-packages\\PyQt6\\Qt6\\translations\\qtbase_nl.qm',
   'DATA'),
  ('PyQt6\\Qt6\\translations\\qtbase_cs.qm',
   'D:\\Python\\prohorenok_pyqt6\\venv\\Lib\\site-packages\\PyQt6\\Qt6\\translations\\qtbase_cs.qm',
   'DATA'),
  ('PyQt6\\Qt6\\translations\\qtbase_bg.qm',
   'D:\\Python\\prohorenok_pyqt6\\venv\\Lib\\site-packages\\PyQt6\\Qt6\\translations\\qtbase_bg.qm',
   'DATA'),
  ('PyQt6\\Qt6\\translations\\qtbase_pl.qm',
   'D:\\Python\\prohorenok_pyqt6\\venv\\Lib\\site-packages\\PyQt6\\Qt6\\translations\\qtbase_pl.qm',
   'DATA'),
  ('qt_material\\resources\\logo\\__pycache__\\__init__.cpython-311.pyc',
   'D:\\Python\\prohorenok_pyqt6\\venv\\Lib\\site-packages\\qt_material\\resources\\logo\\__pycache__\\__init__.cpython-311.pyc',
   'DATA'),
  ('qt_material\\themes\\light_teal_500.xml',
   'D:\\Python\\prohorenok_pyqt6\\venv\\Lib\\site-packages\\qt_material\\themes\\light_teal_500.xml',
   'DATA')],
 [])
