%YAML 1.1
%TAG !u! tag:unity3d.com,2011:
--- !u!114 &11400000
MonoBehaviour:
  m_ObjectHideFlags: 0
  m_CorrespondingSourceObject: {fileID: 0}
  m_PrefabInternal: {fileID: 0}
  m_GameObject: {fileID: 0}
  m_Enabled: 1
  m_EditorHideFlags: 0
  m_Script: {fileID: 11500000, guid: 01b459e333b7530499df24c90a8a4705, type: 3}
  m_Name: Vampire
  m_EditorClassIdentifier: 
  CardName: Vampire
  Description: '"Twighlight is bullshit."'
  Art: {fileID: 21300000, guid: d9773b1696caabe4f97bd7b48427db8c, type: 3}
  Attack: 7
  Health: 4
  BaseAttack: 7
  BaseHealth: 4
  ThreatValue: 6
