{"Entities" : [  
	{
		"Id": 1,
		"EffectValue": 0,
		"Targets": [
			7
		],
		"ChildrenIds": [
			2, 3, 4
		],
		"Description": "You are the warrior.",
		"SpriteName": "barbarian"
	},
	{
		"Id": 2,
		"EffectValue": 5,
		"Targets": [
			2
		],
		"ChildrenIds": [
			5, 6
		],
		"Description": "Increases attack power by {0}",
		"SpriteName": "broadsword"
	},
	{
		"Id": 3,
		"EffectValue": 5,
		"Targets": [
			4
		],
		"ChildrenIds": [
			7, 8
		],
		"Description": "Increase healing power by {0}",
		"SpriteName": "broken-heart"
	},
	{
		"Id": 4,
		"EffectValue": 5,
		"Targets": [
			3
		],
		"ChildrenIds": [
			9, 10
		],
		"Description": "Increase spell power by {0}",
		"SpriteName": "robe"
	},
	{
		"Id": 5,
		"EffectValue": 5,
		"Targets": [
			0, 2
		],
		"ChildrenIds": [
			11
		],
		"Description": "Increases single target attack power by {0}",
		"SpriteName": "bullseye"
	},
	{
		"Id": 6,
		"EffectValue": 5,
		"Targets": [
			1, 2
		],
		"ChildrenIds": [
			12
		],
		"Description": "Increases area attack power by {0}",
		"SpriteName": "wind-slap"
	},
	{
		"Id": 7,
		"EffectValue": 5,
		"Targets": [
			6
		],
		"ChildrenIds": [
			13
		],
		"Description": "Increases power of damage reduction cards by {0}",
		"SpriteName": "shattered-sword"
	},
	{
		"Id": 8,
		"EffectValue": 5,
		"Targets": [
			4
		],
		"ChildrenIds": [
			14
		],
		"Description": "Increase healing power by {0}",
		"SpriteName": "health-capsule"
	},
	{
		"Id": 9,
		"EffectValue": 5,
		"Targets": [
			3,
			1
		],
		"ChildrenIds": [
			15
		],
		"Description": "Increase area spell power by {0}",
		"SpriteName": "cowled"
	},
	{
		"Id": 10,
		"EffectValue": 5,
		"Targets": [
			3,
			0
		],
		"ChildrenIds": [
			16
		],
		"Description": "Increase single target spell power by {0}",
		"SpriteName": "cultist"
	},
	{
		"Id": 11,
		"EffectValue": 5,
		"Targets": [
			0,
			2
		],
		"ChildrenIds": [
		],
		"Description": "Increases single target attack power by {0}",
		"SpriteName": "headshot"
	},
	{
		"Id": 12,
		"EffectValue": 5,
		"Targets": [
			1,
			2
		],
		"ChildrenIds": [
		],
		"Description": "Increases area attack power by {0}",
		"SpriteName": "thrown-daggers"
	},
	{
		"Id": 13,
		"EffectValue": 5,
		"Targets": [
			6
		],
		"ChildrenIds": [
		],
		"Description": "Increases power of damage reduction cards by {0}",
		"SpriteName": "ultrasound"
	},
	{
		"Id": 14,
		"EffectValue": 5,
		"Targets": [
			4
		],
		"ChildrenIds": [
		],
		"Description": "Increase healing power by {0}",
		"SpriteName": "embrassed-energy"
	},
	{
		"Id": 15,
		"EffectValue": 5,
		"Targets": [
			3,
			1
		],
		"ChildrenIds": [
		],
		"Description": "Increase area spell power by {0}",
		"SpriteName": "kenku-head"
	},
	{
		"Id": 16,
		"EffectValue": 5,
		"Targets": [
			0,
			3
		],
		"ChildrenIds": [
		],
		"Description": "Increase single target spell power by {0}",
		"SpriteName": "cloak-dagger"
	}
]}