{
  "profiles": {
    "Simulator Runner": {
      "commandName": "Project",
      "commandLineArgs": "HillClimbing EnemySetBasic VampireSwarm TwinDragons VampireBoss AncientGreece AlienSwarm"
    }
  }
}