<?xml version="1.0" encoding="utf-8"?>
<!DOCTYPE eagle SYSTEM "eagle.dtd">
<eagle version="6.4">
<drawing>
<settings>
<setting alwaysvectorfont="no"/>
<setting verticaltext="up"/>
</settings>
<grid distance="0.635" unitdist="mm" unit="mm" style="lines" multiple="4" display="yes" altdistance="0.3175" altunitdist="mm" altunit="mm"/>
<layers>
<layer number="1" name="Top" color="4" fill="1" visible="yes" active="yes"/>
<layer number="16" name="Bottom" color="1" fill="1" visible="yes" active="yes"/>
<layer number="17" name="Pads" color="2" fill="1" visible="yes" active="yes"/>
<layer number="18" name="Vias" color="2" fill="1" visible="yes" active="yes"/>
<layer number="19" name="Unrouted" color="6" fill="1" visible="yes" active="yes"/>
<layer number="20" name="Dimension" color="15" fill="1" visible="yes" active="yes"/>
<layer number="21" name="tPlace" color="7" fill="1" visible="yes" active="yes"/>
<layer number="22" name="bPlace" color="7" fill="1" visible="yes" active="yes"/>
<layer number="23" name="tOrigins" color="15" fill="1" visible="yes" active="yes"/>
<layer number="24" name="bOrigins" color="15" fill="1" visible="yes" active="yes"/>
<layer number="25" name="tNames" color="7" fill="1" visible="yes" active="yes"/>
<layer number="26" name="bNames" color="7" fill="1" visible="yes" active="yes"/>
<layer number="27" name="tValues" color="7" fill="1" visible="yes" active="yes"/>
<layer number="28" name="bValues" color="7" fill="1" visible="yes" active="yes"/>
<layer number="29" name="tStop" color="7" fill="3" visible="yes" active="yes"/>
<layer number="30" name="bStop" color="7" fill="6" visible="yes" active="yes"/>
<layer number="31" name="tCream" color="7" fill="4" visible="yes" active="yes"/>
<layer number="32" name="bCream" color="7" fill="5" visible="yes" active="yes"/>
<layer number="33" name="tFinish" color="6" fill="3" visible="yes" active="yes"/>
<layer number="34" name="bFinish" color="6" fill="6" visible="yes" active="yes"/>
<layer number="35" name="tGlue" color="7" fill="4" visible="yes" active="yes"/>
<layer number="36" name="bGlue" color="7" fill="5" visible="yes" active="yes"/>
<layer number="37" name="tTest" color="7" fill="1" visible="yes" active="yes"/>
<layer number="38" name="bTest" color="7" fill="1" visible="yes" active="yes"/>
<layer number="39" name="tKeepout" color="4" fill="11" visible="yes" active="yes"/>
<layer number="40" name="bKeepout" color="1" fill="11" visible="yes" active="yes"/>
<layer number="41" name="tRestrict" color="4" fill="10" visible="yes" active="yes"/>
<layer number="42" name="bRestrict" color="1" fill="10" visible="yes" active="yes"/>
<layer number="43" name="vRestrict" color="2" fill="10" visible="yes" active="yes"/>
<layer number="44" name="Drills" color="7" fill="1" visible="yes" active="yes"/>
<layer number="45" name="Holes" color="7" fill="1" visible="yes" active="yes"/>
<layer number="46" name="Milling" color="3" fill="1" visible="yes" active="yes"/>
<layer number="47" name="Measures" color="7" fill="1" visible="yes" active="yes"/>
<layer number="48" name="Document" color="7" fill="1" visible="yes" active="yes"/>
<layer number="49" name="Reference" color="7" fill="1" visible="yes" active="yes"/>
<layer number="51" name="tDocu" color="7" fill="1" visible="yes" active="yes"/>
<layer number="52" name="bDocu" color="7" fill="1" visible="yes" active="yes"/>
<layer number="91" name="Nets" color="1" fill="1" visible="yes" active="yes"/>
<layer number="92" name="Busses" color="1" fill="1" visible="yes" active="yes"/>
<layer number="93" name="Pins" color="2" fill="1" visible="yes" active="yes"/>
<layer number="94" name="Symbols" color="4" fill="1" visible="yes" active="yes"/>
<layer number="95" name="Names" color="12" fill="1" visible="yes" active="yes"/>
<layer number="96" name="Values" color="15" fill="1" visible="yes" active="yes"/>
<layer number="97" name="Info" color="5" fill="1" visible="yes" active="yes"/>
<layer number="98" name="Guide" color="3" fill="1" visible="yes" active="yes"/>
</layers>
<library>
<packages>
</packages>
<symbols>
<symbol name="ARROW">
<wire x1="0.635" y1="-1.27" x2="0" y2="0" width="0.254" layer="94"/>
<wire x1="0" y1="0" x2="-0.635" y2="-1.27" width="0.254" layer="94"/>
<text x="0" y="0.635" size="1.27" layer="96" ratio="12" align="bottom-center">&gt;VALUE</text>
<pin name="1" x="0" y="-2.54" visible="off" length="point" direction="sup" rot="R90"/>
<wire x1="-0.635" y1="-1.27" x2="0" y2="-1.27" width="0.254" layer="94"/>
<wire x1="0" y1="-1.27" x2="0.635" y2="-1.27" width="0.254" layer="94"/>
<wire x1="0" y1="-1.27" x2="0" y2="-2.54" width="0.1524" layer="94"/>
</symbol>
<symbol name="BAR">
<pin name="1" x="0" y="2.54" visible="off" length="short" direction="sup" rot="R270"/>
<text x="0" y="-1.905" size="1.27" layer="96" ratio="12" align="bottom-center">&gt;VALUE</text>
<rectangle x1="-1.27" y1="-0.1" x2="1.27" y2="0.635" layer="94"/>
</symbol>
<symbol name="GROUND">
<wire x1="-1.905" y1="1.27" x2="0" y2="1.27" width="0.254" layer="94"/>
<wire x1="0" y1="1.27" x2="1.905" y2="1.27" width="0.254" layer="94"/>
<wire x1="-1.0922" y1="0.762" x2="1.0922" y2="0.762" width="0.254" layer="94"/>
<wire x1="-0.6223" y1="0.254" x2="0.6223" y2="0.254" width="0.254" layer="94"/>
<wire x1="-0.3048" y1="-0.254" x2="0.3302" y2="-0.254" width="0.254" layer="94"/>
<pin name="PE" x="0" y="2.54" visible="off" length="point" direction="sup" rot="R270"/>
<text x="0" y="-1.905" size="1.27" layer="96" ratio="12" align="bottom-center">&gt;VALUE</text>
<wire x1="0" y1="2.54" x2="0" y2="1.27" width="0.1524" layer="94"/>
</symbol>
<symbol name="CIRCLE">
<circle x="0" y="1.905" radius="0.635" width="0.254" layer="94"/>
<pin name="1" x="0" y="0" visible="off" length="point" direction="sup" rot="R90"/>
<text x="0" y="3.175" size="1.27" layer="96" ratio="12" align="bottom-center">&gt;VALUE</text>
<wire x1="0" y1="0" x2="0" y2="1.27" width="0.1524" layer="94"/>
</symbol>
<symbol name="+3V3A_ARROW">
<text x="0" y="3.175" size="1.27" layer="96" ratio="12" align="bottom-center">&gt;VALUE</text>
<wire x1="0.635" y1="1.27" x2="0" y2="2.54" width="0.254" layer="94"/>
<wire x1="0" y1="2.54" x2="-0.635" y2="1.27" width="0.254" layer="94"/>
<wire x1="-0.635" y1="1.27" x2="0" y2="1.27" width="0.254" layer="94"/>
<wire x1="0" y1="1.27" x2="0.635" y2="1.27" width="0.254" layer="94"/>
<wire x1="0" y1="1.27" x2="0" y2="0" width="0.1524" layer="94"/>
<pin name="+3V3A" x="0" y="0" visible="off" length="point" direction="sup"/>
</symbol>
<symbol name="+5V0_ARROW">
<wire x1="0.635" y1="1.27" x2="0" y2="2.54" width="0.254" layer="94"/>
<wire x1="0" y1="2.54" x2="-0.635" y2="1.27" width="0.254" layer="94"/>
<pin name="+5V" x="0" y="0" visible="off" length="point" direction="sup" rot="R90"/>
<wire x1="-0.635" y1="1.27" x2="0" y2="1.27" width="0.254" layer="94"/>
<wire x1="0" y1="1.27" x2="0.635" y2="1.27" width="0.254" layer="94"/>
<wire x1="0" y1="1.27" x2="0" y2="0" width="0.1524" layer="94"/>
<text x="0" y="3.175" size="1.27" layer="96" ratio="12" align="bottom-center">&gt;VALUE</text>
</symbol>
<symbol name="+3V3_CIRCLE">
<circle x="0" y="1.905" radius="0.635" width="0.254" layer="94"/>
<pin name="+3V3" x="0" y="0" visible="off" length="point" direction="sup" rot="R90"/>
<wire x1="0" y1="1.27" x2="0" y2="0" width="0.1524" layer="94"/>
<text x="0" y="3.175" size="1.27" layer="96" ratio="12" align="bottom-center">&gt;VALUE</text>
</symbol>
<symbol name="+5V0_CIRCLE">
<circle x="0" y="1.905" radius="0.635" width="0.254" layer="94"/>
<pin name="+5V" x="0" y="0" visible="off" length="point" direction="sup" rot="R90"/>
<wire x1="0" y1="1.27" x2="0" y2="0" width="0.1524" layer="94"/>
<text x="0" y="3.175" size="1.27" layer="96" ratio="12" align="bottom-center">&gt;VALUE</text>
</symbol>
<symbol name="GND_BAR">
<pin name="GND" x="0" y="0" visible="off" length="short" direction="sup" rot="R270"/>
<text x="0" y="-4.445" size="1.27" layer="96" ratio="12" align="bottom-center">GND</text>
<rectangle x1="-1.27" y1="-2.64" x2="1.27" y2="-1.905" layer="94"/>
</symbol>
<symbol name="+VDDA_ARROW">
<text x="0" y="3.175" size="1.27" layer="96" ratio="12" align="bottom-center">+VDDA</text>
<wire x1="0.635" y1="1.27" x2="0" y2="2.54" width="0.254" layer="94"/>
<wire x1="0" y1="2.54" x2="-0.635" y2="1.27" width="0.254" layer="94"/>
<pin name="+VDDA" x="0" y="0" visible="off" length="point" direction="sup" rot="R90"/>
<wire x1="-0.635" y1="1.27" x2="0" y2="1.27" width="0.254" layer="94"/>
<wire x1="0" y1="1.27" x2="0.635" y2="1.27" width="0.254" layer="94"/>
<wire x1="0" y1="1.27" x2="0" y2="0" width="0.1524" layer="94"/>
</symbol>
<symbol name="+VDDA_CIRCLE">
<circle x="0" y="1.905" radius="0.635" width="0.254" layer="94"/>
<pin name="+VDDA" x="0" y="0" visible="off" length="point" direction="sup" rot="R90"/>
<text x="0" y="3.175" size="1.27" layer="96" ratio="12" align="bottom-center">+VDDA</text>
<wire x1="0" y1="1.27" x2="0" y2="0" width="0.1524" layer="94"/>
</symbol>
<symbol name="GNDA_BAR">
<pin name="GNDA" x="0" y="0" visible="off" length="short" direction="sup" rot="R270"/>
<text x="0" y="-4.445" size="1.27" layer="96" ratio="12" align="bottom-center">GNDA</text>
<rectangle x1="-1.27" y1="-2.64" x2="1.27" y2="-1.905" layer="94"/>
</symbol>
<symbol name="+VCORE_ARROW">
<text x="0" y="3.175" size="1.27" layer="96" ratio="12" align="bottom-center">+VCORE</text>
<wire x1="0.635" y1="1.27" x2="0" y2="2.54" width="0.254" layer="94"/>
<wire x1="0" y1="2.54" x2="-0.635" y2="1.27" width="0.254" layer="94"/>
<pin name="+VCORE" x="0" y="0" visible="off" length="point" direction="sup" rot="R90"/>
<wire x1="-0.635" y1="1.27" x2="0" y2="1.27" width="0.254" layer="94"/>
<wire x1="0" y1="1.27" x2="0.635" y2="1.27" width="0.254" layer="94"/>
<wire x1="0" y1="1.27" x2="0" y2="0" width="0.1524" layer="94"/>
</symbol>
<symbol name="+VCORE_CIRCLE">
<text x="0" y="3.175" size="1.27" layer="96" ratio="12" align="bottom-center">+VCORE</text>
<pin name="+VCORE" x="0" y="0" visible="off" length="point" direction="sup" rot="R90"/>
<circle x="0" y="1.905" radius="0.635" width="0.254" layer="94"/>
<wire x1="0" y1="1.27" x2="0" y2="0" width="0.1524" layer="94"/>
</symbol>
<symbol name="+VDDE_ARROW">
<text x="0" y="3.175" size="1.27" layer="96" ratio="12" align="bottom-center">+VDDE</text>
<wire x1="0.635" y1="1.27" x2="0" y2="2.54" width="0.254" layer="94"/>
<wire x1="0" y1="2.54" x2="-0.635" y2="1.27" width="0.254" layer="94"/>
<pin name="+VDDE" x="0" y="0" visible="off" length="point" direction="sup" rot="R90"/>
<wire x1="-0.635" y1="1.27" x2="0" y2="1.27" width="0.254" layer="94"/>
<wire x1="0" y1="1.27" x2="0.635" y2="1.27" width="0.254" layer="94"/>
<wire x1="0" y1="1.27" x2="0" y2="0" width="0.1524" layer="94"/>
</symbol>
<symbol name="+VDDE_CIRCLE">
<circle x="0" y="1.905" radius="0.635" width="0.254" layer="94"/>
<pin name="+VDDE" x="0" y="0" visible="off" length="point" direction="sup" rot="R90"/>
<text x="0" y="3.175" size="1.27" layer="96" ratio="12" align="bottom-center">+VDDE</text>
<wire x1="0" y1="1.27" x2="0" y2="0" width="0.1524" layer="94"/>
</symbol>
<symbol name="GNDE_BAR">
<pin name="GNDE" x="0" y="0" visible="off" length="short" direction="sup" rot="R270"/>
<text x="0" y="-4.445" size="1.27" layer="96" ratio="12" align="bottom-center">GNDE</text>
<rectangle x1="-1.27" y1="-2.64" x2="1.27" y2="-1.905" layer="94"/>
</symbol>
<symbol name="+24V_ARROW">
<text x="0" y="3.175" size="1.27" layer="96" ratio="12" align="bottom-center">+24V</text>
<wire x1="0.635" y1="1.27" x2="0" y2="2.54" width="0.254" layer="94"/>
<wire x1="0" y1="2.54" x2="-0.635" y2="1.27" width="0.254" layer="94"/>
<pin name="+24V" x="0" y="0" visible="off" length="point" direction="sup" rot="R90"/>
<wire x1="-0.635" y1="1.27" x2="0" y2="1.27" width="0.254" layer="94"/>
<wire x1="0" y1="1.27" x2="0.635" y2="1.27" width="0.254" layer="94"/>
<wire x1="0" y1="1.27" x2="0" y2="0" width="0.1524" layer="94"/>
</symbol>
<symbol name="+24V_CIRCLE">
<circle x="0" y="1.905" radius="0.635" width="0.254" layer="94"/>
<pin name="+24V" x="0" y="0" visible="off" length="point" direction="sup" rot="R90"/>
<text x="0" y="3.175" size="1.27" layer="96" ratio="12" align="bottom-center">+24V</text>
<wire x1="0" y1="1.27" x2="0" y2="0" width="0.1524" layer="94"/>
</symbol>
<symbol name="+VIN_CIRCLE">
<circle x="0" y="1.905" radius="0.635" width="0.254" layer="94"/>
<pin name="+VIN" x="0" y="0" visible="off" length="point" direction="sup" rot="R90"/>
<text x="0" y="3.175" size="1.27" layer="96" ratio="12" align="bottom-center">+VIN</text>
<wire x1="0" y1="1.27" x2="0" y2="0" width="0.1524" layer="94"/>
</symbol>
<symbol name="+VIN_ARROW">
<text x="0" y="3.175" size="1.27" layer="96" ratio="12" align="bottom-center">+VIN</text>
<wire x1="0.635" y1="1.27" x2="0" y2="2.54" width="0.254" layer="94"/>
<wire x1="0" y1="2.54" x2="-0.635" y2="1.27" width="0.254" layer="94"/>
<pin name="+VIN" x="0" y="0" visible="off" length="point" direction="sup" rot="R90"/>
<wire x1="-0.635" y1="1.27" x2="0" y2="1.27" width="0.254" layer="94"/>
<wire x1="0" y1="1.27" x2="0.635" y2="1.27" width="0.254" layer="94"/>
<wire x1="0" y1="1.27" x2="0" y2="0" width="0.1524" layer="94"/>
</symbol>
<symbol name="+15V_CIRCLE">
<circle x="0" y="1.905" radius="0.635" width="0.254" layer="94"/>
<pin name="+15V" x="0" y="0" visible="off" length="point" direction="sup" rot="R90"/>
<text x="0" y="3.175" size="1.27" layer="96" ratio="12" align="bottom-center">+15V</text>
<wire x1="0" y1="1.27" x2="0" y2="0" width="0.1524" layer="94"/>
</symbol>
<symbol name="+15V_ARROW">
<pin name="+15V" x="0" y="0" visible="off" length="point" direction="sup" rot="R90"/>
<wire x1="0.635" y1="1.27" x2="0" y2="2.54" width="0.254" layer="94"/>
<wire x1="0" y1="2.54" x2="-0.635" y2="1.27" width="0.254" layer="94"/>
<wire x1="-0.635" y1="1.27" x2="0" y2="1.27" width="0.254" layer="94"/>
<wire x1="0" y1="1.27" x2="0.635" y2="1.27" width="0.254" layer="94"/>
<wire x1="0" y1="1.27" x2="0" y2="0" width="0.1524" layer="94"/>
<text x="0" y="3.175" size="1.27" layer="96" ratio="12" align="bottom-center">&gt;VALUE</text>
</symbol>
<symbol name="__GENERIC_SYMBOL">
<text x="23.495" y="0.635" size="1.27" layer="96" ratio="12">&gt;MPN</text>
<text x="6.35" y="0.635" size="1.27" layer="95" ratio="12" align="bottom-right">&gt;NAME</text>
<text x="6.6675" y="0.635" size="1.27" layer="94">:</text>
<wire x1="0" y1="2.54" x2="0" y2="0" width="0.1524" layer="94"/>
<wire x1="0" y1="0" x2="48.26" y2="0" width="0.1524" layer="94"/>
<wire x1="48.26" y1="0" x2="48.26" y2="2.54" width="0.1524" layer="94"/>
<wire x1="0" y1="2.54" x2="48.26" y2="2.54" width="0.1524" layer="94"/>
<text x="8.255" y="0.635" size="1.27" layer="94" ratio="12">&gt;MANUFACTURER</text>
</symbol>
<symbol name="SHIELD_BAR">
<wire x1="-1.905" y1="-1.27" x2="-1.27" y2="-1.27" width="0.254" layer="94"/>
<wire x1="-1.27" y1="-1.27" x2="-0.635" y2="-1.27" width="0.254" layer="94"/>
<wire x1="-0.635" y1="-1.27" x2="0" y2="-1.27" width="0.254" layer="94"/>
<wire x1="0" y1="-1.27" x2="0.635" y2="-1.27" width="0.254" layer="94"/>
<pin name="SHIELD" x="0" y="0" visible="off" length="point" direction="sup" rot="R270"/>
<text x="0" y="-4.445" size="1.27" layer="96" ratio="12" align="bottom-center">&gt;VALUE</text>
<wire x1="0.635" y1="-1.27" x2="1.27" y2="-1.27" width="0.254" layer="94"/>
<wire x1="1.27" y1="-1.27" x2="1.905" y2="-1.27" width="0.254" layer="94"/>
<wire x1="0" y1="0" x2="0" y2="-1.27" width="0.1524" layer="94"/>
<wire x1="-1.905" y1="-1.27" x2="-2.54" y2="-2.54" width="0.1524" layer="94"/>
<wire x1="1.905" y1="-1.27" x2="1.27" y2="-2.54" width="0.1524" layer="94"/>
<wire x1="0" y1="-1.27" x2="-0.635" y2="-2.54" width="0.1524" layer="94"/>
</symbol>
<symbol name="+3V3_ARROW">
<wire x1="0.635" y1="1.27" x2="0" y2="2.54" width="0.254" layer="94"/>
<wire x1="0" y1="2.54" x2="-0.635" y2="1.27" width="0.254" layer="94"/>
<pin name="+3V3" x="0" y="0" visible="off" length="point" direction="sup" rot="R90"/>
<wire x1="-0.635" y1="1.27" x2="0" y2="1.27" width="0.254" layer="94"/>
<wire x1="0" y1="1.27" x2="0.635" y2="1.27" width="0.254" layer="94"/>
<wire x1="0" y1="1.27" x2="0" y2="0" width="0.1524" layer="94"/>
<text x="0" y="3.175" size="1.27" layer="96" ratio="12" align="bottom-center">&gt;VALUE</text>
</symbol>
<symbol name="+3V3A_CIRCLE">
<circle x="0" y="1.905" radius="0.635" width="0.254" layer="94"/>
<pin name="+3V3A" x="0" y="0" visible="off" length="point" direction="sup" rot="R90"/>
<wire x1="0" y1="1.27" x2="0" y2="0" width="0.1524" layer="94"/>
<text x="0" y="3.175" size="1.27" layer="96" ratio="12" align="bottom-center">&gt;VALUE</text>
</symbol>
</symbols>
<devicesets>
<deviceset name="+3V3A_ARROW" prefix="SUPPLY">
<description>Analog +3.3V, Arrow</description>
<gates>
<gate name="G$1" symbol="+3V3A_ARROW" x="0" y="0"/>
</gates>
<devices>
<device name="">
<technologies>
<technology name="">
<attribute name="VALUE" value="+3V3A" constant="no"/>
<attribute name="_EXTERNAL_" value="" constant="no"/>
</technology>
</technologies>
</device>
</devices>
</deviceset>
<deviceset name="GND_BAR" prefix="SUPPLY">
<description>GND, Bar</description>
<gates>
<gate name="G$1" symbol="GND_BAR" x="0" y="0"/>
</gates>
<devices>
<device name="">
<technologies>
<technology name="">
<attribute name="VALUE" value="GND" constant="no"/>
</technology>
</technologies>
</device>
</devices>
</deviceset>
<deviceset name="SHIELD" prefix="SUPPLY">
<description>Shield</description>
<gates>
<gate name="G$1" symbol="SHIELD_BAR" x="0" y="0"/>
</gates>
<devices>
<device name="">
<technologies>
<technology name="">
<attribute name="VALUE" value="" constant="no"/>
</technology>
</technologies>
</device>
</devices>
</deviceset>
<deviceset name="+3V3A_CIRCLE" prefix="SUPPLY">
<description>Analog +3.3V, Circle</description>
<gates>
<gate name="G$1" symbol="+3V3A_CIRCLE" x="0" y="0"/>
</gates>
<devices>
<device name="">
<technologies>
<technology name="">
<attribute name="VALUE" value="+3V3A" constant="no"/>
<attribute name="_EXTERNAL_" value="" constant="no"/>
</technology>
</technologies>
</device>
</devices>
</deviceset>
<deviceset name="+VDDA_ARROW" prefix="SUPPLY">
<description>+VDDA, Arrow</description>
<gates>
<gate name="G$1" symbol="+VDDA_ARROW" x="0" y="0"/>
</gates>
<devices>
<device name="">
<technologies>
<technology name="">
<attribute name="VALUE" value="+VDDA" constant="no"/>
</technology>
</technologies>
</device>
</devices>
</deviceset>
<deviceset name="+VDDA_CIRCLE" prefix="SUPPLY">
<description>+VDDA, Circle</description>
<gates>
<gate name="G$1" symbol="+VDDA_CIRCLE" x="0" y="0"/>
</gates>
<devices>
<device name="">
<technologies>
<technology name="">
<attribute name="VALUE" value="+VDDA" constant="no"/>
</technology>
</technologies>
</device>
</devices>
</deviceset>
<deviceset name="GNDA_BAR" prefix="SUPPLY">
<description>GNDA, Bar</description>
<gates>
<gate name="G$1" symbol="GNDA_BAR" x="0" y="0"/>
</gates>
<devices>
<device name="">
<technologies>
<technology name="">
<attribute name="VALUE" value="GNDA" constant="no"/>
</technology>
</technologies>
</device>
</devices>
</deviceset>
<deviceset name="+VCORE_ARROW" prefix="SUPPLY">
<description>+VCore, Arrow</description>
<gates>
<gate name="G$1" symbol="+VCORE_ARROW" x="0" y="0"/>
</gates>
<devices>
<device name="">
<technologies>
<technology name="">
<attribute name="VALUE" value="+VCORE" constant="no"/>
<attribute name="_EXTERNAL_" value="" constant="no"/>
</technology>
</technologies>
</device>
</devices>
</deviceset>
<deviceset name="+VCORE_CIRCLE" prefix="SUPPLY">
<description>+VCore, Circle</description>
<gates>
<gate name="G$1" symbol="+VCORE_CIRCLE" x="0" y="0"/>
</gates>
<devices>
<device name="">
<technologies>
<technology name="">
<attribute name="VALUE" value="+VCORE" constant="no"/>
<attribute name="_EXTERNAL_" value="" constant="no"/>
</technology>
</technologies>
</device>
</devices>
</deviceset>
<deviceset name="+5V_ARROW" prefix="SUPPLY">
<description>+5V, Arrow</description>
<gates>
<gate name="G$1" symbol="+5V0_ARROW" x="0" y="0"/>
</gates>
<devices>
<device name="">
<technologies>
<technology name="">
<attribute name="VALUE" value="+5V" constant="no"/>
<attribute name="_EXTERNAL_" value="" constant="no"/>
</technology>
</technologies>
</device>
</devices>
</deviceset>
<deviceset name="+5V_CIRCLE" prefix="SUPPLY">
<description>+5V, Circle</description>
<gates>
<gate name="G$1" symbol="+5V0_CIRCLE" x="0" y="0"/>
</gates>
<devices>
<device name="">
<technologies>
<technology name="">
<attribute name="VALUE" value="+5V" constant="no"/>
<attribute name="_EXTERNAL_" value="" constant="no"/>
</technology>
</technologies>
</device>
</devices>
</deviceset>
<deviceset name="+VDDE_ARROW" prefix="SUPPLY">
<description>+VDDE, Arrow</description>
<gates>
<gate name="G$1" symbol="+VDDE_ARROW" x="0" y="0"/>
</gates>
<devices>
<device name="">
<technologies>
<technology name="">
<attribute name="VALUE" value="+VDDE" constant="no"/>
<attribute name="_EXTERNAL_" value="" constant="no"/>
</technology>
</technologies>
</device>
</devices>
</deviceset>
<deviceset name="+VDDE_CIRCLE" prefix="SUPPLY">
<description>+VDDE, Circle</description>
<gates>
<gate name="G$1" symbol="+VDDE_CIRCLE" x="0" y="0"/>
</gates>
<devices>
<device name="">
<technologies>
<technology name="">
<attribute name="VALUE" value="+VDDE" constant="no"/>
<attribute name="_EXTERNAL_" value="" constant="no"/>
</technology>
</technologies>
</device>
</devices>
</deviceset>
<deviceset name="GNDE_BAR" prefix="SUPPLY">
<description>GNDE, Bar</description>
<gates>
<gate name="G$1" symbol="GNDE_BAR" x="0" y="0"/>
</gates>
<devices>
<device name="">
<technologies>
<technology name="">
<attribute name="VALUE" value="GNDE" constant="no"/>
</technology>
</technologies>
</device>
</devices>
</deviceset>
<deviceset name="+24V_ARROW" prefix="SUPPLY">
<description>+24V, Arrow</description>
<gates>
<gate name="G$1" symbol="+24V_ARROW" x="0" y="0"/>
</gates>
<devices>
<device name="">
<technologies>
<technology name="">
<attribute name="VALUE" value="+24V" constant="no"/>
<attribute name="_EXTERNAL_" value="" constant="no"/>
</technology>
</technologies>
</device>
</devices>
</deviceset>
<deviceset name="+24V_CIRCLE" prefix="SUPPLY">
<description>+24V, Circle</description>
<gates>
<gate name="G$1" symbol="+24V_CIRCLE" x="0" y="0"/>
</gates>
<devices>
<device name="">
<technologies>
<technology name="">
<attribute name="VALUE" value="+24V" constant="no"/>
<attribute name="_EXTERNAL_" value="" constant="no"/>
</technology>
</technologies>
</device>
</devices>
</deviceset>
<deviceset name="+VIN_CIRCLE" prefix="SUPPLY">
<description>+VIN, Circle</description>
<gates>
<gate name="G$1" symbol="+VIN_CIRCLE" x="0" y="0"/>
</gates>
<devices>
<device name="">
<technologies>
<technology name="">
<attribute name="VALUE" value="+VIN" constant="no"/>
<attribute name="_EXTERNAL_" value="" constant="no"/>
</technology>
</technologies>
</device>
</devices>
</deviceset>
<deviceset name="+VIN_ARROW" prefix="SUPPLY">
<description>+24V, Arrow</description>
<gates>
<gate name="G$1" symbol="+24V_ARROW" x="0" y="0"/>
</gates>
<devices>
<device name="">
<technologies>
<technology name="">
<attribute name="VALUE" value="+24V" constant="no"/>
<attribute name="_EXTERNAL_" value="" constant="no"/>
</technology>
</technologies>
</device>
</devices>
</deviceset>
<deviceset name="+15V_ARROW" prefix="SUPPLY">
<description>+15V, Arrow</description>
<gates>
<gate name="G$1" symbol="+15V_ARROW" x="0" y="0"/>
</gates>
<devices>
<device name="">
<technologies>
<technology name="">
<attribute name="VALUE" value="+15V" constant="no"/>
<attribute name="_EXTERNAL_" value="" constant="no"/>
</technology>
</technologies>
</device>
</devices>
</deviceset>
<deviceset name="+15V_CIRCLE" prefix="SUPPLY">
<description>+15V, Circle</description>
<gates>
<gate name="G$1" symbol="+15V_CIRCLE" x="0" y="0"/>
</gates>
<devices>
<device name="">
<technologies>
<technology name="">
<attribute name="VALUE" value="+15V" constant="no"/>
<attribute name="_EXTERNAL_" value="" constant="no"/>
</technology>
</technologies>
</device>
</devices>
</deviceset>
<deviceset name="__GENERIC_DEVICE" prefix="MP" uservalue="yes">
<description>Symbol for mechanical parts and components, not directly mounted on PCB, or not electrically connected.</description>
<gates>
<gate name="G$1" symbol="__GENERIC_SYMBOL" x="10.16" y="0"/>
</gates>
<devices>
<device name="">
<technologies>
<technology name="">
<attribute name="ASSEMBLY_NOTE" value="" constant="no"/>
<attribute name="COMMENT" value="" constant="no"/>
<attribute name="MANUFACTURER" value="" constant="no"/>
<attribute name="MPN" value="" constant="no"/>
<attribute name="OC_DISTRELEC" value="" constant="no"/>
<attribute name="OC_FARNELL" value="" constant="no"/>
<attribute name="OC_MOUSER" value="" constant="no"/>
<attribute name="OC_RS" value="" constant="no"/>
<attribute name="OC_SOS" value="" constant="no"/>
<attribute name="OC_TME" value="" constant="no"/>
<attribute name="VALUE" value="" constant="no"/>
<attribute name="_EXTERNAL_" value="" constant="no"/>
</technology>
</technologies>
</device>
</devices>
</deviceset>
<deviceset name="PE_GROUND" prefix="SUPPLY">
<description>Pe, Ground</description>
<gates>
<gate name="M" symbol="GROUND" x="0" y="0"/>
</gates>
<devices>
<device name="">
<technologies>
<technology name="">
<attribute name="VALUE" value="Pe" constant="no"/>
</technology>
</technologies>
</device>
</devices>
</deviceset>
<deviceset name="+3V3_ARROW" prefix="SUPPLY">
<description>+3.3V, Arrow</description>
<gates>
<gate name="G$1" symbol="+3V3_ARROW" x="0" y="0"/>
</gates>
<devices>
<device name="">
<technologies>
<technology name="">
<attribute name="VALUE" value="+3V3" constant="no"/>
<attribute name="_EXTERNAL_" value="" constant="no"/>
</technology>
</technologies>
</device>
</devices>
</deviceset>
<deviceset name="+3V3_CIRCLE" prefix="SUPPLY">
<description>+3.3V, Circle</description>
<gates>
<gate name="G$1" symbol="+3V3_CIRCLE" x="0" y="0"/>
</gates>
<devices>
<device name="">
<technologies>
<technology name="">
<attribute name="VALUE" value="+3V3" constant="no"/>
<attribute name="_EXTERNAL_" value="" constant="no"/>
</technology>
</technologies>
</device>
</devices>
</deviceset>
</devicesets>
</library>
</drawing>
</eagle>
