<?xml version="1.0" encoding="utf-8"?>
<!DOCTYPE eagle SYSTEM "eagle.dtd">
<eagle version="6.4">
<drawing>
<settings>
<setting alwaysvectorfont="no"/>
<setting verticaltext="up"/>
</settings>
<grid distance="0.635" unitdist="mm" unit="mm" style="lines" multiple="4" display="yes" altdistance="0.3175" altunitdist="mm" altunit="mm"/>
<layers>
<layer number="1" name="Top" color="4" fill="1" visible="yes" active="yes"/>
<layer number="16" name="Bottom" color="1" fill="1" visible="yes" active="yes"/>
<layer number="17" name="Pads" color="5" fill="1" visible="yes" active="yes"/>
<layer number="18" name="Vias" color="8" fill="1" visible="yes" active="yes"/>
<layer number="19" name="Unrouted" color="15" fill="1" visible="yes" active="yes"/>
<layer number="20" name="Dimension" color="15" fill="1" visible="yes" active="yes"/>
<layer number="21" name="tPlace" color="14" fill="1" visible="yes" active="yes"/>
<layer number="22" name="bPlace" color="6" fill="1" visible="yes" active="yes"/>
<layer number="23" name="tOrigins" color="7" fill="1" visible="yes" active="yes"/>
<layer number="24" name="bOrigins" color="7" fill="1" visible="yes" active="yes"/>
<layer number="25" name="tNames" color="14" fill="1" visible="yes" active="yes"/>
<layer number="26" name="bNames" color="6" fill="1" visible="yes" active="yes"/>
<layer number="27" name="tValues" color="14" fill="1" visible="yes" active="yes"/>
<layer number="28" name="bValues" color="6" fill="1" visible="yes" active="yes"/>
<layer number="29" name="tStop" color="13" fill="3" visible="yes" active="yes"/>
<layer number="30" name="bStop" color="5" fill="6" visible="yes" active="yes"/>
<layer number="31" name="tCream" color="7" fill="4" visible="yes" active="yes"/>
<layer number="32" name="bCream" color="7" fill="5" visible="yes" active="yes"/>
<layer number="33" name="tFinish" color="6" fill="3" visible="yes" active="yes"/>
<layer number="34" name="bFinish" color="6" fill="6" visible="yes" active="yes"/>
<layer number="35" name="tGlue" color="7" fill="4" visible="yes" active="yes"/>
<layer number="36" name="bGlue" color="7" fill="5" visible="yes" active="yes"/>
<layer number="37" name="tTest" color="7" fill="1" visible="yes" active="yes"/>
<layer number="38" name="bTest" color="7" fill="1" visible="yes" active="yes"/>
<layer number="39" name="tKeepout" color="4" fill="11" visible="yes" active="yes"/>
<layer number="40" name="bKeepout" color="1" fill="11" visible="yes" active="yes"/>
<layer number="41" name="tRestrict" color="4" fill="10" visible="yes" active="yes"/>
<layer number="42" name="bRestrict" color="1" fill="10" visible="yes" active="yes"/>
<layer number="43" name="vRestrict" color="2" fill="10" visible="yes" active="yes"/>
<layer number="44" name="Drills" color="7" fill="1" visible="yes" active="yes"/>
<layer number="45" name="Holes" color="7" fill="1" visible="yes" active="yes"/>
<layer number="46" name="Milling" color="3" fill="1" visible="yes" active="yes"/>
<layer number="47" name="Measures" color="7" fill="1" visible="yes" active="yes"/>
<layer number="48" name="Document" color="7" fill="1" visible="yes" active="yes"/>
<layer number="49" name="Reference" color="7" fill="1" visible="yes" active="yes"/>
<layer number="51" name="tDocu" color="11" fill="1" visible="yes" active="yes"/>
<layer number="52" name="bDocu" color="3" fill="1" visible="yes" active="yes"/>
<layer number="91" name="Nets" color="1" fill="1" visible="yes" active="yes"/>
<layer number="92" name="Busses" color="1" fill="1" visible="yes" active="yes"/>
<layer number="93" name="Pins" color="2" fill="1" visible="yes" active="yes"/>
<layer number="94" name="Symbols" color="4" fill="1" visible="yes" active="yes"/>
<layer number="95" name="Names" color="12" fill="1" visible="yes" active="yes"/>
<layer number="96" name="Values" color="15" fill="1" visible="yes" active="yes"/>
<layer number="97" name="Info" color="5" fill="1" visible="yes" active="yes"/>
<layer number="98" name="Guide" color="3" fill="1" visible="yes" active="yes"/>
</layers>
<library>
<packages>
<package name="SOP127P1212X284-28N">
<description>EIA: -, JEDEC: SOP-28 , JEITA: - , IPC: SOP127P1212x284-28N&lt;br&gt;Based on: &lt;a href=http://docs-europe.electrocomponents.com/webdocs/0a59/0900766b80a598b7.pdf&gt;Memory datasheet&lt;/a&gt;, and &lt;a href=http://kazus.ru/nuke/modules/Downloads/pub/147/0/IPC-SM-782A%20SMD%20Land%20Patterns.pdf&gt;IPC-SM-782A footprint reccomandations&lt;/a&gt; - for REFLOW Soldering</description>
<wire x1="-4.265" y1="-9.12" x2="4.265" y2="-9.12" width="0.2032" layer="51"/>
<wire x1="4.265" y1="-9.12" x2="4.265" y2="9.12" width="0.2032" layer="51"/>
<wire x1="4.265" y1="9.12" x2="-4.265" y2="9.12" width="0.2032" layer="51"/>
<wire x1="-4.265" y1="9.12" x2="-4.265" y2="-9.12" width="0.2032" layer="51"/>
<circle x="-3.5" y="7.595" radius="0.5" width="0.2032" layer="51"/>
<rectangle x1="-6.06" y1="0.385" x2="-4.265" y2="0.885" layer="51"/>
<text x="-3.175" y="9.525" size="1.27" layer="25">&gt;NAME</text>
<text x="-1.27" y="-7.62" size="1.27" layer="27" rot="R90">&gt;VALUE</text>
<wire x1="6.985" y1="9.525" x2="-6.985" y2="9.525" width="0.2032" layer="39"/>
<wire x1="6.985" y1="9.525" x2="6.985" y2="-9.525" width="0.2032" layer="39"/>
<wire x1="-6.985" y1="-9.525" x2="-6.985" y2="9.525" width="0.2032" layer="39"/>
<wire x1="-6.985" y1="-9.525" x2="6.985" y2="-9.525" width="0.2032" layer="39"/>
<circle x="-6.35" y="9.525" radius="0.5" width="0" layer="21"/>
<circle x="0" y="8.89" radius="0.3175" width="0.2032" layer="35"/>
<circle x="0" y="-8.89" radius="0.3175" width="0.2032" layer="35"/>
<wire x1="-4.1275" y1="9.12" x2="-4.1275" y2="-9.12" width="0.2032" layer="21"/>
<wire x1="-4.1275" y1="-9.12" x2="4.1275" y2="-9.12" width="0.2032" layer="21"/>
<wire x1="4.1275" y1="-9.12" x2="4.1275" y2="9.12" width="0.2032" layer="21"/>
<wire x1="4.1275" y1="9.12" x2="-4.1275" y2="9.12" width="0.2032" layer="21"/>
<smd name="7" x="-5.5" y="0.635" dx="2.2" dy="0.6" layer="1" roundness="100"/>
<smd name="8" x="-5.5" y="-0.635" dx="2.2" dy="0.6" layer="1" roundness="100"/>
<rectangle x1="-6.06" y1="-0.885" x2="-4.265" y2="-0.385" layer="51"/>
<rectangle x1="-6.06" y1="-2.155" x2="-4.265" y2="-1.655" layer="51"/>
<rectangle x1="-6.06" y1="-3.425" x2="-4.265" y2="-2.925" layer="51"/>
<rectangle x1="-6.06" y1="-4.695" x2="-4.265" y2="-4.195" layer="51"/>
<rectangle x1="-6.06" y1="-5.965" x2="-4.265" y2="-5.465" layer="51"/>
<rectangle x1="-6.06" y1="-7.235" x2="-4.265" y2="-6.735" layer="51"/>
<rectangle x1="-6.06" y1="-8.505" x2="-4.265" y2="-8.005" layer="51"/>
<rectangle x1="-6.06" y1="1.655" x2="-4.265" y2="2.155" layer="51"/>
<rectangle x1="-6.06" y1="2.925" x2="-4.265" y2="3.425" layer="51"/>
<rectangle x1="-6.06" y1="4.195" x2="-4.265" y2="4.695" layer="51"/>
<rectangle x1="-6.06" y1="5.465" x2="-4.265" y2="5.965" layer="51"/>
<rectangle x1="-6.06" y1="6.735" x2="-4.265" y2="7.235" layer="51"/>
<rectangle x1="-6.06" y1="8.005" x2="-4.265" y2="8.505" layer="51"/>
<rectangle x1="4.265" y1="-8.505" x2="6.06" y2="-8.005" layer="51" rot="R180"/>
<rectangle x1="4.265" y1="-7.235" x2="6.06" y2="-6.735" layer="51" rot="R180"/>
<rectangle x1="4.265" y1="-5.965" x2="6.06" y2="-5.465" layer="51" rot="R180"/>
<rectangle x1="4.265" y1="-4.695" x2="6.06" y2="-4.195" layer="51" rot="R180"/>
<rectangle x1="4.265" y1="-3.425" x2="6.06" y2="-2.925" layer="51" rot="R180"/>
<rectangle x1="4.265" y1="-2.155" x2="6.06" y2="-1.655" layer="51" rot="R180"/>
<rectangle x1="4.265" y1="-0.885" x2="6.06" y2="-0.385" layer="51" rot="R180"/>
<rectangle x1="4.265" y1="0.385" x2="6.06" y2="0.885" layer="51" rot="R180"/>
<rectangle x1="4.265" y1="1.655" x2="6.06" y2="2.155" layer="51" rot="R180"/>
<rectangle x1="4.265" y1="2.925" x2="6.06" y2="3.425" layer="51" rot="R180"/>
<rectangle x1="4.265" y1="4.195" x2="6.06" y2="4.695" layer="51" rot="R180"/>
<rectangle x1="4.265" y1="5.465" x2="6.06" y2="5.965" layer="51" rot="R180"/>
<rectangle x1="4.265" y1="6.735" x2="6.06" y2="7.235" layer="51" rot="R180"/>
<rectangle x1="4.265" y1="8.005" x2="6.06" y2="8.505" layer="51" rot="R180"/>
<smd name="1" x="-5.5" y="8.255" dx="2.2" dy="0.6" layer="1" roundness="100"/>
<smd name="2" x="-5.5" y="6.985" dx="2.2" dy="0.6" layer="1" roundness="100"/>
<smd name="3" x="-5.5" y="5.715" dx="2.2" dy="0.6" layer="1" roundness="100"/>
<smd name="4" x="-5.5" y="4.445" dx="2.2" dy="0.6" layer="1" roundness="100"/>
<smd name="5" x="-5.5" y="3.175" dx="2.2" dy="0.6" layer="1" roundness="100"/>
<smd name="6" x="-5.5" y="1.905" dx="2.2" dy="0.6" layer="1" roundness="100"/>
<smd name="9" x="-5.5" y="-1.905" dx="2.2" dy="0.6" layer="1" roundness="100"/>
<smd name="10" x="-5.5" y="-3.175" dx="2.2" dy="0.6" layer="1" roundness="100"/>
<smd name="11" x="-5.5" y="-4.445" dx="2.2" dy="0.6" layer="1" roundness="100"/>
<smd name="12" x="-5.5" y="-5.715" dx="2.2" dy="0.6" layer="1" roundness="100"/>
<smd name="13" x="-5.5" y="-6.985" dx="2.2" dy="0.6" layer="1" roundness="100"/>
<smd name="14" x="-5.5" y="-8.255" dx="2.2" dy="0.6" layer="1" roundness="100"/>
<smd name="15" x="5.5" y="-8.255" dx="2.2" dy="0.6" layer="1" roundness="100" rot="R180"/>
<smd name="16" x="5.5" y="-6.985" dx="2.2" dy="0.6" layer="1" roundness="100" rot="R180"/>
<smd name="17" x="5.5" y="-5.715" dx="2.2" dy="0.6" layer="1" roundness="100" rot="R180"/>
<smd name="18" x="5.5" y="-4.445" dx="2.2" dy="0.6" layer="1" roundness="100" rot="R180"/>
<smd name="19" x="5.5" y="-3.175" dx="2.2" dy="0.6" layer="1" roundness="100" rot="R180"/>
<smd name="20" x="5.5" y="-1.905" dx="2.2" dy="0.6" layer="1" roundness="100" rot="R180"/>
<smd name="21" x="5.5" y="-0.635" dx="2.2" dy="0.6" layer="1" roundness="100" rot="R180"/>
<smd name="22" x="5.5" y="0.635" dx="2.2" dy="0.6" layer="1" roundness="100" rot="R180"/>
<smd name="23" x="5.5" y="1.905" dx="2.2" dy="0.6" layer="1" roundness="100" rot="R180"/>
<smd name="24" x="5.5" y="3.175" dx="2.2" dy="0.6" layer="1" roundness="100" rot="R180"/>
<smd name="25" x="5.5" y="4.445" dx="2.2" dy="0.6" layer="1" roundness="100" rot="R180"/>
<smd name="26" x="5.5" y="5.715" dx="2.2" dy="0.6" layer="1" roundness="100" rot="R180"/>
<smd name="27" x="5.5" y="6.985" dx="2.2" dy="0.6" layer="1" roundness="100" rot="R180"/>
<smd name="28" x="5.5" y="8.255" dx="2.2" dy="0.6" layer="1" roundness="100" rot="R180"/>
</package>
</packages>
<symbols>
<symbol name="SRAM_A14,D7">
<description>32K x 8 bit Static RAM (SRAM), ex.: &lt;a href=http://issi.com/WW/pdf/62-65LV256AL.pdf&gt;IS62LV256AL&lt;/a&gt;</description>
<pin name="A0" x="-20.32" y="22.86" length="middle" direction="in"/>
<pin name="A1" x="-20.32" y="20.32" length="middle" direction="in"/>
<pin name="A2" x="-20.32" y="17.78" length="middle" direction="in"/>
<pin name="A3" x="-20.32" y="15.24" length="middle" direction="in"/>
<pin name="A4" x="-20.32" y="12.7" length="middle" direction="in"/>
<pin name="A5" x="-20.32" y="10.16" length="middle" direction="in"/>
<pin name="A6" x="-20.32" y="7.62" length="middle" direction="in"/>
<pin name="A7" x="-20.32" y="5.08" length="middle" direction="in"/>
<pin name="A8" x="-20.32" y="2.54" length="middle" direction="in"/>
<pin name="A9" x="-20.32" y="0" length="middle" direction="in"/>
<pin name="A10" x="-20.32" y="-2.54" length="middle" direction="in"/>
<pin name="A11" x="-20.32" y="-5.08" length="middle" direction="in"/>
<pin name="A12" x="-20.32" y="-7.62" length="middle" direction="in"/>
<pin name="A13" x="-20.32" y="-10.16" length="middle" direction="in"/>
<pin name="!CS!" x="-20.32" y="-17.78" length="middle" direction="in"/>
<pin name="!OE!" x="-20.32" y="-20.32" length="middle" direction="in"/>
<pin name="!WE!" x="-20.32" y="-22.86" length="middle" direction="in"/>
<pin name="A14" x="-20.32" y="-12.7" length="middle" direction="in"/>
<pin name="DQ0" x="20.32" y="22.86" length="middle" rot="R180"/>
<pin name="DQ1" x="20.32" y="20.32" length="middle" rot="R180"/>
<pin name="DQ2" x="20.32" y="17.78" length="middle" rot="R180"/>
<pin name="DQ3" x="20.32" y="15.24" length="middle" rot="R180"/>
<pin name="DQ4" x="20.32" y="12.7" length="middle" rot="R180"/>
<pin name="DQ5" x="20.32" y="10.16" length="middle" rot="R180"/>
<pin name="DQ6" x="20.32" y="7.62" length="middle" rot="R180"/>
<pin name="DQ7" x="20.32" y="5.08" length="middle" rot="R180"/>
<pin name="VSS@1" x="20.32" y="-22.86" length="middle" direction="pwr" rot="R180"/>
<pin name="VDD@1" x="20.32" y="-12.7" length="middle" direction="pwr" rot="R180"/>
<wire x1="-15.24" y1="25.4" x2="15.24" y2="25.4" width="0.1524" layer="94"/>
<wire x1="15.24" y1="25.4" x2="15.24" y2="-25.4" width="0.1524" layer="94"/>
<wire x1="15.24" y1="-25.4" x2="-15.24" y2="-25.4" width="0.1524" layer="94"/>
<wire x1="-15.24" y1="-25.4" x2="-15.24" y2="25.4" width="0.1524" layer="94"/>
<text x="-15.24" y="26.035" size="1.27" layer="95">&gt;NAME</text>
<text x="-15.24" y="-27.305" size="1.27" layer="96">&gt;VALUE</text>
</symbol>
</symbols>
<devicesets>
<deviceset name="ISSI-IS62LV256AL-*?_" prefix="IC">
<description>32Kx8 32K Static RAM, 25/45ns, 3V, SMD, ISSI&lt;br&gt;&lt;a href=http://www.farnell.com/datasheets/1275293.pdf&gt;Datasheet&lt;/a&gt; &lt;img src=http://sk.mouser.com/images/integratedsiliconsolutioninc/images/SOP-24.JPG width=80&gt;</description>
<gates>
<gate name="G$1" symbol="SRAM_A14,D7" x="0" y="0"/>
</gates>
<devices>
<device name="U" package="SOP127P1212X284-28N">
<connects>
<connect gate="G$1" pin="!CS!" pad="20"/>
<connect gate="G$1" pin="!OE!" pad="22"/>
<connect gate="G$1" pin="!WE!" pad="27"/>
<connect gate="G$1" pin="A0" pad="10"/>
<connect gate="G$1" pin="A1" pad="9"/>
<connect gate="G$1" pin="A10" pad="21"/>
<connect gate="G$1" pin="A11" pad="23"/>
<connect gate="G$1" pin="A12" pad="2"/>
<connect gate="G$1" pin="A13" pad="26"/>
<connect gate="G$1" pin="A14" pad="1"/>
<connect gate="G$1" pin="A2" pad="8"/>
<connect gate="G$1" pin="A3" pad="7"/>
<connect gate="G$1" pin="A4" pad="6"/>
<connect gate="G$1" pin="A5" pad="5"/>
<connect gate="G$1" pin="A6" pad="4"/>
<connect gate="G$1" pin="A7" pad="3"/>
<connect gate="G$1" pin="A8" pad="25"/>
<connect gate="G$1" pin="A9" pad="24"/>
<connect gate="G$1" pin="DQ0" pad="11"/>
<connect gate="G$1" pin="DQ1" pad="12"/>
<connect gate="G$1" pin="DQ2" pad="13"/>
<connect gate="G$1" pin="DQ3" pad="15"/>
<connect gate="G$1" pin="DQ4" pad="16"/>
<connect gate="G$1" pin="DQ5" pad="17"/>
<connect gate="G$1" pin="DQ6" pad="18"/>
<connect gate="G$1" pin="DQ7" pad="19"/>
<connect gate="G$1" pin="VDD@1" pad="28"/>
<connect gate="G$1" pin="VSS@1" pad="14"/>
</connects>
<technologies>
<technology name="25">
<attribute name="ASSEMBLY_NOTE" value="" constant="no"/>
<attribute name="COMMENT" value="" constant="no"/>
<attribute name="MANUFACTURER" value="ISSI" constant="no"/>
<attribute name="MPN" value="" constant="no"/>
<attribute name="OC_DISTRELEC" value="" constant="no"/>
<attribute name="OC_FARNELL" value="" constant="no"/>
<attribute name="OC_MOUSER" value="" constant="no"/>
<attribute name="OC_RS" value="" constant="no"/>
<attribute name="OC_SOS" value="" constant="no"/>
<attribute name="OC_TME" value="" constant="no"/>
<attribute name="VALUE" value="" constant="no"/>
</technology>
<technology name="45">
<attribute name="ASSEMBLY_NOTE" value="" constant="no"/>
<attribute name="COMMENT" value="" constant="no"/>
<attribute name="MANUFACTURER" value="ISSI" constant="no"/>
<attribute name="MPN" value="IS62LV256AL-45ULI" constant="no"/>
<attribute name="OC_DISTRELEC" value="" constant="no"/>
<attribute name="OC_FARNELL" value="" constant="no"/>
<attribute name="OC_MOUSER" value="870-IS62LV256AL45ULI" constant="no"/>
<attribute name="OC_RS" value="391-640" constant="no"/>
<attribute name="OC_SOS" value="W034539" constant="no"/>
<attribute name="OC_TME" value="IS62LV256AL45UL " constant="no"/>
<attribute name="VALUE" value="" constant="no"/>
</technology>
</technologies>
</device>
</devices>
</deviceset>
</devicesets>
</library>
</drawing>
</eagle>
