<?xml version="1.0" encoding="utf-8"?>
<!DOCTYPE eagle SYSTEM "eagle.dtd">
<eagle version="6.4">
<drawing>
<settings>
<setting alwaysvectorfont="no"/>
<setting verticaltext="up"/>
</settings>
<grid distance="0.635" unitdist="mm" unit="mm" style="dots" multiple="4" display="yes" altdistance="0.3175" altunitdist="mm" altunit="mm"/>
<layers>
<layer number="1" name="Top" color="4" fill="1" visible="yes" active="yes"/>
<layer number="16" name="Bottom" color="1" fill="1" visible="yes" active="yes"/>
<layer number="17" name="Pads" color="5" fill="1" visible="yes" active="yes"/>
<layer number="18" name="Vias" color="8" fill="1" visible="yes" active="yes"/>
<layer number="19" name="Unrouted" color="15" fill="1" visible="yes" active="yes"/>
<layer number="20" name="Dimension" color="15" fill="1" visible="yes" active="yes"/>
<layer number="21" name="tPlace" color="14" fill="1" visible="yes" active="yes"/>
<layer number="22" name="bPlace" color="6" fill="1" visible="yes" active="yes"/>
<layer number="23" name="tOrigins" color="7" fill="1" visible="yes" active="yes"/>
<layer number="24" name="bOrigins" color="7" fill="1" visible="yes" active="yes"/>
<layer number="25" name="tNames" color="14" fill="1" visible="yes" active="yes"/>
<layer number="26" name="bNames" color="6" fill="1" visible="yes" active="yes"/>
<layer number="27" name="tValues" color="14" fill="1" visible="yes" active="yes"/>
<layer number="28" name="bValues" color="6" fill="1" visible="yes" active="yes"/>
<layer number="29" name="tStop" color="13" fill="3" visible="yes" active="yes"/>
<layer number="30" name="bStop" color="5" fill="6" visible="yes" active="yes"/>
<layer number="31" name="tCream" color="7" fill="4" visible="yes" active="yes"/>
<layer number="32" name="bCream" color="7" fill="5" visible="yes" active="yes"/>
<layer number="33" name="tFinish" color="6" fill="3" visible="yes" active="yes"/>
<layer number="34" name="bFinish" color="6" fill="6" visible="yes" active="yes"/>
<layer number="35" name="tGlue" color="7" fill="4" visible="yes" active="yes"/>
<layer number="36" name="bGlue" color="7" fill="5" visible="yes" active="yes"/>
<layer number="37" name="tTest" color="7" fill="1" visible="yes" active="yes"/>
<layer number="38" name="bTest" color="7" fill="1" visible="yes" active="yes"/>
<layer number="39" name="tKeepout" color="4" fill="11" visible="yes" active="yes"/>
<layer number="40" name="bKeepout" color="1" fill="11" visible="yes" active="yes"/>
<layer number="41" name="tRestrict" color="4" fill="10" visible="yes" active="yes"/>
<layer number="42" name="bRestrict" color="1" fill="10" visible="yes" active="yes"/>
<layer number="43" name="vRestrict" color="2" fill="10" visible="yes" active="yes"/>
<layer number="44" name="Drills" color="7" fill="1" visible="yes" active="yes"/>
<layer number="45" name="Holes" color="7" fill="1" visible="yes" active="yes"/>
<layer number="46" name="Milling" color="3" fill="1" visible="yes" active="yes"/>
<layer number="47" name="Measures" color="7" fill="1" visible="yes" active="yes"/>
<layer number="48" name="Document" color="7" fill="1" visible="yes" active="yes"/>
<layer number="49" name="Reference" color="7" fill="1" visible="yes" active="yes"/>
<layer number="51" name="tDocu" color="11" fill="1" visible="yes" active="yes"/>
<layer number="52" name="bDocu" color="3" fill="1" visible="yes" active="yes"/>
<layer number="91" name="Nets" color="2" fill="1" visible="yes" active="yes"/>
<layer number="92" name="Busses" color="1" fill="1" visible="yes" active="yes"/>
<layer number="93" name="Pins" color="2" fill="1" visible="yes" active="yes"/>
<layer number="94" name="Symbols" color="4" fill="1" visible="yes" active="yes"/>
<layer number="95" name="Names" color="7" fill="1" visible="yes" active="yes"/>
<layer number="96" name="Values" color="7" fill="1" visible="yes" active="yes"/>
<layer number="97" name="Info" color="7" fill="1" visible="yes" active="yes"/>
<layer number="98" name="Guide" color="6" fill="1" visible="yes" active="yes"/>
</layers>
<library>
<packages>
<package name="HEADER-1X3-MALE-1MM">
<description>Pin Header, 1x3, RM 2.54</description>
<wire x1="-3.175" y1="1.27" x2="-1.905" y2="1.27" width="0.1524" layer="51"/>
<wire x1="-1.905" y1="1.27" x2="-1.27" y2="0.635" width="0.1524" layer="51"/>
<wire x1="-1.27" y1="0.635" x2="-0.635" y2="1.27" width="0.1524" layer="51"/>
<wire x1="-0.635" y1="1.27" x2="0.635" y2="1.27" width="0.1524" layer="51"/>
<wire x1="0.635" y1="1.27" x2="1.27" y2="0.635" width="0.1524" layer="51"/>
<wire x1="-3.175" y1="1.27" x2="-3.81" y2="0.635" width="0.1524" layer="51"/>
<wire x1="1.27" y1="0.635" x2="1.905" y2="1.27" width="0.1524" layer="51"/>
<wire x1="1.905" y1="1.27" x2="3.175" y2="1.27" width="0.1524" layer="51"/>
<wire x1="3.175" y1="1.27" x2="3.81" y2="0.635" width="0.1524" layer="51"/>
<wire x1="-1.27" y1="-0.635" x2="-1.905" y2="-1.27" width="0.1524" layer="51"/>
<wire x1="1.27" y1="-0.635" x2="0.635" y2="-1.27" width="0.1524" layer="51"/>
<wire x1="0.635" y1="-1.27" x2="-0.635" y2="-1.27" width="0.1524" layer="51"/>
<wire x1="-0.635" y1="-1.27" x2="-1.27" y2="-0.635" width="0.1524" layer="51"/>
<wire x1="-3.81" y1="0.635" x2="-3.81" y2="-0.635" width="0.1524" layer="51"/>
<wire x1="-3.81" y1="-0.635" x2="-3.175" y2="-1.27" width="0.1524" layer="51"/>
<wire x1="-1.905" y1="-1.27" x2="-3.175" y2="-1.27" width="0.1524" layer="51"/>
<wire x1="3.81" y1="-0.635" x2="3.175" y2="-1.27" width="0.1524" layer="51"/>
<wire x1="3.175" y1="-1.27" x2="1.905" y2="-1.27" width="0.1524" layer="51"/>
<wire x1="1.905" y1="-1.27" x2="1.27" y2="-0.635" width="0.1524" layer="51"/>
<wire x1="3.81" y1="0.635" x2="3.81" y2="-0.635" width="0.1524" layer="51"/>
<pad name="1" x="-2.54" y="0" drill="1.016" diameter="1.778" shape="square" first="yes"/>
<pad name="2" x="0" y="0" drill="1.016" diameter="1.778"/>
<pad name="3" x="2.54" y="0" drill="1.016" diameter="1.778"/>
<text x="-2.54" y="1.905" size="1.27" layer="25" ratio="10">&gt;NAME</text>
<text x="-2.54" y="-3.175" size="1.27" layer="27" ratio="10">&gt;VALUE</text>
<rectangle x1="-0.254" y1="-0.254" x2="0.254" y2="0.254" layer="51"/>
<rectangle x1="-2.794" y1="-0.254" x2="-2.286" y2="0.254" layer="51"/>
<rectangle x1="2.286" y1="-0.254" x2="2.794" y2="0.254" layer="51"/>
<circle x="-3.81" y="-1.905" radius="0.635" width="0" layer="21"/>
<wire x1="4.1275" y1="-1.5875" x2="4.1275" y2="1.5875" width="0.0508" layer="39"/>
<wire x1="4.1275" y1="1.5875" x2="-4.1275" y2="1.5875" width="0.0508" layer="39"/>
<wire x1="4.1275" y1="-1.5875" x2="-4.1275" y2="-1.5875" width="0.0508" layer="39"/>
<wire x1="-4.1275" y1="-1.5875" x2="-4.1275" y2="1.5875" width="0.0508" layer="39"/>
<wire x1="-3.81" y1="-1.27" x2="3.81" y2="-1.27" width="0.2032" layer="21"/>
<wire x1="3.81" y1="-1.27" x2="3.81" y2="1.27" width="0.2032" layer="21"/>
<wire x1="3.81" y1="1.27" x2="-3.81" y2="1.27" width="0.2032" layer="21"/>
<wire x1="-3.81" y1="1.27" x2="-3.81" y2="-1.27" width="0.2032" layer="21"/>
</package>
<package name="HEADER-2X5-MALE-1MM">
<description>Pin Header, 2x5, RM 2.54</description>
<wire x1="-5.715" y1="2.54" x2="-4.445" y2="2.54" width="0.1524" layer="51"/>
<wire x1="-4.445" y1="2.54" x2="-3.81" y2="1.905" width="0.1524" layer="51"/>
<wire x1="-3.81" y1="1.905" x2="-3.175" y2="2.54" width="0.1524" layer="51"/>
<wire x1="-3.175" y1="2.54" x2="-1.905" y2="2.54" width="0.1524" layer="51"/>
<wire x1="-1.905" y1="2.54" x2="-1.27" y2="1.905" width="0.1524" layer="51"/>
<wire x1="-5.715" y1="2.54" x2="-6.35" y2="1.905" width="0.1524" layer="51"/>
<wire x1="-1.27" y1="1.905" x2="-0.635" y2="2.54" width="0.1524" layer="51"/>
<wire x1="-0.635" y1="2.54" x2="0.635" y2="2.54" width="0.1524" layer="51"/>
<wire x1="0.635" y1="2.54" x2="1.27" y2="1.905" width="0.1524" layer="51"/>
<wire x1="1.905" y1="2.54" x2="3.175" y2="2.54" width="0.1524" layer="51"/>
<wire x1="3.175" y1="2.54" x2="3.81" y2="1.905" width="0.1524" layer="51"/>
<wire x1="3.81" y1="1.905" x2="4.445" y2="2.54" width="0.1524" layer="51"/>
<wire x1="4.445" y1="2.54" x2="5.715" y2="2.54" width="0.1524" layer="51"/>
<wire x1="1.905" y1="2.54" x2="1.27" y2="1.905" width="0.1524" layer="51"/>
<wire x1="-3.81" y1="-1.905" x2="-4.445" y2="-2.54" width="0.1524" layer="51"/>
<wire x1="-1.27" y1="-1.905" x2="-1.905" y2="-2.54" width="0.1524" layer="51"/>
<wire x1="-1.905" y1="-2.54" x2="-3.175" y2="-2.54" width="0.1524" layer="51"/>
<wire x1="-3.175" y1="-2.54" x2="-3.81" y2="-1.905" width="0.1524" layer="51"/>
<wire x1="-6.35" y1="1.905" x2="-6.35" y2="-1.905" width="0.1524" layer="51"/>
<wire x1="-6.35" y1="-1.905" x2="-5.715" y2="-2.54" width="0.1524" layer="51"/>
<wire x1="-4.445" y1="-2.54" x2="-5.715" y2="-2.54" width="0.1524" layer="51"/>
<wire x1="1.27" y1="-1.905" x2="0.635" y2="-2.54" width="0.1524" layer="51"/>
<wire x1="0.635" y1="-2.54" x2="-0.635" y2="-2.54" width="0.1524" layer="51"/>
<wire x1="-0.635" y1="-2.54" x2="-1.27" y2="-1.905" width="0.1524" layer="51"/>
<wire x1="3.81" y1="-1.905" x2="3.175" y2="-2.54" width="0.1524" layer="51"/>
<wire x1="5.715" y1="-2.54" x2="4.445" y2="-2.54" width="0.1524" layer="51"/>
<wire x1="4.445" y1="-2.54" x2="3.81" y2="-1.905" width="0.1524" layer="51"/>
<wire x1="1.27" y1="-1.905" x2="1.905" y2="-2.54" width="0.1524" layer="51"/>
<wire x1="3.175" y1="-2.54" x2="1.905" y2="-2.54" width="0.1524" layer="51"/>
<wire x1="6.35" y1="1.905" x2="6.35" y2="-1.905" width="0.1524" layer="51"/>
<wire x1="5.715" y1="2.54" x2="6.35" y2="1.905" width="0.1524" layer="51"/>
<wire x1="6.35" y1="-1.905" x2="5.715" y2="-2.54" width="0.1524" layer="51"/>
<pad name="1" x="-5.08" y="-1.27" drill="1.016" diameter="1.778" shape="square" first="yes"/>
<pad name="3" x="-2.54" y="-1.27" drill="1.016" diameter="1.778"/>
<pad name="5" x="0" y="-1.27" drill="1.016" diameter="1.778"/>
<pad name="7" x="2.54" y="-1.27" drill="1.016" diameter="1.778"/>
<pad name="9" x="5.08" y="-1.27" drill="1.016" diameter="1.778"/>
<pad name="2" x="-5.08" y="1.27" drill="1.016" diameter="1.778"/>
<pad name="4" x="-2.54" y="1.27" drill="1.016" diameter="1.778"/>
<pad name="6" x="0" y="1.27" drill="1.016" diameter="1.778"/>
<pad name="8" x="2.54" y="1.27" drill="1.016" diameter="1.778"/>
<pad name="10" x="5.08" y="1.27" drill="1.016" diameter="1.778"/>
<text x="-6.35" y="3.175" size="1.27" layer="25" ratio="10">&gt;NAME</text>
<text x="0" y="-4.445" size="1.27" layer="27" ratio="10">&gt;VALUE</text>
<rectangle x1="-2.794" y1="-1.524" x2="-2.286" y2="-1.016" layer="51"/>
<rectangle x1="-5.334" y1="-1.524" x2="-4.826" y2="-1.016" layer="51"/>
<rectangle x1="-0.254" y1="-1.524" x2="0.254" y2="-1.016" layer="51"/>
<rectangle x1="4.826" y1="-1.524" x2="5.334" y2="-1.016" layer="51"/>
<rectangle x1="2.286" y1="-1.524" x2="2.794" y2="-1.016" layer="51"/>
<rectangle x1="-5.334" y1="1.016" x2="-4.826" y2="1.524" layer="51"/>
<rectangle x1="-2.794" y1="1.016" x2="-2.286" y2="1.524" layer="51"/>
<rectangle x1="-0.254" y1="1.016" x2="0.254" y2="1.524" layer="51"/>
<rectangle x1="2.286" y1="1.016" x2="2.794" y2="1.524" layer="51"/>
<rectangle x1="4.826" y1="1.016" x2="5.334" y2="1.524" layer="51"/>
<circle x="-6.35" y="-3.175" radius="0.635" width="0" layer="21"/>
<wire x1="6.6675" y1="-2.8575" x2="6.6675" y2="2.8575" width="0.0508" layer="39"/>
<wire x1="6.6675" y1="2.8575" x2="-6.6675" y2="2.8575" width="0.0508" layer="39"/>
<wire x1="6.6675" y1="-2.8575" x2="-6.6675" y2="-2.8575" width="0.0508" layer="39"/>
<wire x1="-6.6675" y1="-2.8575" x2="-6.6675" y2="2.8575" width="0.0508" layer="39"/>
<wire x1="-6.35" y1="-2.54" x2="6.35" y2="-2.54" width="0.2032" layer="21"/>
<wire x1="6.35" y1="-2.54" x2="6.35" y2="2.54" width="0.2032" layer="21"/>
<wire x1="6.35" y1="2.54" x2="-6.35" y2="2.54" width="0.2032" layer="21"/>
<wire x1="-6.35" y1="2.54" x2="-6.35" y2="-2.54" width="0.2032" layer="21"/>
</package>
<package name="HEADER-2X3-MALE-1MM">
<description>Pin Header, 2x3, RM 2.54</description>
<wire x1="-3.175" y1="2.54" x2="-1.905" y2="2.54" width="0.1524" layer="51"/>
<wire x1="-1.905" y1="2.54" x2="-1.27" y2="1.905" width="0.1524" layer="51"/>
<wire x1="-1.27" y1="1.905" x2="-0.635" y2="2.54" width="0.1524" layer="51"/>
<wire x1="-0.635" y1="2.54" x2="0.635" y2="2.54" width="0.1524" layer="51"/>
<wire x1="0.635" y1="2.54" x2="1.27" y2="1.905" width="0.1524" layer="51"/>
<wire x1="-3.175" y1="2.54" x2="-3.81" y2="1.905" width="0.1524" layer="51"/>
<wire x1="1.27" y1="1.905" x2="1.905" y2="2.54" width="0.1524" layer="51"/>
<wire x1="1.905" y1="2.54" x2="3.175" y2="2.54" width="0.1524" layer="51"/>
<wire x1="3.175" y1="2.54" x2="3.81" y2="1.905" width="0.1524" layer="51"/>
<wire x1="-1.27" y1="-1.905" x2="-1.905" y2="-2.54" width="0.1524" layer="51"/>
<wire x1="1.27" y1="-1.905" x2="0.635" y2="-2.54" width="0.1524" layer="51"/>
<wire x1="0.635" y1="-2.54" x2="-0.635" y2="-2.54" width="0.1524" layer="51"/>
<wire x1="-0.635" y1="-2.54" x2="-1.27" y2="-1.905" width="0.1524" layer="51"/>
<wire x1="-3.81" y1="1.905" x2="-3.81" y2="-1.905" width="0.1524" layer="51"/>
<wire x1="-3.81" y1="-1.905" x2="-3.175" y2="-2.54" width="0.1524" layer="51"/>
<wire x1="-1.905" y1="-2.54" x2="-3.175" y2="-2.54" width="0.1524" layer="51"/>
<wire x1="3.81" y1="-1.905" x2="3.175" y2="-2.54" width="0.1524" layer="51"/>
<wire x1="3.175" y1="-2.54" x2="1.905" y2="-2.54" width="0.1524" layer="51"/>
<wire x1="1.905" y1="-2.54" x2="1.27" y2="-1.905" width="0.1524" layer="51"/>
<wire x1="3.81" y1="1.905" x2="3.81" y2="-1.905" width="0.1524" layer="51"/>
<pad name="1" x="-2.54" y="-1.27" drill="1.016" diameter="1.778" shape="square" first="yes"/>
<pad name="3" x="0" y="-1.27" drill="1.016" diameter="1.778"/>
<pad name="5" x="2.54" y="-1.27" drill="1.016" diameter="1.778"/>
<pad name="2" x="-2.54" y="1.27" drill="1.016" diameter="1.778"/>
<pad name="4" x="0" y="1.27" drill="1.016" diameter="1.778"/>
<pad name="6" x="2.54" y="1.27" drill="1.016" diameter="1.778"/>
<text x="-3.81" y="3.175" size="1.27" layer="25" ratio="10">&gt;NAME</text>
<text x="-3.175" y="-4.445" size="1.27" layer="27" ratio="10">&gt;VALUE</text>
<rectangle x1="-0.254" y1="-1.524" x2="0.254" y2="-1.016" layer="51"/>
<rectangle x1="-2.794" y1="-1.524" x2="-2.286" y2="-1.016" layer="51"/>
<rectangle x1="2.286" y1="-1.524" x2="2.794" y2="-1.016" layer="51"/>
<rectangle x1="-2.794" y1="1.016" x2="-2.286" y2="1.524" layer="51"/>
<rectangle x1="-0.254" y1="1.016" x2="0.254" y2="1.524" layer="51"/>
<rectangle x1="2.286" y1="1.016" x2="2.794" y2="1.524" layer="51"/>
<circle x="-3.81" y="-3.175" radius="0.635" width="0" layer="21"/>
<wire x1="4.1275" y1="-2.8575" x2="4.1275" y2="2.8575" width="0.0508" layer="39"/>
<wire x1="4.1275" y1="2.8575" x2="-4.1275" y2="2.8575" width="0.0508" layer="39"/>
<wire x1="4.1275" y1="-2.8575" x2="-4.1275" y2="-2.8575" width="0.0508" layer="39"/>
<wire x1="-4.1275" y1="-2.8575" x2="-4.1275" y2="2.8575" width="0.0508" layer="39"/>
<wire x1="-3.81" y1="-2.54" x2="3.81" y2="-2.54" width="0.2032" layer="21"/>
<wire x1="3.81" y1="-2.54" x2="3.81" y2="2.54" width="0.2032" layer="21"/>
<wire x1="3.81" y1="2.54" x2="-3.81" y2="2.54" width="0.2032" layer="21"/>
<wire x1="-3.81" y1="2.54" x2="-3.81" y2="-2.54" width="0.2032" layer="21"/>
</package>
<package name="HEADER-2X2-MALE-1MM">
<description>Pin Header, 2x2, RM 2.54</description>
<wire x1="-1.905" y1="2.54" x2="-0.635" y2="2.54" width="0.1524" layer="51"/>
<wire x1="-0.635" y1="2.54" x2="0" y2="1.905" width="0.1524" layer="51"/>
<wire x1="0" y1="1.905" x2="0.635" y2="2.54" width="0.1524" layer="51"/>
<wire x1="0.635" y1="2.54" x2="1.905" y2="2.54" width="0.1524" layer="51"/>
<wire x1="1.905" y1="2.54" x2="2.54" y2="1.905" width="0.1524" layer="51"/>
<wire x1="-1.905" y1="2.54" x2="-2.54" y2="1.905" width="0.1524" layer="51"/>
<wire x1="0" y1="-1.905" x2="-0.635" y2="-2.54" width="0.1524" layer="51"/>
<wire x1="2.54" y1="-1.905" x2="1.905" y2="-2.54" width="0.1524" layer="51"/>
<wire x1="1.905" y1="-2.54" x2="0.635" y2="-2.54" width="0.1524" layer="51"/>
<wire x1="0.635" y1="-2.54" x2="0" y2="-1.905" width="0.1524" layer="51"/>
<wire x1="-2.54" y1="1.905" x2="-2.54" y2="-1.905" width="0.1524" layer="51"/>
<wire x1="-2.54" y1="-1.905" x2="-1.905" y2="-2.54" width="0.1524" layer="51"/>
<wire x1="-0.635" y1="-2.54" x2="-1.905" y2="-2.54" width="0.1524" layer="51"/>
<wire x1="2.54" y1="1.905" x2="2.54" y2="-1.905" width="0.1524" layer="51"/>
<pad name="1" x="-1.27" y="-1.27" drill="1.016" diameter="1.778" shape="square" first="yes"/>
<pad name="3" x="1.27" y="-1.27" drill="1.016" diameter="1.778"/>
<pad name="2" x="-1.27" y="1.27" drill="1.016" diameter="1.778"/>
<pad name="4" x="1.27" y="1.27" drill="1.016" diameter="1.778"/>
<text x="-2.54" y="3.175" size="1.27" layer="25" ratio="10">&gt;NAME</text>
<text x="-1.905" y="-4.445" size="1.27" layer="27" ratio="10">&gt;VALUE</text>
<rectangle x1="1.016" y1="-1.524" x2="1.524" y2="-1.016" layer="51"/>
<rectangle x1="-1.524" y1="-1.524" x2="-1.016" y2="-1.016" layer="51"/>
<rectangle x1="-1.524" y1="1.016" x2="-1.016" y2="1.524" layer="51"/>
<rectangle x1="1.016" y1="1.016" x2="1.524" y2="1.524" layer="51"/>
<circle x="-2.54" y="-3.175" radius="0.635" width="0" layer="21"/>
<wire x1="2.8575" y1="-2.8575" x2="2.8575" y2="2.8575" width="0.0508" layer="39"/>
<wire x1="2.8575" y1="2.8575" x2="-2.8575" y2="2.8575" width="0.0508" layer="39"/>
<wire x1="2.8575" y1="-2.8575" x2="-2.8575" y2="-2.8575" width="0.0508" layer="39"/>
<wire x1="-2.8575" y1="-2.8575" x2="-2.8575" y2="2.8575" width="0.0508" layer="39"/>
<wire x1="-2.54" y1="-2.54" x2="2.54" y2="-2.54" width="0.2032" layer="21"/>
<wire x1="2.54" y1="-2.54" x2="2.54" y2="2.54" width="0.2032" layer="21"/>
<wire x1="2.54" y1="2.54" x2="-2.54" y2="2.54" width="0.2032" layer="21"/>
<wire x1="-2.54" y1="2.54" x2="-2.54" y2="-2.54" width="0.2032" layer="21"/>
</package>
<package name="HEADER-1X2-MALE-1MM">
<description>Pin Header, 1x2, RM 2.54</description>
<wire x1="-1.905" y1="1.27" x2="-0.635" y2="1.27" width="0.1524" layer="51"/>
<wire x1="-0.635" y1="1.27" x2="0" y2="0.635" width="0.1524" layer="51"/>
<wire x1="0" y1="0.635" x2="0.635" y2="1.27" width="0.1524" layer="51"/>
<wire x1="0.635" y1="1.27" x2="1.905" y2="1.27" width="0.1524" layer="51"/>
<wire x1="1.905" y1="1.27" x2="2.54" y2="0.635" width="0.1524" layer="51"/>
<wire x1="-1.905" y1="1.27" x2="-2.54" y2="0.635" width="0.1524" layer="51"/>
<wire x1="0" y1="-0.635" x2="-0.635" y2="-1.27" width="0.1524" layer="51"/>
<wire x1="2.54" y1="-0.635" x2="1.905" y2="-1.27" width="0.1524" layer="51"/>
<wire x1="1.905" y1="-1.27" x2="0.635" y2="-1.27" width="0.1524" layer="51"/>
<wire x1="0.635" y1="-1.27" x2="0" y2="-0.635" width="0.1524" layer="51"/>
<wire x1="-2.54" y1="0.635" x2="-2.54" y2="-0.635" width="0.1524" layer="51"/>
<wire x1="-2.54" y1="-0.635" x2="-1.905" y2="-1.27" width="0.1524" layer="51"/>
<wire x1="-0.635" y1="-1.27" x2="-1.905" y2="-1.27" width="0.1524" layer="51"/>
<wire x1="2.54" y1="0.635" x2="2.54" y2="-0.635" width="0.1524" layer="51"/>
<pad name="1" x="-1.27" y="0" drill="1.016" diameter="1.778" shape="square" first="yes"/>
<pad name="2" x="1.27" y="0" drill="1.016" diameter="1.778"/>
<text x="-1.27" y="1.905" size="1.27" layer="25" ratio="10">&gt;NAME</text>
<text x="-1.27" y="-3.175" size="1.27" layer="27" ratio="10">&gt;VALUE</text>
<rectangle x1="1.016" y1="-0.254" x2="1.524" y2="0.254" layer="51"/>
<rectangle x1="-1.524" y1="-0.254" x2="-1.016" y2="0.254" layer="51"/>
<wire x1="2.8575" y1="-1.5875" x2="2.8575" y2="1.5875" width="0.0508" layer="39"/>
<wire x1="2.8575" y1="1.5875" x2="-2.8575" y2="1.5875" width="0.0508" layer="39"/>
<wire x1="2.8575" y1="-1.5875" x2="-2.8575" y2="-1.5875" width="0.0508" layer="39"/>
<wire x1="-2.8575" y1="-1.5875" x2="-2.8575" y2="1.5875" width="0.0508" layer="39"/>
<wire x1="-2.54" y1="-1.27" x2="2.54" y2="-1.27" width="0.2032" layer="21"/>
<wire x1="2.54" y1="-1.27" x2="2.54" y2="1.27" width="0.2032" layer="21"/>
<wire x1="2.54" y1="1.27" x2="-2.54" y2="1.27" width="0.2032" layer="21"/>
<wire x1="-2.54" y1="1.27" x2="-2.54" y2="-1.27" width="0.2032" layer="21"/>
</package>
<package name="HEADER-1X4-MALE-1MM">
<description>Pin Header, 1x4, RM 2.54</description>
<wire x1="-4.445" y1="1.27" x2="-3.175" y2="1.27" width="0.1524" layer="51"/>
<wire x1="-3.175" y1="1.27" x2="-2.54" y2="0.635" width="0.1524" layer="51"/>
<wire x1="-2.54" y1="0.635" x2="-1.905" y2="1.27" width="0.1524" layer="51"/>
<wire x1="-1.905" y1="1.27" x2="-0.635" y2="1.27" width="0.1524" layer="51"/>
<wire x1="-0.635" y1="1.27" x2="0" y2="0.635" width="0.1524" layer="51"/>
<wire x1="-4.445" y1="1.27" x2="-5.08" y2="0.635" width="0.1524" layer="51"/>
<wire x1="0" y1="0.635" x2="0.635" y2="1.27" width="0.1524" layer="51"/>
<wire x1="0.635" y1="1.27" x2="1.905" y2="1.27" width="0.1524" layer="51"/>
<wire x1="1.905" y1="1.27" x2="2.54" y2="0.635" width="0.1524" layer="51"/>
<wire x1="2.54" y1="0.635" x2="3.175" y2="1.27" width="0.1524" layer="51"/>
<wire x1="3.175" y1="1.27" x2="4.445" y2="1.27" width="0.1524" layer="51"/>
<wire x1="4.445" y1="1.27" x2="5.08" y2="0.635" width="0.1524" layer="51"/>
<wire x1="-2.54" y1="-0.635" x2="-3.175" y2="-1.27" width="0.1524" layer="51"/>
<wire x1="0" y1="-0.635" x2="-0.635" y2="-1.27" width="0.1524" layer="51"/>
<wire x1="-0.635" y1="-1.27" x2="-1.905" y2="-1.27" width="0.1524" layer="51"/>
<wire x1="-1.905" y1="-1.27" x2="-2.54" y2="-0.635" width="0.1524" layer="51"/>
<wire x1="-5.08" y1="0.635" x2="-5.08" y2="-0.635" width="0.1524" layer="51"/>
<wire x1="-5.08" y1="-0.635" x2="-4.445" y2="-1.27" width="0.1524" layer="51"/>
<wire x1="-3.175" y1="-1.27" x2="-4.445" y2="-1.27" width="0.1524" layer="51"/>
<wire x1="5.08" y1="-0.635" x2="4.445" y2="-1.27" width="0.1524" layer="51"/>
<wire x1="4.445" y1="-1.27" x2="3.175" y2="-1.27" width="0.1524" layer="51"/>
<wire x1="3.175" y1="-1.27" x2="2.54" y2="-0.635" width="0.1524" layer="51"/>
<wire x1="2.54" y1="-0.635" x2="1.905" y2="-1.27" width="0.1524" layer="51"/>
<wire x1="1.905" y1="-1.27" x2="0.635" y2="-1.27" width="0.1524" layer="51"/>
<wire x1="0.635" y1="-1.27" x2="0" y2="-0.635" width="0.1524" layer="51"/>
<wire x1="5.08" y1="0.635" x2="5.08" y2="-0.635" width="0.1524" layer="51"/>
<pad name="1" x="-3.81" y="0" drill="1.016" diameter="1.778" shape="square" first="yes"/>
<pad name="2" x="-1.27" y="0" drill="1.016" diameter="1.778"/>
<pad name="3" x="1.27" y="0" drill="1.016" diameter="1.778"/>
<text x="-3.81" y="1.905" size="1.27" layer="25" ratio="10">&gt;NAME</text>
<text x="-3.81" y="-3.175" size="1.27" layer="27" ratio="10">&gt;VALUE</text>
<rectangle x1="-1.524" y1="-0.254" x2="-1.016" y2="0.254" layer="51"/>
<rectangle x1="-4.064" y1="-0.254" x2="-3.556" y2="0.254" layer="51"/>
<rectangle x1="1.016" y1="-0.254" x2="1.524" y2="0.254" layer="51"/>
<circle x="-5.08" y="-1.905" radius="0.635" width="0" layer="21"/>
<wire x1="5.3975" y1="-1.5875" x2="5.3975" y2="1.5875" width="0.0508" layer="39"/>
<wire x1="5.3975" y1="1.5875" x2="-5.3975" y2="1.5875" width="0.0508" layer="39"/>
<wire x1="5.3975" y1="-1.5875" x2="-5.3975" y2="-1.5875" width="0.0508" layer="39"/>
<wire x1="-5.3975" y1="-1.5875" x2="-5.3975" y2="1.5875" width="0.0508" layer="39"/>
<wire x1="-5.08" y1="-1.27" x2="5.08" y2="-1.27" width="0.2032" layer="21"/>
<wire x1="5.08" y1="-1.27" x2="5.08" y2="1.27" width="0.2032" layer="21"/>
<wire x1="5.08" y1="1.27" x2="-5.08" y2="1.27" width="0.2032" layer="21"/>
<wire x1="-5.08" y1="1.27" x2="-5.08" y2="-1.27" width="0.2032" layer="21"/>
<pad name="4" x="3.81" y="0" drill="1.016" diameter="1.778"/>
<rectangle x1="3.556" y1="-0.254" x2="4.064" y2="0.254" layer="51"/>
</package>
<package name="HEADER-1X6-MALE-1MM">
<description>Pin Header, 1x6, RM 2.54</description>
<wire x1="-6.985" y1="1.27" x2="-5.715" y2="1.27" width="0.1524" layer="51"/>
<wire x1="-5.715" y1="1.27" x2="-5.08" y2="0.635" width="0.1524" layer="51"/>
<wire x1="-5.08" y1="0.635" x2="-4.445" y2="1.27" width="0.1524" layer="51"/>
<wire x1="-4.445" y1="1.27" x2="-3.175" y2="1.27" width="0.1524" layer="51"/>
<wire x1="-3.175" y1="1.27" x2="-2.54" y2="0.635" width="0.1524" layer="51"/>
<wire x1="-6.985" y1="1.27" x2="-7.62" y2="0.635" width="0.1524" layer="51"/>
<wire x1="-2.54" y1="0.635" x2="-1.905" y2="1.27" width="0.1524" layer="51"/>
<wire x1="-1.905" y1="1.27" x2="-0.635" y2="1.27" width="0.1524" layer="51"/>
<wire x1="-0.635" y1="1.27" x2="0" y2="0.635" width="0.1524" layer="51"/>
<wire x1="0" y1="0.635" x2="0.635" y2="1.27" width="0.1524" layer="51"/>
<wire x1="0.635" y1="1.27" x2="1.905" y2="1.27" width="0.1524" layer="51"/>
<wire x1="1.905" y1="1.27" x2="2.54" y2="0.635" width="0.1524" layer="51"/>
<wire x1="2.54" y1="0.635" x2="3.175" y2="1.27" width="0.1524" layer="51"/>
<wire x1="3.175" y1="1.27" x2="4.445" y2="1.27" width="0.1524" layer="51"/>
<wire x1="4.445" y1="1.27" x2="5.08" y2="0.635" width="0.1524" layer="51"/>
<wire x1="5.08" y1="0.635" x2="5.715" y2="1.27" width="0.1524" layer="51"/>
<wire x1="5.715" y1="1.27" x2="6.985" y2="1.27" width="0.1524" layer="51"/>
<wire x1="6.985" y1="1.27" x2="7.62" y2="0.635" width="0.1524" layer="51"/>
<wire x1="-5.08" y1="-0.635" x2="-5.715" y2="-1.27" width="0.1524" layer="51"/>
<wire x1="-2.54" y1="-0.635" x2="-3.175" y2="-1.27" width="0.1524" layer="51"/>
<wire x1="-3.175" y1="-1.27" x2="-4.445" y2="-1.27" width="0.1524" layer="51"/>
<wire x1="-4.445" y1="-1.27" x2="-5.08" y2="-0.635" width="0.1524" layer="51"/>
<wire x1="-7.62" y1="0.635" x2="-7.62" y2="-0.635" width="0.1524" layer="51"/>
<wire x1="-7.62" y1="-0.635" x2="-6.985" y2="-1.27" width="0.1524" layer="51"/>
<wire x1="-5.715" y1="-1.27" x2="-6.985" y2="-1.27" width="0.1524" layer="51"/>
<wire x1="7.62" y1="-0.635" x2="6.985" y2="-1.27" width="0.1524" layer="51"/>
<wire x1="6.985" y1="-1.27" x2="5.715" y2="-1.27" width="0.1524" layer="51"/>
<wire x1="5.715" y1="-1.27" x2="5.08" y2="-0.635" width="0.1524" layer="51"/>
<wire x1="5.08" y1="-0.635" x2="4.445" y2="-1.27" width="0.1524" layer="51"/>
<wire x1="4.445" y1="-1.27" x2="3.175" y2="-1.27" width="0.1524" layer="51"/>
<wire x1="3.175" y1="-1.27" x2="2.54" y2="-0.635" width="0.1524" layer="51"/>
<wire x1="2.54" y1="-0.635" x2="1.905" y2="-1.27" width="0.1524" layer="51"/>
<wire x1="1.905" y1="-1.27" x2="0.635" y2="-1.27" width="0.1524" layer="51"/>
<wire x1="0.635" y1="-1.27" x2="0" y2="-0.635" width="0.1524" layer="51"/>
<wire x1="0" y1="-0.635" x2="-0.635" y2="-1.27" width="0.1524" layer="51"/>
<wire x1="-0.635" y1="-1.27" x2="-1.905" y2="-1.27" width="0.1524" layer="51"/>
<wire x1="-1.905" y1="-1.27" x2="-2.54" y2="-0.635" width="0.1524" layer="51"/>
<wire x1="7.62" y1="0.635" x2="7.62" y2="-0.635" width="0.1524" layer="51"/>
<pad name="1" x="-6.35" y="0" drill="1.016" diameter="1.778" shape="square" first="yes"/>
<pad name="2" x="-3.81" y="0" drill="1.016" diameter="1.778"/>
<pad name="3" x="-1.27" y="0" drill="1.016" diameter="1.778"/>
<text x="-6.35" y="1.905" size="1.27" layer="25" ratio="10">&gt;NAME</text>
<text x="-6.35" y="-3.175" size="1.27" layer="27" ratio="10">&gt;VALUE</text>
<rectangle x1="-4.064" y1="-0.254" x2="-3.556" y2="0.254" layer="51"/>
<rectangle x1="-6.604" y1="-0.254" x2="-6.096" y2="0.254" layer="51"/>
<rectangle x1="-1.524" y1="-0.254" x2="-1.016" y2="0.254" layer="51"/>
<circle x="-7.62" y="-1.905" radius="0.635" width="0" layer="21"/>
<wire x1="7.9375" y1="-1.5875" x2="7.9375" y2="1.5875" width="0.0508" layer="39"/>
<wire x1="7.9375" y1="1.5875" x2="-7.9375" y2="1.5875" width="0.0508" layer="39"/>
<wire x1="7.9375" y1="-1.5875" x2="-7.9375" y2="-1.5875" width="0.0508" layer="39"/>
<wire x1="-7.9375" y1="-1.5875" x2="-7.9375" y2="1.5875" width="0.0508" layer="39"/>
<wire x1="-7.62" y1="-1.27" x2="7.62" y2="-1.27" width="0.2032" layer="21"/>
<wire x1="7.62" y1="-1.27" x2="7.62" y2="1.27" width="0.2032" layer="21"/>
<wire x1="7.62" y1="1.27" x2="-7.62" y2="1.27" width="0.2032" layer="21"/>
<wire x1="-7.62" y1="1.27" x2="-7.62" y2="-1.27" width="0.2032" layer="21"/>
<pad name="4" x="1.27" y="0" drill="1.016" diameter="1.778"/>
<rectangle x1="3.556" y1="-0.254" x2="4.064" y2="0.254" layer="51"/>
<pad name="5" x="3.81" y="0" drill="1.016" diameter="1.778"/>
<rectangle x1="1.016" y1="-0.254" x2="1.524" y2="0.254" layer="51"/>
<rectangle x1="6.096" y1="-0.254" x2="6.604" y2="0.254" layer="51"/>
<pad name="6" x="6.35" y="0" drill="1.016" diameter="1.778"/>
</package>
<package name="HEADER-1X8-MALE-1MM">
<description>Pin Header, 1x8, RM 2.54</description>
<wire x1="-9.525" y1="1.27" x2="-8.255" y2="1.27" width="0.1524" layer="51"/>
<wire x1="-8.255" y1="1.27" x2="-7.62" y2="0.635" width="0.1524" layer="51"/>
<wire x1="-7.62" y1="0.635" x2="-6.985" y2="1.27" width="0.1524" layer="51"/>
<wire x1="-6.985" y1="1.27" x2="-5.715" y2="1.27" width="0.1524" layer="51"/>
<wire x1="-5.715" y1="1.27" x2="-5.08" y2="0.635" width="0.1524" layer="51"/>
<wire x1="-9.525" y1="1.27" x2="-10.16" y2="0.635" width="0.1524" layer="51"/>
<wire x1="-5.08" y1="0.635" x2="-4.445" y2="1.27" width="0.1524" layer="51"/>
<wire x1="-4.445" y1="1.27" x2="-3.175" y2="1.27" width="0.1524" layer="51"/>
<wire x1="-3.175" y1="1.27" x2="-2.54" y2="0.635" width="0.1524" layer="51"/>
<wire x1="-2.54" y1="0.635" x2="-1.905" y2="1.27" width="0.1524" layer="51"/>
<wire x1="-1.905" y1="1.27" x2="-0.635" y2="1.27" width="0.1524" layer="51"/>
<wire x1="-0.635" y1="1.27" x2="0" y2="0.635" width="0.1524" layer="51"/>
<wire x1="0" y1="0.635" x2="0.635" y2="1.27" width="0.1524" layer="51"/>
<wire x1="0.635" y1="1.27" x2="1.905" y2="1.27" width="0.1524" layer="51"/>
<wire x1="1.905" y1="1.27" x2="2.54" y2="0.635" width="0.1524" layer="51"/>
<wire x1="2.54" y1="0.635" x2="3.175" y2="1.27" width="0.1524" layer="51"/>
<wire x1="3.175" y1="1.27" x2="4.445" y2="1.27" width="0.1524" layer="51"/>
<wire x1="4.445" y1="1.27" x2="5.08" y2="0.635" width="0.1524" layer="51"/>
<wire x1="5.08" y1="0.635" x2="5.715" y2="1.27" width="0.1524" layer="51"/>
<wire x1="5.715" y1="1.27" x2="6.985" y2="1.27" width="0.1524" layer="51"/>
<wire x1="6.985" y1="1.27" x2="7.62" y2="0.635" width="0.1524" layer="51"/>
<wire x1="7.62" y1="0.635" x2="8.255" y2="1.27" width="0.1524" layer="51"/>
<wire x1="8.255" y1="1.27" x2="9.525" y2="1.27" width="0.1524" layer="51"/>
<wire x1="9.525" y1="1.27" x2="10.16" y2="0.635" width="0.1524" layer="51"/>
<wire x1="-7.62" y1="-0.635" x2="-8.255" y2="-1.27" width="0.1524" layer="51"/>
<wire x1="-5.08" y1="-0.635" x2="-5.715" y2="-1.27" width="0.1524" layer="51"/>
<wire x1="-5.715" y1="-1.27" x2="-6.985" y2="-1.27" width="0.1524" layer="51"/>
<wire x1="-6.985" y1="-1.27" x2="-7.62" y2="-0.635" width="0.1524" layer="51"/>
<wire x1="-10.16" y1="0.635" x2="-10.16" y2="-0.635" width="0.1524" layer="51"/>
<wire x1="-10.16" y1="-0.635" x2="-9.525" y2="-1.27" width="0.1524" layer="51"/>
<wire x1="-8.255" y1="-1.27" x2="-9.525" y2="-1.27" width="0.1524" layer="51"/>
<wire x1="10.16" y1="-0.635" x2="9.525" y2="-1.27" width="0.1524" layer="51"/>
<wire x1="9.525" y1="-1.27" x2="8.255" y2="-1.27" width="0.1524" layer="51"/>
<wire x1="8.255" y1="-1.27" x2="7.62" y2="-0.635" width="0.1524" layer="51"/>
<wire x1="7.62" y1="-0.635" x2="6.985" y2="-1.27" width="0.1524" layer="51"/>
<wire x1="6.985" y1="-1.27" x2="5.715" y2="-1.27" width="0.1524" layer="51"/>
<wire x1="5.715" y1="-1.27" x2="5.08" y2="-0.635" width="0.1524" layer="51"/>
<wire x1="5.08" y1="-0.635" x2="4.445" y2="-1.27" width="0.1524" layer="51"/>
<wire x1="4.445" y1="-1.27" x2="3.175" y2="-1.27" width="0.1524" layer="51"/>
<wire x1="3.175" y1="-1.27" x2="2.54" y2="-0.635" width="0.1524" layer="51"/>
<wire x1="2.54" y1="-0.635" x2="1.905" y2="-1.27" width="0.1524" layer="51"/>
<wire x1="1.905" y1="-1.27" x2="0.635" y2="-1.27" width="0.1524" layer="51"/>
<wire x1="0.635" y1="-1.27" x2="0" y2="-0.635" width="0.1524" layer="51"/>
<wire x1="0" y1="-0.635" x2="-0.635" y2="-1.27" width="0.1524" layer="51"/>
<wire x1="-0.635" y1="-1.27" x2="-1.905" y2="-1.27" width="0.1524" layer="51"/>
<wire x1="-1.905" y1="-1.27" x2="-2.54" y2="-0.635" width="0.1524" layer="51"/>
<wire x1="-2.54" y1="-0.635" x2="-3.175" y2="-1.27" width="0.1524" layer="51"/>
<wire x1="-3.175" y1="-1.27" x2="-4.445" y2="-1.27" width="0.1524" layer="51"/>
<wire x1="-4.445" y1="-1.27" x2="-5.08" y2="-0.635" width="0.1524" layer="51"/>
<wire x1="10.16" y1="0.635" x2="10.16" y2="-0.635" width="0.1524" layer="51"/>
<pad name="1" x="-8.89" y="0" drill="1.016" diameter="1.778" shape="square" first="yes"/>
<pad name="2" x="-6.35" y="0" drill="1.016" diameter="1.778"/>
<pad name="3" x="-3.81" y="0" drill="1.016" diameter="1.778"/>
<text x="-8.89" y="1.905" size="1.27" layer="25" ratio="10">&gt;NAME</text>
<text x="-8.89" y="-3.175" size="1.27" layer="27" ratio="10">&gt;VALUE</text>
<rectangle x1="-6.604" y1="-0.254" x2="-6.096" y2="0.254" layer="51"/>
<rectangle x1="-9.144" y1="-0.254" x2="-8.636" y2="0.254" layer="51"/>
<rectangle x1="-4.064" y1="-0.254" x2="-3.556" y2="0.254" layer="51"/>
<circle x="-10.16" y="-1.905" radius="0.635" width="0" layer="21"/>
<wire x1="10.4775" y1="-1.5875" x2="10.4775" y2="1.5875" width="0.0508" layer="39"/>
<wire x1="10.4775" y1="1.5875" x2="-10.4775" y2="1.5875" width="0.0508" layer="39"/>
<wire x1="10.4775" y1="-1.5875" x2="-10.4775" y2="-1.5875" width="0.0508" layer="39"/>
<wire x1="-10.4775" y1="-1.5875" x2="-10.4775" y2="1.5875" width="0.0508" layer="39"/>
<wire x1="-10.16" y1="-1.27" x2="10.16" y2="-1.27" width="0.2032" layer="21"/>
<wire x1="10.16" y1="-1.27" x2="10.16" y2="1.27" width="0.2032" layer="21"/>
<wire x1="10.16" y1="1.27" x2="-10.16" y2="1.27" width="0.2032" layer="21"/>
<wire x1="-10.16" y1="1.27" x2="-10.16" y2="-1.27" width="0.2032" layer="21"/>
<pad name="4" x="-1.27" y="0" drill="1.016" diameter="1.778"/>
<rectangle x1="1.016" y1="-0.254" x2="1.524" y2="0.254" layer="51"/>
<pad name="5" x="1.27" y="0" drill="1.016" diameter="1.778"/>
<rectangle x1="-1.524" y1="-0.254" x2="-1.016" y2="0.254" layer="51"/>
<rectangle x1="8.636" y1="-0.254" x2="9.144" y2="0.254" layer="51"/>
<pad name="6" x="3.81" y="0" drill="1.016" diameter="1.778"/>
<pad name="7" x="6.35" y="0" drill="1.016" diameter="1.778"/>
<rectangle x1="3.556" y1="-0.254" x2="4.064" y2="0.254" layer="51"/>
<pad name="8" x="8.89" y="0" drill="1.016" diameter="1.778"/>
<rectangle x1="6.096" y1="-0.254" x2="6.604" y2="0.254" layer="51"/>
</package>
<package name="HEADER-2X8-MALE-1MM">
<wire x1="-9.525" y1="2.54" x2="-8.255" y2="2.54" width="0.1524" layer="51"/>
<wire x1="-8.255" y1="2.54" x2="-7.62" y2="1.905" width="0.1524" layer="51"/>
<wire x1="-7.62" y1="1.905" x2="-6.985" y2="2.54" width="0.1524" layer="51"/>
<wire x1="-6.985" y1="2.54" x2="-5.715" y2="2.54" width="0.1524" layer="51"/>
<wire x1="-5.715" y1="2.54" x2="-5.08" y2="1.905" width="0.1524" layer="51"/>
<wire x1="-9.525" y1="2.54" x2="-10.16" y2="1.905" width="0.1524" layer="51"/>
<wire x1="-5.08" y1="1.905" x2="-4.445" y2="2.54" width="0.1524" layer="51"/>
<wire x1="-4.445" y1="2.54" x2="-3.175" y2="2.54" width="0.1524" layer="51"/>
<wire x1="-3.175" y1="2.54" x2="-2.54" y2="1.905" width="0.1524" layer="51"/>
<wire x1="-1.905" y1="2.54" x2="-0.635" y2="2.54" width="0.1524" layer="51"/>
<wire x1="-0.635" y1="2.54" x2="0" y2="1.905" width="0.1524" layer="51"/>
<wire x1="0" y1="1.905" x2="0.635" y2="2.54" width="0.1524" layer="51"/>
<wire x1="0.635" y1="2.54" x2="9.525" y2="2.54" width="0.1524" layer="51"/>
<wire x1="-1.905" y1="2.54" x2="-2.54" y2="1.905" width="0.1524" layer="51"/>
<wire x1="-7.62" y1="-1.905" x2="-8.255" y2="-2.54" width="0.1524" layer="51"/>
<wire x1="-5.08" y1="-1.905" x2="-5.715" y2="-2.54" width="0.1524" layer="51"/>
<wire x1="-5.715" y1="-2.54" x2="-6.985" y2="-2.54" width="0.1524" layer="51"/>
<wire x1="-6.985" y1="-2.54" x2="-7.62" y2="-1.905" width="0.1524" layer="51"/>
<wire x1="-10.16" y1="1.905" x2="-10.16" y2="-1.905" width="0.1524" layer="51"/>
<wire x1="-10.16" y1="-1.905" x2="-9.525" y2="-2.54" width="0.1524" layer="51"/>
<wire x1="-8.255" y1="-2.54" x2="-9.525" y2="-2.54" width="0.1524" layer="51"/>
<wire x1="-2.54" y1="-1.905" x2="-3.175" y2="-2.54" width="0.1524" layer="51"/>
<wire x1="-3.175" y1="-2.54" x2="-4.445" y2="-2.54" width="0.1524" layer="51"/>
<wire x1="-4.445" y1="-2.54" x2="-5.08" y2="-1.905" width="0.1524" layer="51"/>
<wire x1="0" y1="-1.905" x2="-0.635" y2="-2.54" width="0.1524" layer="51"/>
<wire x1="9.525" y1="-2.54" x2="0.635" y2="-2.54" width="0.1524" layer="51"/>
<wire x1="0.635" y1="-2.54" x2="0" y2="-1.905" width="0.1524" layer="51"/>
<wire x1="-2.54" y1="-1.905" x2="-1.905" y2="-2.54" width="0.1524" layer="51"/>
<wire x1="-0.635" y1="-2.54" x2="-1.905" y2="-2.54" width="0.1524" layer="51"/>
<wire x1="10.16" y1="1.905" x2="10.16" y2="-1.905" width="0.1524" layer="51"/>
<wire x1="9.525" y1="2.54" x2="10.16" y2="1.905" width="0.1524" layer="51"/>
<wire x1="10.16" y1="-1.905" x2="9.525" y2="-2.54" width="0.1524" layer="51"/>
<pad name="1" x="-8.89" y="-1.27" drill="1.016" diameter="1.778" shape="square" first="yes"/>
<pad name="3" x="-6.35" y="-1.27" drill="1.016" diameter="1.778"/>
<pad name="5" x="-3.81" y="-1.27" drill="1.016" diameter="1.778"/>
<pad name="7" x="-1.27" y="-1.27" drill="1.016" diameter="1.778"/>
<pad name="9" x="1.27" y="-1.27" drill="1.016" diameter="1.778"/>
<pad name="2" x="-8.89" y="1.27" drill="1.016" diameter="1.778"/>
<pad name="4" x="-6.35" y="1.27" drill="1.016" diameter="1.778"/>
<pad name="6" x="-3.81" y="1.27" drill="1.016" diameter="1.778"/>
<pad name="8" x="-1.27" y="1.27" drill="1.016" diameter="1.778"/>
<pad name="10" x="1.27" y="1.27" drill="1.016" diameter="1.778"/>
<text x="-10.16" y="3.175" size="1.27" layer="25" ratio="10">&gt;NAME</text>
<text x="-3.81" y="-4.445" size="1.27" layer="27" ratio="10">&gt;VALUE</text>
<rectangle x1="-6.604" y1="-1.524" x2="-6.096" y2="-1.016" layer="51"/>
<rectangle x1="-9.144" y1="-1.524" x2="-8.636" y2="-1.016" layer="51"/>
<rectangle x1="-4.064" y1="-1.524" x2="-3.556" y2="-1.016" layer="51"/>
<rectangle x1="1.016" y1="-1.524" x2="1.524" y2="-1.016" layer="51"/>
<rectangle x1="-1.524" y1="-1.524" x2="-1.016" y2="-1.016" layer="51"/>
<rectangle x1="-9.144" y1="1.016" x2="-8.636" y2="1.524" layer="51"/>
<rectangle x1="-6.604" y1="1.016" x2="-6.096" y2="1.524" layer="51"/>
<rectangle x1="-4.064" y1="1.016" x2="-3.556" y2="1.524" layer="51"/>
<rectangle x1="-1.524" y1="1.016" x2="-1.016" y2="1.524" layer="51"/>
<rectangle x1="1.016" y1="1.016" x2="1.524" y2="1.524" layer="51"/>
<circle x="-10.16" y="-3.175" radius="0.635" width="0" layer="21"/>
<wire x1="10.4775" y1="-2.8575" x2="10.4775" y2="2.8575" width="0.0508" layer="39"/>
<wire x1="10.4775" y1="2.8575" x2="-10.4775" y2="2.8575" width="0.0508" layer="39"/>
<wire x1="10.4775" y1="-2.8575" x2="-10.4775" y2="-2.8575" width="0.0508" layer="39"/>
<wire x1="-10.4775" y1="-2.8575" x2="-10.4775" y2="2.8575" width="0.0508" layer="39"/>
<wire x1="-10.16" y1="-2.54" x2="10.16" y2="-2.54" width="0.2032" layer="21"/>
<wire x1="10.16" y1="-2.54" x2="10.16" y2="2.54" width="0.2032" layer="21"/>
<wire x1="10.16" y1="2.54" x2="-10.16" y2="2.54" width="0.2032" layer="21"/>
<wire x1="-10.16" y1="2.54" x2="-10.16" y2="-2.54" width="0.2032" layer="21"/>
<pad name="11" x="3.81" y="-1.27" drill="1.016" diameter="1.778"/>
<pad name="12" x="3.81" y="1.27" drill="1.016" diameter="1.778"/>
<pad name="13" x="6.35" y="-1.27" drill="1.016" diameter="1.778"/>
<pad name="14" x="6.35" y="1.27" drill="1.016" diameter="1.778"/>
<pad name="15" x="8.89" y="-1.27" drill="1.016" diameter="1.778"/>
<pad name="16" x="8.89" y="1.27" drill="1.016" diameter="1.778"/>
<rectangle x1="3.556" y1="1.016" x2="4.064" y2="1.524" layer="51"/>
<rectangle x1="3.556" y1="-1.524" x2="4.064" y2="-1.016" layer="51"/>
<rectangle x1="6.096" y1="1.016" x2="6.604" y2="1.524" layer="51"/>
<rectangle x1="6.096" y1="-1.524" x2="6.604" y2="-1.016" layer="51"/>
<rectangle x1="8.636" y1="1.016" x2="9.144" y2="1.524" layer="51"/>
<rectangle x1="8.636" y1="-1.524" x2="9.144" y2="-1.016" layer="51"/>
</package>
</packages>
<symbols>
<symbol name="JUMP-1X3">
<text x="-2.2225" y="1.27" size="1.27" layer="95">&gt;NAME</text>
<pin name="1" x="-2.54" y="0" visible="off" length="point" direction="pas"/>
<pin name="3" x="2.54" y="0" visible="off" length="point" direction="pas" rot="R180"/>
<circle x="0" y="0" radius="0.635" width="0.254" layer="94"/>
<circle x="2.54" y="0" radius="0.635" width="0.254" layer="94"/>
<circle x="-2.54" y="0" radius="0.635" width="0.254" layer="94"/>
<pin name="2" x="0" y="0" visible="off" length="point" direction="pas" rot="R90"/>
<text x="-3.175" y="-1.27" size="0.6096" layer="94">1</text>
<text x="-0.635" y="-1.27" size="0.6096" layer="94">2</text>
<text x="1.905" y="-1.27" size="0.6096" layer="94">3</text>
</symbol>
<symbol name="JUMP-PREPOJKA">
<wire x1="-1.27" y1="0" x2="1.27" y2="0" width="0.1524" layer="94" curve="-180"/>
</symbol>
<symbol name="JUMP-2X3">
<text x="-4.1275" y="2.8575" size="1.27" layer="95">&gt;NAME</text>
<pin name="1" x="-2.54" y="-1.27" visible="off" length="point" direction="pas"/>
<pin name="5" x="2.54" y="-1.27" visible="off" length="point" direction="pas" rot="R180"/>
<circle x="0" y="-1.27" radius="0.635" width="0.254" layer="94"/>
<circle x="2.54" y="-1.27" radius="0.635" width="0.254" layer="94"/>
<circle x="-2.54" y="-1.27" radius="0.635" width="0.254" layer="94"/>
<pin name="3" x="0" y="-1.27" visible="off" length="point" direction="pas" rot="R90"/>
<text x="-3.4925" y="-2.54" size="0.6096" layer="94">1</text>
<text x="-3.4925" y="1.905" size="0.6096" layer="94">2</text>
<text x="-0.9525" y="-2.54" size="0.6096" layer="94">3</text>
<pin name="2" x="-2.54" y="1.27" visible="off" length="point" direction="pas"/>
<pin name="6" x="2.54" y="1.27" visible="off" length="point" direction="pas" rot="R180"/>
<circle x="0" y="1.27" radius="0.635" width="0.254" layer="94"/>
<circle x="2.54" y="1.27" radius="0.635" width="0.254" layer="94"/>
<circle x="-2.54" y="1.27" radius="0.635" width="0.254" layer="94"/>
<pin name="4" x="0" y="1.27" visible="off" length="point" direction="pas" rot="R270"/>
<text x="-0.9525" y="1.905" size="0.6096" layer="94">4</text>
<text x="1.5875" y="-2.54" size="0.6096" layer="94">5</text>
<text x="1.5875" y="1.905" size="0.6096" layer="94">6</text>
</symbol>
<symbol name="JUMP-1X2">
<text x="-1.5875" y="1.27" size="1.27" layer="95">&gt;NAME</text>
<pin name="1" x="-1.27" y="0" visible="off" length="point" direction="pas"/>
<circle x="1.27" y="0" radius="0.635" width="0.254" layer="94"/>
<circle x="-1.27" y="0" radius="0.635" width="0.254" layer="94"/>
<pin name="2" x="1.27" y="0" visible="off" length="point" direction="pas" rot="R90"/>
<text x="-2.2225" y="-1.27" size="0.6096" layer="94">1</text>
<text x="1.5875" y="-1.27" size="0.6096" layer="94">2</text>
</symbol>
<symbol name="HEAD-1X3-MALE">
<wire x1="-1.905" y1="4.445" x2="-0.635" y2="4.445" width="0.4064" layer="94"/>
<wire x1="1.905" y1="-4.445" x2="1.905" y2="4.445" width="0.4064" layer="94"/>
<wire x1="-1.905" y1="4.445" x2="-1.905" y2="3.175" width="0.4064" layer="94"/>
<wire x1="-1.905" y1="3.175" x2="-1.905" y2="-4.445" width="0.4064" layer="94"/>
<wire x1="1.905" y1="-4.445" x2="-1.905" y2="-4.445" width="0.4064" layer="94"/>
<text x="-2.54" y="-6.35" size="1.27" layer="96">&gt;VALUE</text>
<text x="-2.54" y="5.08" size="1.27" layer="95">&gt;NAME</text>
<pin name="1" x="-6.35" y="2.54" visible="pad" length="middle" direction="pas"/>
<pin name="3" x="-6.35" y="0" visible="pad" length="middle" direction="pas"/>
<wire x1="-1.905" y1="3.175" x2="-0.635" y2="4.445" width="0.4064" layer="94"/>
<wire x1="-0.635" y1="4.445" x2="1.905" y2="4.445" width="0.4064" layer="94"/>
<rectangle x1="-0.635" y1="1.905" x2="0.635" y2="3.175" layer="94"/>
<rectangle x1="-0.635" y1="-0.635" x2="0.635" y2="0.635" layer="94"/>
<wire x1="-1.27" y1="2.54" x2="0" y2="2.54" width="0.1524" layer="94"/>
<wire x1="-1.27" y1="0" x2="0" y2="0" width="0.1524" layer="94"/>
<pin name="2" x="-6.35" y="-2.54" visible="pad" length="middle" direction="pas"/>
<rectangle x1="-0.635" y1="-3.175" x2="0.635" y2="-1.905" layer="94"/>
<wire x1="-1.27" y1="-2.54" x2="0" y2="-2.54" width="0.1524" layer="94"/>
</symbol>
<symbol name="JUMP-1X4">
<text x="-3.4925" y="1.27" size="1.27" layer="95">&gt;NAME</text>
<pin name="1" x="-3.81" y="0" visible="off" length="point" direction="pas"/>
<pin name="3" x="1.27" y="0" visible="off" length="point" direction="pas" rot="R180"/>
<circle x="-1.27" y="0" radius="0.635" width="0.254" layer="94"/>
<circle x="1.27" y="0" radius="0.635" width="0.254" layer="94"/>
<circle x="-3.81" y="0" radius="0.635" width="0.254" layer="94"/>
<pin name="2" x="-1.27" y="0" visible="off" length="point" direction="pas" rot="R90"/>
<text x="-4.7625" y="-1.27" size="0.6096" layer="94">1</text>
<text x="-2.2225" y="-1.27" size="0.6096" layer="94">2</text>
<text x="0.3175" y="-1.27" size="0.6096" layer="94">3</text>
<pin name="4" x="3.81" y="0" visible="off" length="point" direction="pas" rot="R180"/>
<circle x="3.81" y="0" radius="0.635" width="0.254" layer="94"/>
<text x="2.8575" y="-1.27" size="0.6096" layer="94">4</text>
</symbol>
<symbol name="HEAD-1X6-MALE">
<wire x1="-1.905" y1="8.255" x2="-0.635" y2="8.255" width="0.4064" layer="94"/>
<wire x1="1.905" y1="-8.255" x2="1.905" y2="8.255" width="0.4064" layer="94"/>
<wire x1="-1.905" y1="8.255" x2="-1.905" y2="6.985" width="0.4064" layer="94"/>
<wire x1="-1.905" y1="6.985" x2="-1.905" y2="-8.255" width="0.4064" layer="94"/>
<wire x1="1.905" y1="-8.255" x2="-1.905" y2="-8.255" width="0.4064" layer="94"/>
<text x="-2.54" y="-10.16" size="1.27" layer="96">&gt;VALUE</text>
<text x="-2.54" y="8.89" size="1.27" layer="95">&gt;NAME</text>
<pin name="1" x="-6.35" y="6.35" visible="pad" length="middle" direction="pas"/>
<pin name="3" x="-6.35" y="1.27" visible="pad" length="middle" direction="pas"/>
<wire x1="-1.905" y1="6.985" x2="-0.635" y2="8.255" width="0.4064" layer="94"/>
<wire x1="-0.635" y1="8.255" x2="1.905" y2="8.255" width="0.4064" layer="94"/>
<rectangle x1="-0.635" y1="5.715" x2="0.635" y2="6.985" layer="94"/>
<rectangle x1="-0.635" y1="3.175" x2="0.635" y2="4.445" layer="94"/>
<wire x1="-1.27" y1="6.35" x2="0" y2="6.35" width="0.1524" layer="94"/>
<wire x1="-1.27" y1="3.81" x2="0" y2="3.81" width="0.1524" layer="94"/>
<pin name="2" x="-6.35" y="3.81" visible="pad" length="middle" direction="pas"/>
<rectangle x1="-0.635" y1="0.635" x2="0.635" y2="1.905" layer="94"/>
<wire x1="-1.27" y1="1.27" x2="0" y2="1.27" width="0.1524" layer="94"/>
<pin name="4" x="-6.35" y="-1.27" visible="pad" length="middle" direction="pas"/>
<rectangle x1="-0.635" y1="-1.905" x2="0.635" y2="-0.635" layer="94"/>
<wire x1="-1.27" y1="-1.27" x2="0" y2="-1.27" width="0.1524" layer="94"/>
<pin name="5" x="-6.35" y="-3.81" visible="pad" length="middle" direction="pas"/>
<rectangle x1="-0.635" y1="-4.445" x2="0.635" y2="-3.175" layer="94"/>
<wire x1="-1.27" y1="-3.81" x2="0" y2="-3.81" width="0.1524" layer="94"/>
<pin name="6" x="-6.35" y="-6.35" visible="pad" length="middle" direction="pas"/>
<rectangle x1="-0.635" y1="-6.985" x2="0.635" y2="-5.715" layer="94"/>
<wire x1="-1.27" y1="-6.35" x2="0" y2="-6.35" width="0.1524" layer="94"/>
</symbol>
<symbol name="HEAD-1X8-MALE">
<wire x1="-1.905" y1="10.795" x2="-0.635" y2="10.795" width="0.4064" layer="94"/>
<wire x1="1.905" y1="-10.795" x2="1.905" y2="10.795" width="0.4064" layer="94"/>
<wire x1="-1.905" y1="10.795" x2="-1.905" y2="9.525" width="0.4064" layer="94"/>
<wire x1="-1.905" y1="9.525" x2="-1.905" y2="-10.795" width="0.4064" layer="94"/>
<wire x1="1.905" y1="-10.795" x2="-1.905" y2="-10.795" width="0.4064" layer="94"/>
<text x="-2.54" y="-12.7" size="1.27" layer="96">&gt;VALUE</text>
<text x="-2.54" y="11.43" size="1.27" layer="95">&gt;NAME</text>
<pin name="1" x="-6.35" y="8.89" visible="pad" length="middle" direction="pas"/>
<pin name="3" x="-6.35" y="3.81" visible="pad" length="middle" direction="pas"/>
<wire x1="-1.905" y1="9.525" x2="-0.635" y2="10.795" width="0.4064" layer="94"/>
<wire x1="-0.635" y1="10.795" x2="1.905" y2="10.795" width="0.4064" layer="94"/>
<rectangle x1="-0.635" y1="8.255" x2="0.635" y2="9.525" layer="94"/>
<rectangle x1="-0.635" y1="5.715" x2="0.635" y2="6.985" layer="94"/>
<wire x1="-1.27" y1="8.89" x2="0" y2="8.89" width="0.1524" layer="94"/>
<wire x1="-1.27" y1="6.35" x2="0" y2="6.35" width="0.1524" layer="94"/>
<pin name="2" x="-6.35" y="6.35" visible="pad" length="middle" direction="pas"/>
<rectangle x1="-0.635" y1="3.175" x2="0.635" y2="4.445" layer="94"/>
<wire x1="-1.27" y1="3.81" x2="0" y2="3.81" width="0.1524" layer="94"/>
<pin name="4" x="-6.35" y="1.27" visible="pad" length="middle" direction="pas"/>
<rectangle x1="-0.635" y1="0.635" x2="0.635" y2="1.905" layer="94"/>
<wire x1="-1.27" y1="1.27" x2="0" y2="1.27" width="0.1524" layer="94"/>
<pin name="5" x="-6.35" y="-1.27" visible="pad" length="middle" direction="pas"/>
<rectangle x1="-0.635" y1="-1.905" x2="0.635" y2="-0.635" layer="94"/>
<wire x1="-1.27" y1="-1.27" x2="0" y2="-1.27" width="0.1524" layer="94"/>
<pin name="6" x="-6.35" y="-3.81" visible="pad" length="middle" direction="pas"/>
<rectangle x1="-0.635" y1="-4.445" x2="0.635" y2="-3.175" layer="94"/>
<wire x1="-1.27" y1="-3.81" x2="0" y2="-3.81" width="0.1524" layer="94"/>
<pin name="7" x="-6.35" y="-6.35" visible="pad" length="middle" direction="pas"/>
<rectangle x1="-0.635" y1="-6.985" x2="0.635" y2="-5.715" layer="94"/>
<wire x1="-1.27" y1="-6.35" x2="0" y2="-6.35" width="0.1524" layer="94"/>
<pin name="8" x="-6.35" y="-8.89" visible="pad" length="middle" direction="pas"/>
<rectangle x1="-0.635" y1="-9.525" x2="0.635" y2="-8.255" layer="94"/>
<wire x1="-1.27" y1="-8.89" x2="0" y2="-8.89" width="0.1524" layer="94"/>
</symbol>
<symbol name="HEAD-2X3-MALE">
<wire x1="-3.175" y1="4.445" x2="-1.905" y2="4.445" width="0.4064" layer="94"/>
<wire x1="3.175" y1="-4.445" x2="3.175" y2="4.445" width="0.4064" layer="94"/>
<wire x1="-3.175" y1="4.445" x2="-3.175" y2="3.175" width="0.4064" layer="94"/>
<wire x1="-3.175" y1="3.175" x2="-3.175" y2="-4.445" width="0.4064" layer="94"/>
<wire x1="3.175" y1="-4.445" x2="-3.175" y2="-4.445" width="0.4064" layer="94"/>
<text x="-3.81" y="-6.35" size="1.27" layer="96">&gt;VALUE</text>
<text x="-3.81" y="5.715" size="1.27" layer="95">&gt;NAME</text>
<pin name="1" x="-7.62" y="2.54" visible="pad" length="middle" direction="pas"/>
<pin name="3" x="-7.62" y="0" visible="pad" length="middle" direction="pas"/>
<pin name="2" x="7.62" y="2.54" visible="pad" length="middle" direction="pas" rot="R180"/>
<pin name="4" x="7.62" y="0" visible="pad" length="middle" direction="pas" rot="R180"/>
<wire x1="-3.175" y1="3.175" x2="-1.905" y2="4.445" width="0.4064" layer="94"/>
<wire x1="-1.905" y1="4.445" x2="3.175" y2="4.445" width="0.4064" layer="94"/>
<rectangle x1="-1.905" y1="1.905" x2="-0.635" y2="3.175" layer="94"/>
<rectangle x1="-1.905" y1="-0.635" x2="-0.635" y2="0.635" layer="94"/>
<rectangle x1="0.635" y1="-0.635" x2="1.905" y2="0.635" layer="94"/>
<rectangle x1="0.635" y1="1.905" x2="1.905" y2="3.175" layer="94"/>
<wire x1="-2.54" y1="2.54" x2="-1.27" y2="2.54" width="0.1524" layer="94"/>
<wire x1="-2.54" y1="0" x2="-1.27" y2="0" width="0.1524" layer="94"/>
<wire x1="1.27" y1="0" x2="2.54" y2="0" width="0.1524" layer="94"/>
<wire x1="1.27" y1="2.54" x2="2.54" y2="2.54" width="0.1524" layer="94"/>
<pin name="5" x="-7.62" y="-2.54" visible="pad" length="middle" direction="pas"/>
<pin name="6" x="7.62" y="-2.54" visible="pad" length="middle" direction="pas" rot="R180"/>
<rectangle x1="-1.905" y1="-3.175" x2="-0.635" y2="-1.905" layer="94"/>
<rectangle x1="0.635" y1="-3.175" x2="1.905" y2="-1.905" layer="94"/>
<wire x1="1.27" y1="-2.54" x2="2.54" y2="-2.54" width="0.1524" layer="94"/>
<wire x1="-3.175" y1="-2.54" x2="-1.905" y2="-2.54" width="0.1524" layer="94"/>
</symbol>
<symbol name="HEAD-2X5-MALE">
<wire x1="-3.175" y1="6.985" x2="-1.905" y2="6.985" width="0.4064" layer="94"/>
<wire x1="3.175" y1="-6.985" x2="3.175" y2="6.985" width="0.4064" layer="94"/>
<wire x1="-3.175" y1="6.985" x2="-3.175" y2="5.715" width="0.4064" layer="94"/>
<wire x1="-3.175" y1="5.715" x2="-3.175" y2="-6.985" width="0.4064" layer="94"/>
<wire x1="3.175" y1="-6.985" x2="-3.175" y2="-6.985" width="0.4064" layer="94"/>
<text x="-3.81" y="-9.525" size="1.27" layer="96">&gt;VALUE</text>
<text x="-3.81" y="8.255" size="1.27" layer="95">&gt;NAME</text>
<pin name="1" x="-7.62" y="5.08" visible="pad" length="middle" direction="pas"/>
<pin name="3" x="-7.62" y="2.54" visible="pad" length="middle" direction="pas"/>
<pin name="5" x="-7.62" y="0" visible="pad" length="middle" direction="pas"/>
<pin name="2" x="7.62" y="5.08" visible="pad" length="middle" direction="pas" rot="R180"/>
<pin name="4" x="7.62" y="2.54" visible="pad" length="middle" direction="pas" rot="R180"/>
<pin name="6" x="7.62" y="0" visible="pad" length="middle" direction="pas" rot="R180"/>
<pin name="7" x="-7.62" y="-2.54" visible="pad" length="middle" direction="pas"/>
<pin name="9" x="-7.62" y="-5.08" visible="pad" length="middle" direction="pas"/>
<pin name="8" x="7.62" y="-2.54" visible="pad" length="middle" direction="pas" rot="R180"/>
<pin name="10" x="7.62" y="-5.08" visible="pad" length="middle" direction="pas" rot="R180"/>
<wire x1="-3.175" y1="5.715" x2="-1.905" y2="6.985" width="0.4064" layer="94"/>
<wire x1="-1.905" y1="6.985" x2="3.175" y2="6.985" width="0.4064" layer="94"/>
<rectangle x1="-1.905" y1="4.445" x2="-0.635" y2="5.715" layer="94"/>
<wire x1="-2.54" y1="5.08" x2="-1.27" y2="5.08" width="0.1524" layer="94"/>
<rectangle x1="-1.905" y1="1.905" x2="-0.635" y2="3.175" layer="94"/>
<wire x1="-2.54" y1="2.54" x2="-1.27" y2="2.54" width="0.1524" layer="94"/>
<rectangle x1="-1.905" y1="-0.635" x2="-0.635" y2="0.635" layer="94"/>
<wire x1="-2.54" y1="0" x2="-1.27" y2="0" width="0.1524" layer="94"/>
<rectangle x1="-1.905" y1="-3.175" x2="-0.635" y2="-1.905" layer="94"/>
<wire x1="-2.54" y1="-2.54" x2="-1.27" y2="-2.54" width="0.1524" layer="94"/>
<rectangle x1="-1.905" y1="-5.715" x2="-0.635" y2="-4.445" layer="94"/>
<wire x1="-2.54" y1="-5.08" x2="-1.27" y2="-5.08" width="0.1524" layer="94"/>
<rectangle x1="0.635" y1="-5.715" x2="1.905" y2="-4.445" layer="94" rot="R180"/>
<wire x1="2.54" y1="-5.08" x2="1.27" y2="-5.08" width="0.1524" layer="94"/>
<rectangle x1="0.635" y1="-3.175" x2="1.905" y2="-1.905" layer="94" rot="R180"/>
<wire x1="2.54" y1="-2.54" x2="1.27" y2="-2.54" width="0.1524" layer="94"/>
<rectangle x1="0.635" y1="-0.635" x2="1.905" y2="0.635" layer="94" rot="R180"/>
<wire x1="2.54" y1="0" x2="1.27" y2="0" width="0.1524" layer="94"/>
<rectangle x1="0.635" y1="1.905" x2="1.905" y2="3.175" layer="94" rot="R180"/>
<wire x1="2.54" y1="2.54" x2="1.27" y2="2.54" width="0.1524" layer="94"/>
<rectangle x1="0.635" y1="4.445" x2="1.905" y2="5.715" layer="94" rot="R180"/>
<wire x1="2.54" y1="5.08" x2="1.27" y2="5.08" width="0.1524" layer="94"/>
</symbol>
<symbol name="HEAD-2X8-MALE">
<wire x1="-3.175" y1="10.795" x2="-1.905" y2="10.795" width="0.4064" layer="94"/>
<wire x1="3.175" y1="-10.795" x2="3.175" y2="10.795" width="0.4064" layer="94"/>
<wire x1="-3.175" y1="10.795" x2="-3.175" y2="9.525" width="0.4064" layer="94"/>
<wire x1="-3.175" y1="9.525" x2="-3.175" y2="-10.795" width="0.4064" layer="94"/>
<wire x1="3.175" y1="-10.795" x2="-3.175" y2="-10.795" width="0.4064" layer="94"/>
<text x="-3.175" y="-12.7" size="1.27" layer="96">&gt;VALUE</text>
<text x="-3.81" y="12.065" size="1.27" layer="95">&gt;NAME</text>
<pin name="1" x="-7.62" y="8.89" visible="pad" length="middle" direction="pas"/>
<pin name="3" x="-7.62" y="6.35" visible="pad" length="middle" direction="pas"/>
<pin name="5" x="-7.62" y="3.81" visible="pad" length="middle" direction="pas"/>
<pin name="2" x="7.62" y="8.89" visible="pad" length="middle" direction="pas" rot="R180"/>
<pin name="4" x="7.62" y="6.35" visible="pad" length="middle" direction="pas" rot="R180"/>
<pin name="6" x="7.62" y="3.81" visible="pad" length="middle" direction="pas" rot="R180"/>
<pin name="7" x="-7.62" y="1.27" visible="pad" length="middle" direction="pas"/>
<pin name="9" x="-7.62" y="-1.27" visible="pad" length="middle" direction="pas"/>
<pin name="8" x="7.62" y="1.27" visible="pad" length="middle" direction="pas" rot="R180"/>
<pin name="10" x="7.62" y="-1.27" visible="pad" length="middle" direction="pas" rot="R180"/>
<wire x1="-3.175" y1="9.525" x2="-1.905" y2="10.795" width="0.4064" layer="94"/>
<wire x1="-1.905" y1="10.795" x2="3.175" y2="10.795" width="0.4064" layer="94"/>
<rectangle x1="-1.905" y1="8.255" x2="-0.635" y2="9.525" layer="94"/>
<wire x1="-2.54" y1="8.89" x2="-1.27" y2="8.89" width="0.1524" layer="94"/>
<rectangle x1="-1.905" y1="5.715" x2="-0.635" y2="6.985" layer="94"/>
<wire x1="-2.54" y1="6.35" x2="-1.27" y2="6.35" width="0.1524" layer="94"/>
<rectangle x1="-1.905" y1="3.175" x2="-0.635" y2="4.445" layer="94"/>
<wire x1="-2.54" y1="3.81" x2="-1.27" y2="3.81" width="0.1524" layer="94"/>
<rectangle x1="-1.905" y1="0.635" x2="-0.635" y2="1.905" layer="94"/>
<wire x1="-2.54" y1="1.27" x2="-1.27" y2="1.27" width="0.1524" layer="94"/>
<rectangle x1="-1.905" y1="-1.905" x2="-0.635" y2="-0.635" layer="94"/>
<wire x1="-2.54" y1="-1.27" x2="-1.27" y2="-1.27" width="0.1524" layer="94"/>
<rectangle x1="0.635" y1="-1.905" x2="1.905" y2="-0.635" layer="94" rot="R180"/>
<wire x1="2.54" y1="-1.27" x2="1.27" y2="-1.27" width="0.1524" layer="94"/>
<rectangle x1="0.635" y1="0.635" x2="1.905" y2="1.905" layer="94" rot="R180"/>
<wire x1="2.54" y1="1.27" x2="1.27" y2="1.27" width="0.1524" layer="94"/>
<rectangle x1="0.635" y1="3.175" x2="1.905" y2="4.445" layer="94" rot="R180"/>
<wire x1="2.54" y1="3.81" x2="1.27" y2="3.81" width="0.1524" layer="94"/>
<rectangle x1="0.635" y1="5.715" x2="1.905" y2="6.985" layer="94" rot="R180"/>
<wire x1="2.54" y1="6.35" x2="1.27" y2="6.35" width="0.1524" layer="94"/>
<rectangle x1="0.635" y1="8.255" x2="1.905" y2="9.525" layer="94" rot="R180"/>
<wire x1="2.54" y1="8.89" x2="1.27" y2="8.89" width="0.1524" layer="94"/>
<pin name="11" x="-7.62" y="-3.81" visible="pad" length="middle" direction="pas"/>
<pin name="12" x="7.62" y="-3.81" visible="pad" length="middle" direction="pas" rot="R180"/>
<pin name="13" x="-7.62" y="-6.35" visible="pad" length="middle" direction="pas"/>
<pin name="14" x="7.62" y="-6.35" visible="pad" length="middle" direction="pas" rot="R180"/>
<pin name="15" x="-7.62" y="-8.89" visible="pad" length="middle" direction="pas"/>
<pin name="16" x="7.62" y="-8.89" visible="pad" length="middle" direction="pas" rot="R180"/>
<rectangle x1="-1.905" y1="-4.445" x2="-0.635" y2="-3.175" layer="94"/>
<rectangle x1="-1.905" y1="-6.985" x2="-0.635" y2="-5.715" layer="94"/>
<rectangle x1="-1.905" y1="-9.525" x2="-0.635" y2="-8.255" layer="94"/>
<rectangle x1="0.635" y1="-9.525" x2="1.905" y2="-8.255" layer="94"/>
<rectangle x1="0.635" y1="-6.985" x2="1.905" y2="-5.715" layer="94"/>
<rectangle x1="0.635" y1="-4.445" x2="1.905" y2="-3.175" layer="94"/>
<wire x1="-2.54" y1="-3.81" x2="-1.27" y2="-3.81" width="0.1524" layer="94"/>
<wire x1="-2.54" y1="-6.35" x2="-1.27" y2="-6.35" width="0.1524" layer="94"/>
<wire x1="-2.54" y1="-8.89" x2="-1.27" y2="-8.89" width="0.1524" layer="94"/>
<wire x1="1.27" y1="-8.89" x2="2.54" y2="-8.89" width="0.1524" layer="94"/>
<wire x1="1.27" y1="-6.35" x2="2.54" y2="-6.35" width="0.1524" layer="94"/>
<wire x1="1.27" y1="-3.81" x2="2.54" y2="-3.81" width="0.1524" layer="94"/>
</symbol>
</symbols>
<devicesets>
<deviceset name="NELTRON-2228BG" prefix="JUMP">
<description>Jumper RM2,54 zatvorený čierny Au výška 6,40mm&lt;br&gt;
&lt;A href=http://www.sos.sk/a_info/resource/f/2228xG.pdf&gt;Datasheet&lt;/a&gt;</description>
<gates>
<gate name="G$1" symbol="JUMP-PREPOJKA" x="0" y="0"/>
</gates>
<devices>
<device name="">
<technologies>
<technology name="">
<attribute name="MANUFACTURER" value="Neltron" constant="no"/>
<attribute name="MPN" value="2228BG" constant="no"/>
<attribute name="OC_FARNELL" value="" constant="no"/>
<attribute name="OC_SOS" value="106309" constant="no"/>
<attribute name="VALUE" value="Black" constant="no"/>
</technology>
</technologies>
</device>
</devices>
</deviceset>
<deviceset name="TECONN-826629-2" prefix="XJ">
<description>Header, AMPMODU II  series, 1x2 way, Vertical, THD, 2.54 pitch, Gold plated, TE Connectivity&lt;br&gt;
&lt;a href=http://www.te.com/catalog/pn/en/825433-2&gt;Product page&lt;/a&gt;, &lt;a href=http://www.te.com/commerce/DocumentDelivery/DDEController?Action=srchrtrv&amp;DocNm=825433&amp;DocType=Customer+Drawing&amp;DocLang=English&amp;PartCntxt=825433-2&gt;Drawing&lt;/a&gt;</description>
<gates>
<gate name="G$1" symbol="JUMP-1X2" x="0" y="0"/>
</gates>
<devices>
<device name="" package="HEADER-1X2-MALE-1MM">
<connects>
<connect gate="G$1" pin="1" pad="1"/>
<connect gate="G$1" pin="2" pad="2"/>
</connects>
<technologies>
<technology name="">
<attribute name="MANUFACTURER" value="TECONN" constant="no"/>
<attribute name="MPN" value="826629-2" constant="no"/>
<attribute name="OC_DISTRELEC" value="122350" constant="no"/>
<attribute name="OC_FARNELL" value="3418285" constant="no"/>
<attribute name="OC_MOUSER" value="571-826629-2" constant="no"/>
<attribute name="OC_SOS" value="53917" constant="no"/>
<attribute name="OC_TME" value="826629-2" constant="no"/>
<attribute name="VALUE" value="JMP2" constant="no"/>
</technology>
</technologies>
</device>
</devices>
</deviceset>
<deviceset name="TECONN-826629-3" prefix="XJ" uservalue="yes">
<description>Header, AMPMODU II  series, 1x3 way, Vertical, THD, 2.54 pitch, Gold plated, TE Connectivity&lt;br&gt;
&lt;a href=http://www.te.com/catalog/pn/en/826629-3&gt;Product page&lt;/a&gt;, &lt;a href=http://www.te.com/commerce/DocumentDelivery/DDEController?Action=srchrtrv&amp;DocNm=826629&amp;DocType=Customer+Drawing&amp;DocLang=English&amp;PartCntxt=826629-3&gt;Drawing&lt;/a&gt;</description>
<gates>
<gate name="G$1" symbol="JUMP-1X3" x="0" y="0"/>
</gates>
<devices>
<device name="" package="HEADER-1X3-MALE-1MM">
<connects>
<connect gate="G$1" pin="1" pad="1"/>
<connect gate="G$1" pin="2" pad="2"/>
<connect gate="G$1" pin="3" pad="3"/>
</connects>
<technologies>
<technology name="">
<attribute name="MANUFACTURER" value="TECONN" constant="no"/>
<attribute name="MPN" value="826629-3" constant="no"/>
<attribute name="OC_DISTRELEC" value="" constant="no"/>
<attribute name="OC_FARNELL" value="3418297" constant="no"/>
<attribute name="OC_MOUSER" value="571-826629-3" constant="no"/>
<attribute name="OC_SOS" value="" constant="no"/>
<attribute name="OC_TME" value="826629-3" constant="no"/>
<attribute name="VALUE" value="JMP3" constant="no"/>
</technology>
</technologies>
</device>
</devices>
</deviceset>
<deviceset name="TECONN-826629-4" prefix="XJ" uservalue="yes">
<description>Header, AMPMODU II  series, 1x4 way, Vertical, THD, 2.54 pitch, Gold plated, TE Connectivity&lt;br&gt;
&lt;a href=http://www.te.com/catalog/pn/en/826629-4&gt;Product page&lt;/a&gt;, &lt;a href=http://www.te.com/commerce/DocumentDelivery/DDEController?Action=srchrtrv&amp;DocNm=826629&amp;DocType=Customer+Drawing&amp;DocLang=English&amp;PartCntxt=826629-4&gt;Drawing&lt;/a&gt;</description>
<gates>
<gate name="G$1" symbol="JUMP-1X4" x="0" y="0"/>
</gates>
<devices>
<device name="" package="HEADER-1X4-MALE-1MM">
<connects>
<connect gate="G$1" pin="1" pad="1"/>
<connect gate="G$1" pin="2" pad="2"/>
<connect gate="G$1" pin="3" pad="3"/>
<connect gate="G$1" pin="4" pad="4"/>
</connects>
<technologies>
<technology name="">
<attribute name="MANUFACTURER" value="TECONN" constant="no"/>
<attribute name="MPN" value="826629-4" constant="no"/>
<attribute name="OC_DISTRELEC" value="122365" constant="no"/>
<attribute name="OC_FARNELL" value="3418303" constant="no"/>
<attribute name="OC_MOUSER" value="571-826629-4" constant="no"/>
<attribute name="OC_SOS" value="136718" constant="no"/>
<attribute name="OC_TME" value="826629-4" constant="no"/>
<attribute name="VALUE" value="JMP4" constant="no"/>
</technology>
</technologies>
</device>
</devices>
</deviceset>
<deviceset name="TECONN-826632-3" prefix="XJ">
<description>Header, AMPMODU II  series, 2x3 way, Vertical, THD, 2.54 pitch, Gold plated, TE Connectivity&lt;br&gt;
&lt;a href=http://www.te.com/catalog/pn/en/826632-3&gt;Product page&lt;/a&gt;, &lt;a href=http://www.te.com/commerce/DocumentDelivery/DDEController?Action=srchrtrv&amp;DocNm=826632&amp;DocType=Customer+Drawing&amp;DocLang=English&amp;PartCntxt=826632-3&gt;Drawing&lt;/a&gt;</description>
<gates>
<gate name="G$1" symbol="JUMP-2X3" x="0" y="0"/>
</gates>
<devices>
<device name="" package="HEADER-2X3-MALE-1MM">
<connects>
<connect gate="G$1" pin="1" pad="1"/>
<connect gate="G$1" pin="2" pad="2"/>
<connect gate="G$1" pin="3" pad="3"/>
<connect gate="G$1" pin="4" pad="4"/>
<connect gate="G$1" pin="5" pad="5"/>
<connect gate="G$1" pin="6" pad="6"/>
</connects>
<technologies>
<technology name="">
<attribute name="MANUFACTURER" value="TECONN" constant="no"/>
<attribute name="MPN" value="826632-3" constant="no"/>
<attribute name="OC_DISTRELEC" value="127244" constant="no"/>
<attribute name="OC_FARNELL" value="3418492" constant="no"/>
<attribute name="OC_MOUSER" value="571-826632-3" constant="no"/>
<attribute name="OC_SOS" value="" constant="no"/>
<attribute name="OC_TME" value="826632-3" constant="no"/>
<attribute name="VALUE" value="JMP6" constant="no"/>
</technology>
</technologies>
</device>
</devices>
</deviceset>
</devicesets>
</library>
</drawing>
</eagle>
