<?xml version="1.0" encoding="utf-8"?>
<!DOCTYPE eagle SYSTEM "eagle.dtd">
<eagle version="6.4">
<drawing>
<settings>
<setting alwaysvectorfont="no"/>
<setting verticaltext="up"/>
</settings>
<grid distance="0.635" unitdist="mm" unit="mm" style="dots" multiple="4" display="yes" altdistance="0.3175" altunitdist="mm" altunit="mm"/>
<layers>
<layer number="1" name="Top" color="4" fill="1" visible="yes" active="yes"/>
<layer number="16" name="Bottom" color="1" fill="1" visible="yes" active="yes"/>
<layer number="17" name="Pads" color="5" fill="1" visible="yes" active="yes"/>
<layer number="18" name="Vias" color="8" fill="1" visible="yes" active="yes"/>
<layer number="19" name="Unrouted" color="15" fill="1" visible="yes" active="yes"/>
<layer number="20" name="Dimension" color="15" fill="1" visible="yes" active="yes"/>
<layer number="21" name="tPlace" color="14" fill="1" visible="yes" active="yes"/>
<layer number="22" name="bPlace" color="6" fill="1" visible="yes" active="yes"/>
<layer number="23" name="tOrigins" color="7" fill="1" visible="yes" active="yes"/>
<layer number="24" name="bOrigins" color="7" fill="1" visible="yes" active="yes"/>
<layer number="25" name="tNames" color="14" fill="1" visible="yes" active="yes"/>
<layer number="26" name="bNames" color="6" fill="1" visible="yes" active="yes"/>
<layer number="27" name="tValues" color="14" fill="1" visible="yes" active="yes"/>
<layer number="28" name="bValues" color="6" fill="1" visible="yes" active="yes"/>
<layer number="29" name="tStop" color="13" fill="3" visible="yes" active="yes"/>
<layer number="30" name="bStop" color="5" fill="6" visible="yes" active="yes"/>
<layer number="31" name="tCream" color="7" fill="4" visible="yes" active="yes"/>
<layer number="32" name="bCream" color="7" fill="5" visible="yes" active="yes"/>
<layer number="33" name="tFinish" color="6" fill="3" visible="yes" active="yes"/>
<layer number="34" name="bFinish" color="6" fill="6" visible="yes" active="yes"/>
<layer number="35" name="tGlue" color="7" fill="4" visible="yes" active="yes"/>
<layer number="36" name="bGlue" color="7" fill="5" visible="yes" active="yes"/>
<layer number="37" name="tTest" color="7" fill="1" visible="yes" active="yes"/>
<layer number="38" name="bTest" color="7" fill="1" visible="yes" active="yes"/>
<layer number="39" name="tKeepout" color="4" fill="11" visible="yes" active="yes"/>
<layer number="40" name="bKeepout" color="1" fill="11" visible="yes" active="yes"/>
<layer number="41" name="tRestrict" color="4" fill="10" visible="yes" active="yes"/>
<layer number="42" name="bRestrict" color="1" fill="10" visible="yes" active="yes"/>
<layer number="43" name="vRestrict" color="2" fill="10" visible="yes" active="yes"/>
<layer number="44" name="Drills" color="7" fill="1" visible="yes" active="yes"/>
<layer number="45" name="Holes" color="7" fill="1" visible="yes" active="yes"/>
<layer number="46" name="Milling" color="3" fill="1" visible="yes" active="yes"/>
<layer number="47" name="Measures" color="7" fill="1" visible="yes" active="yes"/>
<layer number="48" name="Document" color="7" fill="1" visible="yes" active="yes"/>
<layer number="49" name="Reference" color="7" fill="1" visible="yes" active="yes"/>
<layer number="51" name="tDocu" color="11" fill="1" visible="yes" active="yes"/>
<layer number="52" name="bDocu" color="3" fill="1" visible="yes" active="yes"/>
<layer number="91" name="Nets" color="1" fill="1" visible="yes" active="yes"/>
<layer number="92" name="Busses" color="1" fill="1" visible="yes" active="yes"/>
<layer number="93" name="Pins" color="2" fill="1" visible="yes" active="yes"/>
<layer number="94" name="Symbols" color="4" fill="1" visible="yes" active="yes"/>
<layer number="95" name="Names" color="12" fill="1" visible="yes" active="yes"/>
<layer number="96" name="Values" color="15" fill="1" visible="yes" active="yes"/>
<layer number="97" name="Info" color="5" fill="1" visible="yes" active="yes"/>
<layer number="98" name="Guide" color="3" fill="1" visible="yes" active="yes"/>
</layers>
<library>
<packages>
<package name="SOIC127P600X175-8N">
<description>EIA: SO-8, JEDEC: MS-012AA, IPC: SOIC127P600x175-8N</description>
<text x="0" y="-2.2225" size="1.27" layer="25" rot="R90">&gt;NAME</text>
<text x="1.27" y="-2.2225" size="1.27" layer="27" rot="R90">&gt;VALUE</text>
<wire x1="3.9" y1="2.9" x2="3.9" y2="-2.9" width="0.1998" layer="39"/>
<wire x1="3.9" y1="-2.9" x2="-3.9" y2="-2.9" width="0.1998" layer="39"/>
<wire x1="-3.9" y1="-2.9" x2="-3.9" y2="2.9" width="0.1998" layer="39"/>
<wire x1="-3.9" y1="2.9" x2="3.9" y2="2.9" width="0.1998" layer="39"/>
<wire x1="1.9" y1="-2.45" x2="-1.4" y2="-2.45" width="0.2032" layer="51"/>
<wire x1="-1.4" y1="-2.45" x2="-1.9" y2="-2.45" width="0.2032" layer="51"/>
<wire x1="-1.9" y1="-2.45" x2="-1.9" y2="2.45" width="0.2032" layer="51"/>
<wire x1="-1.9" y1="2.45" x2="-1.4" y2="2.45" width="0.2032" layer="51"/>
<wire x1="-1.4" y1="2.45" x2="1.9" y2="2.45" width="0.2032" layer="51"/>
<wire x1="1.9" y1="2.45" x2="1.9" y2="-2.45" width="0.2032" layer="51"/>
<wire x1="-1.4" y1="-2.45" x2="-1.4" y2="2.45" width="0.2032" layer="51"/>
<smd name="2" x="-2.6" y="0.635" dx="0.6" dy="2.2" layer="1" roundness="100" rot="R270"/>
<smd name="7" x="2.6" y="0.635" dx="0.6" dy="2.2" layer="1" roundness="100" rot="R270"/>
<smd name="1" x="-2.6" y="1.905" dx="0.6" dy="2.2" layer="1" roundness="100" rot="R270"/>
<smd name="3" x="-2.6" y="-0.635" dx="0.6" dy="2.2" layer="1" roundness="100" rot="R270"/>
<smd name="4" x="-2.6" y="-1.905" dx="0.6" dy="2.2" layer="1" roundness="100" rot="R270"/>
<smd name="8" x="2.6" y="1.905" dx="0.6" dy="2.2" layer="1" roundness="100" rot="R270"/>
<smd name="6" x="2.6" y="-0.635" dx="0.6" dy="2.2" layer="1" roundness="100" rot="R270"/>
<smd name="5" x="2.6" y="-1.905" dx="0.6" dy="2.2" layer="1" roundness="100" rot="R270"/>
<rectangle x1="-2.69515" y1="1.35495" x2="-2.20495" y2="2.45505" layer="51" rot="R270"/>
<rectangle x1="-2.69515" y1="0.08495" x2="-2.20495" y2="1.18505" layer="51" rot="R270"/>
<rectangle x1="-2.69515" y1="-1.18505" x2="-2.20495" y2="-0.08495" layer="51" rot="R270"/>
<rectangle x1="-2.69515" y1="-2.45505" x2="-2.20495" y2="-1.35495" layer="51" rot="R270"/>
<rectangle x1="2.20495" y1="-2.45505" x2="2.69515" y2="-1.35495" layer="51" rot="R270"/>
<rectangle x1="2.20495" y1="-1.18505" x2="2.69515" y2="-0.08495" layer="51" rot="R270"/>
<rectangle x1="2.20495" y1="0.08495" x2="2.69515" y2="1.18505" layer="51" rot="R270"/>
<rectangle x1="2.20495" y1="1.35495" x2="2.69515" y2="2.45505" layer="51" rot="R270"/>
<circle x="-2.2225" y="2.8575" radius="0.254" width="0" layer="21"/>
<wire x1="-1.27" y1="2.45" x2="1.27" y2="2.45" width="0.2032" layer="21"/>
<wire x1="-1.27" y1="-2.45" x2="1.27" y2="-2.45" width="0.2032" layer="21"/>
<wire x1="1.265" y1="2.45" x2="1.265" y2="-2.45" width="0.2032" layer="21"/>
<wire x1="-1.265" y1="-2.45" x2="-1.265" y2="2.45" width="0.2032" layer="21"/>
<rectangle x1="-0.635" y1="-0.635" x2="0.635" y2="0.635" layer="35"/>
</package>
</packages>
<symbols>
<symbol name="OPAMP_SIGNLE">
<text x="-2.54" y="-0.635" size="1.27" layer="95">&gt;NAME</text>
<text x="0.635" y="-3.81" size="1.27" layer="96">&gt;VALUE</text>
<pin name="IN-" x="-7.62" y="-2.54" visible="pad" length="short" direction="in"/>
<pin name="IN+" x="-7.62" y="2.54" visible="pad" length="short" direction="in"/>
<wire x1="-5.08" y1="-5.08" x2="-5.08" y2="5.08" width="0.254" layer="94"/>
<wire x1="-5.08" y1="5.08" x2="5.08" y2="0" width="0.254" layer="94"/>
<pin name="OUT" x="7.62" y="0" visible="pad" length="short" direction="out" rot="R180"/>
<wire x1="5.08" y1="0" x2="-5.08" y2="-5.08" width="0.254" layer="94"/>
<text x="-4.445" y="1.905" size="1.27" layer="94">+</text>
<text x="-4.445" y="-3.175" size="1.27" layer="94">-</text>
</symbol>
<symbol name="OPAMP_SINGLE_POWERED">
<pin name="V+" x="0" y="5.08" visible="pad" length="point" direction="pwr" rot="R270"/>
<pin name="V-" x="0" y="-5.08" visible="off" length="point" direction="pwr" rot="R90"/>
<text x="-2.54" y="-0.635" size="1.27" layer="95">&gt;NAME</text>
<text x="2.54" y="-3.175" size="1.27" layer="96">&gt;VALUE</text>
<pin name="IN-" x="-7.62" y="-2.54" visible="pad" length="short" direction="in"/>
<pin name="IN+" x="-7.62" y="2.54" visible="pad" length="short" direction="in"/>
<wire x1="-5.08" y1="-5.08" x2="-5.08" y2="5.08" width="0.254" layer="94"/>
<wire x1="-5.08" y1="5.08" x2="0" y2="2.54" width="0.254" layer="94"/>
<pin name="OUT" x="7.62" y="0" visible="pad" length="short" direction="out" rot="R180"/>
<wire x1="0" y1="2.54" x2="5.08" y2="0" width="0.254" layer="94"/>
<wire x1="5.08" y1="0" x2="0" y2="-2.54" width="0.254" layer="94"/>
<text x="-4.445" y="1.905" size="1.27" layer="94">+</text>
<text x="-4.445" y="-3.175" size="1.27" layer="94">-</text>
<wire x1="0" y1="-2.54" x2="-5.08" y2="-5.08" width="0.254" layer="94"/>
<wire x1="0" y1="-5.08" x2="0" y2="-2.54" width="0.1524" layer="94"/>
<wire x1="0" y1="5.08" x2="0" y2="2.54" width="0.1524" layer="94"/>
<text x="1.905" y="-5.08" size="1.27" layer="94" rot="R90">V-</text>
<text x="1.905" y="3.175" size="1.27" layer="94" rot="R90">V+</text>
</symbol>
<symbol name="OPAMP_POWER">
<pin name="V+" x="0" y="5.08" visible="pad" length="point" direction="pwr" rot="R270"/>
<pin name="V-" x="0" y="-5.08" visible="pad" length="point" direction="pwr" rot="R90"/>
<wire x1="0" y1="-5.08" x2="0" y2="-2.54" width="0.1524" layer="94"/>
<wire x1="0" y1="5.08" x2="0" y2="2.54" width="0.1524" layer="94"/>
<text x="1.905" y="-5.08" size="1.27" layer="94" rot="R90">V-</text>
<text x="1.905" y="3.175" size="1.27" layer="94" rot="R90">V+</text>
</symbol>
</symbols>
<devicesets>
<deviceset name="STM-LM*?" prefix="IC">
<description>DUAL 2–INPUT Operational Amplifier, General purposes, STM&lt;br&gt;
&lt;a href=http://www.st.com/st-web-ui/static/active/en/resource/technical/document/datasheet/CD00000464.pdf&gt;Datasheet&lt;/a&gt;</description>
<gates>
<gate name="A" symbol="OPAMP_SIGNLE" x="-7.62" y="0" swaplevel="1"/>
<gate name="PWR" symbol="OPAMP_POWER" x="-7.62" y="0" addlevel="must"/>
<gate name="B" symbol="OPAMP_SIGNLE" x="10.16" y="0" swaplevel="1"/>
</gates>
<devices>
<device name="D" package="SOIC127P600X175-8N">
<connects>
<connect gate="A" pin="IN+" pad="3"/>
<connect gate="A" pin="IN-" pad="2"/>
<connect gate="A" pin="OUT" pad="1"/>
<connect gate="B" pin="IN+" pad="5"/>
<connect gate="B" pin="IN-" pad="6"/>
<connect gate="B" pin="OUT" pad="7"/>
<connect gate="PWR" pin="V+" pad="8"/>
<connect gate="PWR" pin="V-" pad="4"/>
</connects>
<technologies>
<technology name="158">
<attribute name="COMMENT" value="Ib[max]: 300nA;Vcc: +3 to +32V/+-1.5 to +-16V" constant="no"/>
<attribute name="MPN" value="LM158D" constant="no"/>
<attribute name="OC_FARNELL" value="" constant="no"/>
<attribute name="OC_NEWARK" value="" constant="no"/>
<attribute name="OC_SOS" value="W043269" constant="no"/>
<attribute name="OC_TME" value="" constant="no"/>
<attribute name="Manufacturer" value="STM" constant="no"/>
<attribute name="VALUE" value="LM158" constant="no"/>
</technology>
<technology name="258">
<attribute name="COMMENT" value="Ib[max]: 150nA;Vcc: +3 to +32V/+-1.5 to +-16V" constant="no"/>
<attribute name="MPN" value="LM258D" constant="no"/>
<attribute name="OC_FARNELL" value="" constant="no"/>
<attribute name="OC_NEWARK" value="" constant="no"/>
<attribute name="OC_SOS" value="37647" constant="no"/>
<attribute name="OC_TME" value="" constant="no"/>
<attribute name="Manufacturer" value="STM" constant="no"/>
<attribute name="VALUE" value="LM258" constant="no"/>
</technology>
<technology name="258A">
<attribute name="COMMENT" value="" constant="no"/>
<attribute name="MPN" value="LM258AD" constant="no"/>
<attribute name="OC_FARNELL" value="" constant="no"/>
<attribute name="OC_NEWARK" value="" constant="no"/>
<attribute name="OC_SOS" value="W010157" constant="no"/>
<attribute name="OC_TME" value="" constant="no"/>
<attribute name="Manufacturer" value="STM" constant="no"/>
<attribute name="VALUE" value="LM258A" constant="no"/>
</technology>
<technology name="358">
<attribute name="COMMENT" value="Ib[max]: 300nA;Vcc: +3 to +32V/+-1.5 to +-16V" constant="no"/>
<attribute name="MPN" value="LM358D" constant="no"/>
<attribute name="OC_FARNELL" value="" constant="no"/>
<attribute name="OC_NEWARK" value="" constant="no"/>
<attribute name="OC_SOS" value="19561" constant="no"/>
<attribute name="OC_TME" value="LM358D/ST" constant="no"/>
<attribute name="Manufacturer" value="STM" constant="no"/>
<attribute name="VALUE" value="LM358" constant="no"/>
</technology>
<technology name="358A">
<attribute name="COMMENT" value="" constant="no"/>
<attribute name="MPN" value="LM358AD" constant="no"/>
<attribute name="OC_FARNELL" value="" constant="no"/>
<attribute name="OC_NEWARK" value="" constant="no"/>
<attribute name="OC_SOS" value="W005404" constant="no"/>
<attribute name="OC_TME" value="" constant="no"/>
<attribute name="Manufacturer" value="STM" constant="no"/>
<attribute name="VALUE" value="LM358A" constant="no"/>
</technology>
</technologies>
</device>
</devices>
</deviceset>
<deviceset name="STM-TL082C*?" prefix="IC">
<description>DUAL 2–INPUT JFET Operational Amplifier, General purposes, STM&lt;br&gt;
&lt;a href=http://www.st.com/st-web-ui/static/active/en/resource/technical/document/datasheet/CD00000492.pdf&gt;Datasheet&lt;/a&gt;</description>
<gates>
<gate name="A" symbol="OPAMP_SIGNLE" x="-10.16" y="0" swaplevel="1"/>
<gate name="B" symbol="OPAMP_SIGNLE" x="10.16" y="0" swaplevel="1"/>
<gate name="PWR" symbol="OPAMP_POWER" x="-10.16" y="0" addlevel="must"/>
</gates>
<devices>
<device name="D" package="SOIC127P600X175-8N">
<connects>
<connect gate="A" pin="IN+" pad="3"/>
<connect gate="A" pin="IN-" pad="2"/>
<connect gate="A" pin="OUT" pad="1"/>
<connect gate="B" pin="IN+" pad="5"/>
<connect gate="B" pin="IN-" pad="6"/>
<connect gate="B" pin="OUT" pad="7"/>
<connect gate="PWR" pin="V+" pad="8"/>
<connect gate="PWR" pin="V-" pad="4"/>
</connects>
<technologies>
<technology name="">
<attribute name="COMMENT" value="" constant="no"/>
<attribute name="MPN" value="TL082CD" constant="no"/>
<attribute name="OC_DISTRELEC" value="663227" constant="no"/>
<attribute name="OC_FARNELL" value="1467665" constant="no"/>
<attribute name="OC_MOUSER" value="" constant="no"/>
<attribute name="OC_SOS" value="" constant="no"/>
<attribute name="OC_TME" value="" constant="no"/>
<attribute name="Manufacturer" value="STM" constant="no"/>
<attribute name="VALUE" value="TL082" constant="no"/>
</technology>
</technologies>
</device>
</devices>
</deviceset>
</devicesets>
</library>
</drawing>
</eagle>
