
0                         0
2.0000000000000003E-6     2.0377826155873893E-6
4.000000000000001E-6      4.0343218117380716E-6
6.0E-6                    5.989623323860294E-6
8.000000000000001E-6      7.903692658171883E-6
1.0E-5                    9.776535098625602E-6
1.2E-5                    1.1608155713689777E-5
1.4000000000000001E-5     1.3398559362983664E-5
1.6000000000000003E-5     1.5147750703768042E-5
1.8000000000000004E-5     1.685573419729025E-5
2.0E-5                    1.852251411498449E-5
2.2E-5                    2.0148094544526448E-5
2.4E-5                    2.173247939574321E-5
2.6000000000000002E-5     2.3275672406377102E-5
2.8000000000000003E-5     2.47776771477049E-5
3.0000000000000008E-5     2.623849703001122E-5
3.2000000000000005E-5     2.7658135307916884E-5
3.4000000000000007E-5     2.9036595085560955E-5
3.600000000000001E-5      3.037387932163841E-5
3.8E-5                    3.1669990834291396E-5
4.0E-5                    3.2924932305855006E-5
4.2E-5                    3.413870628745781E-5
4.4E-5                    3.531131520347611E-5
4.6E-5                    3.644276135584338E-5
4.8E-5                    3.75330469282129E-5
5.0E-5                    3.858217398997568E-5
5.2000000000000004E-5     3.959014450013129E-5
5.4000000000000005E-5     4.055696031101428E-5
5.6000000000000006E-5     4.14826231718737E-5
5.800000000000001E-5      4.2367134732307555E-5
6.0000000000000015E-5     4.3210496545550636E-5
6.200000000000002E-5      4.401271007161653E-5
6.400000000000001E-5      4.477377668029397E-5
6.600000000000002E-5      4.549369765399704E-5
6.800000000000001E-5      4.6172474190468634E-5
7.0E-5                    4.681010740533946E-5
7.200000000000002E-5      4.7406598334539703E-5
7.4E-5                    4.7961947936564954E-5
7.6E-5                    4.847615709459589E-5
7.800000000000001E-5      4.894922661847258E-5
8.0E-5                    4.93811572465212E-5
8.200000000000001E-5      4.977194964723649E-5
8.4E-5                    5.012160442081626E-5
8.600000000000002E-5      5.043012210055098E-5
8.8E-5                    5.069750315406606E-5
9.000000000000002E-5      5.092374798441893E-5
9.2E-5                    5.110885693105002E-5
9.4E-5                    5.125283027058631E-5
9.6E-5                    5.135566821749955E-5
9.8E-5                    5.141737092461841E-5
1.0E-4                    5.1437938483493875E-5
