[Info]
Version 1
Dimension 2
NumNodes 25
Num3DElements 0
Num2DElements 16
Num1DElements 16
NumNodeBC 0
NumSaveNodes 0
NumSaveElements 0
Num 2d-line      : 16
Num 2d-line,quad : 0
Num 3d-line      : 0
Num 3d-line,quad : 0
Num triangle     : 0
Num triangle,quad: 0
Num quadr        : 16
Num quadr,quad   : 0
Num tetra        : 0
Num tetra,quad   : 0
Num brick        : 0
Num brick,quad   : 0
Num pyramid      : 0
Num pyramid,quad : 0
Num wedge        : 0
Num wedge,quad   : 0

[Nodes]
#NodeNr x-coord y-coord z-coord
       1  0.0000000000000e+00  0.0000000000000e+00  0.0000000000000e+00
       2  2.5000000000000e-01  0.0000000000000e+00  0.0000000000000e+00
       3  2.5000000000000e-01  2.5000000000000e-01  0.0000000000000e+00
       4  0.0000000000000e+00  2.5000000000000e-01  0.0000000000000e+00
       5  5.0000000000000e-01  0.0000000000000e+00  0.0000000000000e+00
       6  5.0000000000000e-01  2.5000000000000e-01  0.0000000000000e+00
       7  2.5000000000000e-01  5.0000000000000e-01  0.0000000000000e+00
       8  0.0000000000000e+00  5.0000000000000e-01  0.0000000000000e+00
       9  2.5000000000000e-01  7.5000000000000e-01  0.0000000000000e+00
      10  0.0000000000000e+00  7.5000000000000e-01  0.0000000000000e+00
      11  2.5000000000000e-01  1.0000000000000e+00  0.0000000000000e+00
      12  0.0000000000000e+00  1.0000000000000e+00  0.0000000000000e+00
      13  7.5000000000000e-01  0.0000000000000e+00  0.0000000000000e+00
      14  7.5000000000000e-01  2.5000000000000e-01  0.0000000000000e+00
      15  1.0000000000000e+00  0.0000000000000e+00  0.0000000000000e+00
      16  1.0000000000000e+00  2.5000000000000e-01  0.0000000000000e+00
      17  5.0000000000000e-01  5.0000000000000e-01  0.0000000000000e+00
      18  5.0000000000000e-01  7.5000000000000e-01  0.0000000000000e+00
      19  5.0000000000000e-01  1.0000000000000e+00  0.0000000000000e+00
      20  7.5000000000000e-01  5.0000000000000e-01  0.0000000000000e+00
      21  7.5000000000000e-01  7.5000000000000e-01  0.0000000000000e+00
      22  7.5000000000000e-01  1.0000000000000e+00  0.0000000000000e+00
      23  1.0000000000000e+00  5.0000000000000e-01  0.0000000000000e+00
      24  1.0000000000000e+00  7.5000000000000e-01  0.0000000000000e+00
      25  1.0000000000000e+00  1.0000000000000e+00  0.0000000000000e+00

[3D Elements]
#ElemNr  ElemType  NrOfNodes  Level
#Node1 Node2 ... NodeNrOfNodes

[2D Elements]
#ElemNr  ElemType  NrOfNodes  Level
#Node1 Node2 ... NodeNrOfNodes
1 6 4 element_x1_y1
1 2 3 4
3 6 4 element_x1_y2
4 3 7 8
4 6 4 element_x1_y3
8 7 9 10
5 6 4 element_x1_y4
10 9 11 12
2 6 4 element_x2_y1
2 5 6 3
8 6 4 element_x2_y2
3 6 17 7
9 6 4 element_x2_y3
7 17 18 9
10 6 4 element_x2_y4
9 18 19 11
6 6 4 element_x3_y1
5 13 14 6
11 6 4 element_x3_y2
6 14 20 17
12 6 4 element_x3_y3
17 20 21 18
13 6 4 element_x3_y4
18 21 22 19
7 6 4 element_x4_y1
13 15 16 14
14 6 4 element_x4_y2
14 16 23 20
15 6 4 element_x4_y3
20 23 24 21
16 6 4 element_x4_y4
21 24 25 22

[1D Elements]
#ElemNr  ElemType  NrOfNodes  Level
#Node1 Node2 ... NodeNrOfNodes
17 100 2 bottom_x1
1 2
18 100 2 top_x1
11 12
19 100 2 bottom_x2
2 5
20 100 2 top_x2
11 19
21 100 2 bottom_x3
5 13
22 100 2 top_x3
19 22
23 100 2 bottom_x4
13 15
24 100 2 top_x4
22 25
25 100 2 left_y1
4 1
26 100 2 right_y1
15 16
27 100 2 left_y2
4 8
28 100 2 right_y2
16 23
29 100 2 left_y3
8 10
30 100 2 right_y3
23 24
31 100 2 left_y4
10 12
32 100 2 right_y4
24 25

[Node BC]
#NodeNr Level

[Save Nodes]
#NodeNr Level

[Save Elements]
#ElemNr Level

