#1:iter	2:compliance	3:duration
0 	6202.72 	0
1 	719.407 	0
2 	64.2143 	0
3 	54.7582 	0
4 	39.3629 	0
5 	36.7857 	0
6 	36.3423 	0
7 	36.239 	0
8 	36.1398 	0
9 	36.0497 	0
10 	36.0268 	0
11 	35.9988 	0
12 	35.968 	0
13 	35.95 	0
14 	35.9426 	0
15 	35.9353 	0
16 	35.9333 	0
17 	35.9309 	1
18 	35.9293 	0
19 	35.9276 	0
20 	35.9272 	0
