$MeshFormat
2.2 0 8
$EndMeshFormat
$PhysicalNames
12
0 11 "origin"
0 12 "circle_point"
1 4 "abc"
1 5 "x0"
1 6 "y0"
1 7 "excitation_line"
1 8 "excitation_circle"
1 9 "x"
1 10 "y"
2 1 "pml"
2 2 "outside"
2 3 "inside"
$EndPhysicalNames
$Nodes
968
1 0 0 0
2 1 0 0
3 1 1 0
4 0 1 0
5 0.5 0 0
6 1.5 0 0
7 1.5 1 0
8 1.5 1.5 0
9 1 1.5 0
10 0 1.5 0
11 0 0.5 0
12 0.09999999999977893 0 0
13 0.1999999999994874 0 0
14 0.2999999999994734 0 0
15 0.3999999999997367 0 0
16 0.04999999999990839 0 0
17 0.1499999999996332 0 0
18 0.2499999999993416 0 0
19 0.3499999999996051 0 0
20 0.4499999999998683 0 0
21 1 0.09999999999981467 0
22 1 0.1999999999995579 0
23 1 0.2999999999992664 0
24 1 0.3999999999989749 0
25 1 0.4999999999986943 0
26 1 0.5999999999989468 0
27 1 0.69999999999921 0
28 1 0.7999999999994734 0
29 1 0.8999999999997368 0
30 1 0.04999999999989927 0
31 1 0.1499999999997036 0
32 1 0.2499999999994121 0
33 1 0.3499999999991207 0
34 1 0.4499999999988346 0
35 1 0.5499999999988205 0
36 1 0.6499999999990784 0
37 1 0.7499999999993416 0
38 1 0.8499999999996051 0
39 1 0.9499999999998684 0
40 0.8999999999995836 1 0
41 0.7999999999999998 1 0
42 0.7000000000006934 1 0
43 0.6000000000013869 1 0
44 0.5000000000020587 1 0
45 0.4000000000016644 1 0
46 0.3000000000012483 1 0
47 0.2000000000008322 1 0
48 0.100000000000416 1 0
49 0.9499999999998356 1 0
50 0.8499999999998515 1 0
51 0.7500000000003858 1 0
52 0.6500000000010593 1 0
53 0.5500000000016854 1 0
54 0.4500000000018616 1 0
55 0.3500000000014563 1 0
56 0.2500000000010403 1 0
57 0.1500000000006241 1 0
58 0.05000000000020799 1 0
59 0 0.9000000000000002 0
60 0 0.8000000000000002 0
61 0 0.7000000000000002 0
62 0 0.6000000000000001 0
63 0 0.9499999999999811 0
64 0 0.8499999999999284 0
65 0 0.7500000000001487 0
66 0 0.650000000000008 0
67 0 0.5499999999999793 0
68 0.5999999999999998 0 0
69 0.6999999999999998 0 0
70 0.7999999999999998 0 0
71 0.8999999999999999 0 0
72 0.5500000000000189 0 0
73 0.6500000000000716 0 0
74 0.7499999999998513 0 0
75 0.849999999999992 0 0
76 0.9500000000000207 0 0
77 1.1 0 0
78 1.2 0 0
79 1.3 0 0
80 1.4 0 0
81 1.04999999999996 0 0
82 1.150000000000022 0 0
83 1.249999999999939 0 0
84 1.349999999999776 0 0
85 1.449999999999953 0 0
86 1.1 1 0
87 1.2 1 0
88 1.3 1 0
89 1.4 1 0
90 1.04999999999996 1 0
91 1.150000000000022 1 0
92 1.249999999999939 1 0
93 1.349999999999776 1 0
94 1.449999999999953 1 0
95 1 1.1 0
96 1 1.2 0
97 1 1.3 0
98 1 1.4 0
99 1 1.04999999999996 0
100 1 1.150000000000022 0
101 1 1.249999999999939 0
102 1 1.349999999999776 0
103 1 1.449999999999953 0
104 0 1.1 0
105 0 1.2 0
106 0 1.3 0
107 0 1.4 0
108 0 1.04999999999996 0
109 0 1.150000000000022 0
110 0 1.249999999999939 0
111 0 1.349999999999776 0
112 0 1.449999999999953 0
113 1.5 0.09999999999981467 0
114 1.5 0.1999999999995579 0
115 1.5 0.2999999999992664 0
116 1.5 0.3999999999989749 0
117 1.5 0.4999999999986943 0
118 1.5 0.5999999999989468 0
119 1.5 0.69999999999921 0
120 1.5 0.7999999999994734 0
121 1.5 0.8999999999997368 0
122 1.5 0.04999999999989927 0
123 1.5 0.1499999999997036 0
124 1.5 0.2499999999994121 0
125 1.5 0.3499999999991207 0
126 1.5 0.4499999999988346 0
127 1.5 0.5499999999988205 0
128 1.5 0.6499999999990784 0
129 1.5 0.7499999999993416 0
130 1.5 0.8499999999996051 0
131 1.5 0.9499999999998684 0
132 1.5 1.1 0
133 1.5 1.2 0
134 1.5 1.3 0
135 1.5 1.4 0
136 1.5 1.04999999999996 0
137 1.5 1.150000000000022 0
138 1.5 1.249999999999939 0
139 1.5 1.349999999999776 0
140 1.5 1.449999999999953 0
141 1.4 1.5 0
142 1.3 1.5 0
143 1.2 1.5 0
144 1.1 1.5 0
145 1.45000000000004 1.5 0
146 1.349999999999978 1.5 0
147 1.250000000000061 1.5 0
148 1.150000000000224 1.5 0
149 1.050000000000047 1.5 0
150 0.8999999999995836 1.5 0
151 0.7999999999999998 1.5 0
152 0.7000000000006934 1.5 0
153 0.6000000000013869 1.5 0
154 0.5000000000020587 1.5 0
155 0.4000000000016644 1.5 0
156 0.3000000000012483 1.5 0
157 0.2000000000008322 1.5 0
158 0.100000000000416 1.5 0
159 0.9499999999998356 1.5 0
160 0.8499999999998515 1.5 0
161 0.7500000000003858 1.5 0
162 0.6500000000010593 1.5 0
163 0.5500000000016854 1.5 0
164 0.4500000000018616 1.5 0
165 0.3500000000014563 1.5 0
166 0.2500000000010403 1.5 0
167 0.1500000000006241 1.5 0
168 0.05000000000020799 1.5 0
169 0.4903926402016678 0.09754516100779979 0
170 0.4619397662558449 0.1913417161820582 0
171 0.4157348061516944 0.2777851165091699 0
172 0.3535533905939447 0.3535533905926028 0
173 0.2777851165103709 0.4157348061508919 0
174 0.1913417161829355 0.4619397662554816 0
175 0.09754516100822118 0.490392640201584 0
176 0.4975923633361131 0.0490085701646315 0
177 0.4784701678662173 0.145142338626859 0
178 0.4409606321744896 0.235698368412415 0
179 0.3865052266819453 0.3171966420811199 0
180 0.317196642082461 0.3865052266808447 0
181 0.235698368413507 0.4409606321739059 0
182 0.1451423386274944 0.4784701678660246 0
183 0.04900857016487983 0.4975923633360886 0
184 0 0.09999999999977893 0
185 0 0.1999999999994874 0
186 0 0.2999999999994734 0
187 0 0.3999999999997367 0
188 0 0.04999999999990839 0
189 0 0.1499999999996332 0
190 0 0.2499999999993416 0
191 0 0.3499999999996051 0
192 0 0.4499999999998683 0
193 0.60975146875449 0.6173343628688792 0
194 0.7085716700239788 0.3410291421168207 0
195 0.3362185469163347 0.7007639979800315 0
196 0.7787455927012608 0.7787455927013166 0
197 0.43867415722702 0.5255580316126696 0
198 0.8008656821466438 0.5202656354083954 0
199 0.5231852325052351 0.8007014661801197 0
200 0.8273146426060759 0.1785591770387732 0
201 0.1785591770393309 0.8273146426059774 0
202 0.5485730996088303 0.3869902898509743 0
203 0.6369729388797548 0.1769115388177177 0
204 0.1683552273693003 0.6502384465330557 0
205 0.8541471889847719 0.3504575292076515 0
206 0.3504575292092842 0.854147188984731 0
207 0.6458336142509439 0.4874103278935819 0
208 0.6579392746559847 0.8603901830329941 0
209 0.8603901830326579 0.6579392746559753 0
210 0.2990614364608752 0.5555571270772115 0
211 0.4763745611852316 0.6690825889911294 0
212 0.8596415691066719 0.8596415691066467 0
213 0.5624295722166125 0.2771562101398667 0
214 0.6806729177528967 0.7404955551373916 0
215 0.7415860490297632 0.6324949747894624 0
216 0.558541429428051 0.5370523673562619 0
217 0.7269587086611699 0.1183295107063871 0
218 0.1201292776508255 0.7284823175655787 0
219 0.8969994530705315 0.4435994129063312 0
220 0.4440164982075739 0.8969759936467676 0
221 0.438009749657215 0.4245587725099405 0
222 0.7585164249532924 0.896202599205588 0
223 0.8958563274435504 0.7561413627786113 0
224 0.8907903484703424 0.1092096515296745 0
225 0.1092096515297147 0.8907903484702473 0
226 0.9046065863457036 0.2539629246598959 0
227 0.2539629246614152 0.9046065863454287 0
228 0.7778926846624495 0.4127049485759559 0
229 0.4270995858272566 0.7981201745191626 0
230 0.9011714824840598 0.5674582105730434 0
231 0.5688703280957855 0.8991115703282353 0
232 0.734795964932384 0.2433650136441434 0
233 0.244051777396725 0.7351313463109919 0
234 0.3839159665614307 0.6181191341197387 0
235 0.5780880975617311 0.09049711588488861 0
236 0.09917385652235053 0.5900509776097494 0
237 0.5743051443768298 0.7053620332077436 0
238 0.354846874854474 0.4755384979223812 0
239 0.6184607671992782 0.3396388404006012 0
240 0.2021836023646096 0.5537661908844675 0
241 0.2769260831554723 0.6400549600750566 0
242 0.5399324996130577 0.1813050122178767 0
243 0.2748284966836305 0.8213422974057023 0
244 0.8212752211300773 0.2746911439322454 0
245 0.4734010773846032 0.3441105521041322 0
246 0.6978724030171313 0.5679915318138365 0
247 0.808626368459335 0.08517220367025496 0
248 0.08517220367027409 0.8086263684592362 0
249 0.537384192205363 0.6255912201731821 0
250 0.6128084745063831 0.7990059552699689 0
251 0.778094844500529 0.6904077549340694 0
252 0.6522461826504016 0.2756201490238299 0
253 0.5103111524968078 0.465678956119549 0
254 0.9349201904433264 0.3497979455885611 0
255 0.3498405053151201 0.9349177966245901 0
256 0.65257478336124 0.9360868661878605 0
257 0.9351273247747982 0.6532182497960575 0
258 0.6606530275727798 0.4155223773871017 0
259 0.6549865632049239 0.07278086671805062 0
260 0.07297680509901186 0.6577163587769246 0
261 0.9261670259278216 0.9261670259278254 0
262 0.5847824646714825 0.4585308637214938 0
263 0.2617524457679392 0.4897043824945477 0
264 0.1768073968211261 0.926937289470548 0
265 0.9269372894710664 0.1768073968201853 0
266 0.7035644117693373 0.8044407604122124 0
267 0.7224419556595884 0.4812241349308056 0
268 0.811022186256762 0.6004031510438822 0
269 0.8488650039974739 0.936402238848012 0
270 0.9363329844956088 0.8483899915624588 0
271 0.7823611223555743 0.3355490753069876 0
272 0.3456455219676547 0.7814454782633563 0
273 0.4106908932902815 0.7157966761879004 0
274 0.4818645733517944 0.7401845713665796 0
275 0.6798119523952367 0.6611915129747395 0
276 0.4841492427698059 0.2587831617218042 0
277 0.9415065972498676 0.05849340275005538 0
278 0.05849340275013303 0.9415065972500402 0
279 0.3689605582476667 0.5448328128624809 0
280 0.4758267173102176 0.5962361198766822 0
281 0.8191935809039663 0.8191935809039816 0
282 0.8090789970299821 0.8779220841561173 0
283 0.7686310088272765 0.8374740959534523 0
284 0.8373009600724055 0.7674434777399639 0
285 0.8777489482751111 0.8078914659426291 0
286 0.6718530086340375 0.5277009298537092 0
287 0.6282069162225912 0.5525219495850493 0
288 0.6021875218394974 0.5122313476249218 0
289 0.5841464490912704 0.5771933651125706 0
290 0.6538119358858107 0.5926629473413578 0
291 0.7543131842296674 0.04258610183512748 0
292 0.8043131842296674 0.04258610183512748 0
293 0.04258610183513704 0.7543131842296182 0
294 0.04258610183513704 0.8043131842296182 0
295 0.7134793543305848 0.05916475535319356 0
296 0.7677925385602524 0.101750857188321 0
297 0.06006463882541276 0.7142411587827895 0
298 0.1026507406605498 0.7685543430124074 0
299 0.6819658237704623 0.1476205247620524 0
300 0.7308773367967769 0.1808472621752653 0
301 0.6858844519060694 0.2101382762309306 0
302 0.2062035023830127 0.6926848964220238 0
303 0.1820905275237752 0.7318068319382853 0
304 0.1442422525100629 0.6893603820493173 0
305 0.7810553037692299 0.2109620953414583 0
306 0.7771366756336229 0.1484443438725802 0
307 0.1493442273450782 0.777898480085778 0
308 0.2113054772180279 0.7812229944584846 0
309 0.5390440487808655 0.0452485579424443 0
310 0.5342403688816995 0.0940211384463442 0
311 0.09835950876528585 0.5402218089056667 0
312 0.04958692826117526 0.5450254888048747 0
313 0.7297092552270787 0.7596205739193541 0
314 0.7293838811267128 0.7154516550357305 0
315 0.7784202186008948 0.734576673817693 0
316 0.5890440487808655 0.0452485579424443 0
317 0.04958692826117526 0.5950254888048747 0
318 0.1498643816864154 0.5220794155430257 0
319 0.15067872944348 0.5719085842471086 0
320 0.7197292260234472 0.6002432533016495 0
321 0.7544472946369467 0.5841973414288594 0
322 0.7763041176432626 0.6164490629166723 0
323 0.6802424350740668 0.7008435340560656 0
324 0.7289533984478829 0.6757996339544045 0
325 0.7493690425818875 0.544128583611116 0
326 0.805943934201703 0.5603343932261389 0
327 0.9484997265352657 0.4717997064525127 0
328 0.9484997265352657 0.4217997064526531 0
329 0.4220082491046191 0.9484879968233838 0
330 0.4720082491048163 0.9484879968233838 0
331 0.3957815701255799 0.3890560815512716 0
332 0.3964283122558445 0.4500486352161608 0
333 0.3542001327242094 0.414545944257492 0
334 0.4836008653564045 0.8488387299134437 0
335 0.4355580420174153 0.8475480840829651 0
336 0.4751424091662458 0.7994108203496412 0
337 0.7893791834045467 0.4664852919921757 0
338 0.8374460688664905 0.4281521807411436 0
339 0.8489325676085877 0.4819325241573633 0
340 0.3887785575182704 0.8261336817519468 0
341 0.3972370137084291 0.8755615913157493 0
342 0.8755733210276517 0.3970284710569913 0
343 0.8160199368236107 0.3815812388918037 0
344 0.7292582124769929 0.948101299602794 0
345 0.7792582124766461 0.948101299602794 0
346 0.9479281637217751 0.7780706813890423 0
347 0.9479281637217751 0.7280706813889106 0
348 0.1967626592737725 0.5078529785699746 0
349 0.7411550022352991 0.7915931765567645 0
350 0.6921186647611171 0.772468157774802 0
351 0.9505857412420299 0.5337291052858688 0
352 0.8990854677772957 0.5055288117396872 0
353 0.5064434131516797 0.8980437819875015 0
354 0.5344351640489221 0.9495557851641176 0
355 0.8369755859720397 0.7232745588563403 0
356 0.9154918261091742 0.7046798062873344 0
357 0.9675636623873991 0.6766091248976338 0
358 0.6762873916809666 0.9680434330939303 0
359 0.7055456041572662 0.9161447326967243 0
360 0.9159598217569289 0.3966986792474462 0
361 0.9674600952216632 0.374898972793768 0
362 0.3749202526583922 0.967458898312295 0
363 0.396928501761347 0.9159468951356788 0
364 0.5109870884967167 0.3655504209775532 0
365 0.5179153248006079 0.3106333811219995 0
366 0.5555013359127214 0.3320732499954205 0
367 0.8953951742351711 0.05460482576483724 0
368 0.8497083584648387 0.09719092759996473 0
369 0.8543131842296674 0.04258610183512748 0
370 0.04258610183513704 0.8543131842296182 0
371 0.09719092759999437 0.8497083584647418 0
372 0.05460482576485733 0.8953951742351238 0
373 0.4134772339892739 0.3488319713483675 0
374 0.4557054135209091 0.3843346623070363 0
375 0.3163159956824224 0.4456366520366365 0
376 0.5460277803005102 0.8499065182541775 0
377 0.8510185823153518 0.5438619229907193 0
378 0.8781232552381042 0.7070403187172933 0
379 0.8192425137665935 0.6741735147950223 0
380 0.5904451697079454 0.308397525270234 0
381 0.5835169334040542 0.3633145651257877 0
382 0.5997012555481837 0.2270338744787922 0
383 0.551181035914835 0.2292306111788717 0
384 0.5884527192464062 0.1791082755177972 0
385 0.6459797510423393 0.1248462027678842 0
386 0.6909726359330468 0.09555518871221887 0
387 0.09655304137491869 0.6930993381712516 0
388 0.1206660162341561 0.6539774026549902 0
389 0.6446095607650781 0.2262658439207738 0
390 0.607337877433507 0.2763881795818483 0
391 0.8977587539037281 0.6555787622260164 0
392 0.7082278498046386 0.878296391119291 0
393 0.6552570290086124 0.8982385246104273 0
394 0.8945336897140492 0.3501277373981063 0
395 0.3501490172622022 0.8945324928046605 0
396 0.4445679417681488 0.3109478343066511 0
397 0.7501673201610189 0.4469645417533807 0
398 0.6915474916161841 0.4483732561589537 0
399 0.7192728561176147 0.4141136629815289 0
400 0.9505857412420299 0.5837291052859951 0
401 0.5844351640485862 0.9495557851641176 0
402 0.7432321773432142 0.3768670453463883 0
403 0.6846123487983793 0.3782757597519613 0
404 0.9523032931728518 0.2769814623295812 0
405 0.9523032931728518 0.2269814623297269 0
406 0.2269814623311237 0.9523032931727143 0
407 0.2769814623313318 0.9523032931727143 0
408 0.185269414866955 0.6020023187087616 0
409 0.2395548427600409 0.5969105754797621 0
410 0.2226406552623863 0.6451467033040561 0
411 0.7216838174781814 0.2921970778804821 0
412 0.7585785436439791 0.2894570444755655 0
413 0.7454663961897765 0.3382891087119042 0
414 0.3409320344419947 0.741104738121694 0
415 0.2948486496821898 0.758288412287174 0
416 0.2901351621565298 0.7179476721455117 0
417 0.7780355930312306 0.2590280787881944 0
418 0.8018181717428259 0.3051201096196166 0
419 0.3102370093256426 0.8013938878345293 0
420 0.2594401370401778 0.7782368218583471 0
421 0.396760516040747 0.5005482647675253 0
422 0.4383419534421175 0.475058402061305 0
423 0.7310404183613148 0.8503216798089002 0
424 0.2879937598081738 0.5978060435761341 0
425 0.2506225194127424 0.5546616589808395 0
426 0.4986077933275355 0.5313051994844658 0
427 0.5171840733691343 0.566644243616472 0
428 0.4572504372686188 0.5608970757446758 0
429 0.1337645419458254 0.6201447120714025 0
430 0.6075305182207429 0.1337043273513032 0
431 0.6165373303833275 0.08163899130146962 0
432 0.08607533081068119 0.6238836681933371 0
433 0.5679968535058091 0.7998537107250443 0
434 0.5908394013010843 0.8490587627991021 0
435 0.6447817105748634 0.6392629379218093 0
436 0.6270585483860333 0.6832767730912416 0
437 0.59202830656566 0.6613481980383114 0
438 0.6274890310648633 0.7229287941725676 0
439 0.7101571793383599 0.5246078333723211 0
440 0.7616538189031161 0.5007448851696006 0
441 0.6395568973860291 0.3775806088938515 0
442 0.604613063590805 0.401256333619038 0
443 0.8590524955382092 0.1438844142842239 0
444 0.9088638189707043 0.1430085241749299 0
445 0.8771259660385711 0.1776832869294793 0
446 0.1776832869302286 0.8771259660382626 0
447 0.1430085241754204 0.9088638189703977 0
448 0.1438844142845228 0.8590524955381124 0
449 0.915771937908385 0.2153851607400406 0
450 0.8659606144758898 0.2162610508493346 0
451 0.2162610508503731 0.865960614475703 0
452 0.2153851607412707 0.9157719379079883 0
453 0.6227177461221312 0.4370266205542978 0
454 0.5666777821401564 0.422760576786234 0
455 0.8179705055327054 0.1318656903545141 0
456 0.1318656903548025 0.8179705055326068 0
457 0.613404801375885 0.8797508766806147 0
458 0.6353738745811839 0.8296980691514815 0
459 0.4744926548619139 0.4956184938661093 0
460 0.5344262909624293 0.5013656617379054 0
461 0.6807518432126609 0.8324154717226032 0
462 0.5716619470497668 0.4977916155388779 0
463 0.6153080394612132 0.4729705958075378 0
464 0.7598404467651461 0.6614513648617659 0
465 0.7106990007125 0.646843243882101 0
466 0.5735678304799265 0.6214627915210307 0
467 0.5479628108167069 0.581321793764722 0
468 0.9674600952216632 0.3248989727939138 0
469 0.919763388394515 0.3018804351242286 0
470 0.3019017149882677 0.9197621914850094 0
471 0.3249202526581841 0.967458898312295 0
472 0.8793768876652377 0.3022102269337738 0
473 0.3022102269353497 0.8793768876650798 0
474 0.8377112050574247 0.3125743365699485 0
475 0.8629409037378905 0.2643270342960707 0
476 0.2643957106725229 0.8629744418755655 0
477 0.3126430129464574 0.8377447431952166 0
478 0.8242949318680766 0.2266251604855093 0
479 0.2266938368614807 0.8243284700058399 0
480 0.9634686447355332 0.13840369841 0
481 0.9453951742351712 0.1046048257647446 0
482 0.1046048257650653 0.9453951742351236 0
483 0.138403698410771 0.963468644735274 0
484 0.6774932816024619 0.03639043335902531 0
485 0.03648840254950593 0.6788581793884624 0
486 0.4741604510770114 0.4451188643147447 0
487 0.341488701511153 0.5868381305984751 0
488 0.3304210248584515 0.6290870470973977 0
489 0.3065723150359035 0.6704094790275441 0
490 0.3600672567388827 0.6594415660498851 0
491 0.4932914246330227 0.4057745311804574 0
492 0.5590102985873944 0.1359010640513827 0
493 0.5151625699073628 0.1394250866128383 0
494 0.5558446682910965 0.6654766266904628 0
495 0.4435327272377566 0.6924396325895149 0
496 0.3973034299258561 0.6669579051538196 0
497 0.4301452638733312 0.6436008615554341 0
498 0.5009361329344513 0.1863233641999675 0
499 0.5066054547577903 0.6109136700249322 0
500 0.8542532865520729 0.8980219039773294 0
501 0.8036907144753831 0.9163024190268 0
502 0.9160946559695795 0.802265677170535 0
503 0.8979872768011403 0.8540157803345527 0
504 0.8244325019987369 0.968201119424006 0
505 0.9681664922478044 0.824194995780966 0
506 0.856096834370411 0.5839306808084628 0
507 0.2604889302760987 0.6875931531930242 0
508 0.5068793766952974 0.6473369045821558 0
509 0.5253398527810307 0.6872223110994364 0
510 0.529442126052819 0.4263346229852616 0
511 0.6804089263371902 0.3083246455703254 0
512 0.6935210737913928 0.2594925813339867 0
513 0.4298713419358242 0.6071776269982105 0
514 0.4761006392477246 0.6326593544339059 0
515 0.1884036984109791 0.963468644735274 0
516 0.9634686447355332 0.1884036984098716 0
517 0.916148472860105 0.08385152713986493 0
518 0.9707532986249339 0.07924670137493503 0
519 0.9207532986249338 0.02924670137502769 0
520 0.08385152713992383 0.9161484728601437 0
521 0.02924670137506651 0.9207532986250202 0
522 0.07924670137527451 0.97075329862502 0
523 0.9130835129637026 0.9630835129639127 0
524 0.9630835129639108 0.9630835129639127 0
525 0.9630835129639108 0.9130835129637811 0
526 0.83570618464471 0.6291712128499287 0
527 0.8807808327583588 0.6126987426145094 0
528 0.4787751600772046 0.3014468569129681 0
529 0.5232894074932092 0.2679696859308354 0
530 0.6532433209118618 0.4514663526403418 0
531 0.6841377849552661 0.4843172314121937 0
532 0.3734547201033081 0.708280337083966 0
533 0.6107225557285128 0.9175992182580479 0
534 0.918149403629429 0.6103382301845504 0
535 0.6262873916813134 0.9680434330939303 0
536 0.9675636623873991 0.6266091248975021 0
537 0.6467406961296399 0.7697507552036802 0
538 0.5935568094416064 0.7521839942388562 0
539 0.5487451884410324 0.7530317496939316 0
540 0.5120408711914317 0.2200440869698405 0
541 0.6635162186116286 0.340333991258711 0
542 0.63535347492484 0.3076294947122156 0
543 0.4730445045128254 0.2250624389519312 0
544 0.3082996603112066 0.4826214402084644 0
545 0.269768781139155 0.4527195943227198 0
546 0.7801269035090119 0.3741270119414718 0
547 0.4544820795895255 0.7691523729428711 0
548 0.5025249029285147 0.7704430187733496 0
549 0.2804069411144072 0.5226307547858796 0
550 0.3269541556576746 0.5155478124997963 0
551 0.8182541556701731 0.3430033022573196 0
552 0.3480515255884695 0.8177963336240437 0
553 0.3863725538974557 0.7897828263912594 0
554 0.6274932816024619 0.03639043335902531 0
555 0.03648840254950593 0.6288581793884623 0
556 0.4112950618942254 0.5718385828662041 0
557 0.6888421777061839 0.614591522394288 0
558 0.4038173577373433 0.5351954222375752 0
559 0.3619037165510703 0.510185655392431 0
560 0.5280848588643121 0.7227733022871616 0
561 0.479119567268513 0.7046335801788545 0
562 0.3781682076289681 0.7486210772256283 0
563 0.4188952395587691 0.7569584253535315 0
564 0.334010997354271 0.5501949699698462 0
565 0.3764382624045487 0.5814759734911098 0
566 0.7945585153786455 0.6454054529889758 0
567 0.6581864431378601 0.8017233578410906 0
568 0.9707532986249339 0.02924670137502769 0
569 0.02924670137506651 0.97075329862502 0
570 0.2265470809754373 0.4758220743750146 0
571 0.8744325019985287 0.968201119424006 0
572 0.9681664922478044 0.8741949957810977 0
573 0.4499420244607502 0.268284139115487 0
574 0.2319680240662744 0.5217352866895076 0
575 0.5475468085841452 0.4621049099205214 0
576 0.9312500052117152 0.887278508745142 0
577 0.8929042975172468 0.8929042975172361 0
578 0.8875160149626478 0.9312846323879187 0
579 0.4462777333210379 0.72799062377724 0
580 1.1 0.09999999999981468 0
581 1.2 0.09999999999981468 0
582 1.299999999999999 0.09999999999981468 0
583 1.4 0.09999999999981468 0
584 1.1 0.1999999999995578 0
585 1.2 0.1999999999995579 0
586 1.3 0.1999999999995579 0
587 1.4 0.1999999999995579 0
588 1.1 0.2999999999992664 0
589 1.2 0.2999999999992664 0
590 1.3 0.2999999999992664 0
591 1.4 0.2999999999992664 0
592 1.1 0.3999999999989751 0
593 1.2 0.399999999998975 0
594 1.3 0.399999999998975 0
595 1.4 0.399999999998975 0
596 1.1 0.4999999999986943 0
597 1.2 0.4999999999986943 0
598 1.3 0.4999999999986943 0
599 1.4 0.4999999999986943 0
600 1.1 0.5999999999989468 0
601 1.2 0.5999999999989468 0
602 1.3 0.5999999999989468 0
603 1.4 0.5999999999989468 0
604 1.1 0.6999999999992101 0
605 1.2 0.69999999999921 0
606 1.3 0.69999999999921 0
607 1.4 0.6999999999992099 0
608 1.1 0.7999999999994734 0
609 1.2 0.7999999999994734 0
610 1.3 0.7999999999994734 0
611 1.4 0.7999999999994734 0
612 1.1 0.8999999999997368 0
613 1.2 0.8999999999997368 0
614 1.3 0.8999999999997368 0
615 1.4 0.8999999999997368 0
616 1.1 0.04999999999990734 0
617 1.05 0.09999999999981468 0
618 1.2 0.04999999999990734 0
619 1.15 0.09999999999981468 0
620 1.3 0.04999999999990734 0
621 1.25 0.09999999999981468 0
622 1.4 0.04999999999990734 0
623 1.35 0.09999999999981468 0
624 1.45 0.09999999999981468 0
625 1.1 0.1499999999996863 0
626 1.05 0.1999999999995579 0
627 1.2 0.1499999999996863 0
628 1.15 0.1999999999995579 0
629 1.3 0.1499999999996863 0
630 1.25 0.1999999999995579 0
631 1.4 0.1499999999996863 0
632 1.35 0.1999999999995579 0
633 1.45 0.1999999999995579 0
634 1.1 0.2499999999994121 0
635 1.05 0.2999999999992664 0
636 1.2 0.2499999999994121 0
637 1.15 0.2999999999992664 0
638 1.3 0.2499999999994121 0
639 1.25 0.2999999999992664 0
640 1.4 0.2499999999994121 0
641 1.35 0.2999999999992664 0
642 1.45 0.2999999999992664 0
643 1.1 0.3499999999991206 0
644 1.05 0.399999999998975 0
645 1.2 0.3499999999991207 0
646 1.15 0.3999999999989749 0
647 1.3 0.3499999999991207 0
648 1.25 0.399999999998975 0
649 1.4 0.3499999999991207 0
650 1.35 0.399999999998975 0
651 1.45 0.399999999998975 0
652 1.1 0.4499999999988347 0
653 1.05 0.4999999999986942 0
654 1.2 0.4499999999988347 0
655 1.15 0.4999999999986943 0
656 1.3 0.4499999999988347 0
657 1.25 0.4999999999986943 0
658 1.4 0.4499999999988347 0
659 1.35 0.4999999999986943 0
660 1.45 0.4999999999986943 0
661 1.1 0.5499999999988205 0
662 1.05 0.5999999999989468 0
663 1.2 0.5499999999988205 0
664 1.15 0.5999999999989466 0
665 1.3 0.5499999999988205 0
666 1.25 0.5999999999989468 0
667 1.4 0.5499999999988205 0
668 1.35 0.5999999999989468 0
669 1.45 0.5999999999989468 0
670 1.1 0.6499999999990784 0
671 1.05 0.69999999999921 0
672 1.2 0.6499999999990784 0
673 1.15 0.69999999999921 0
674 1.3 0.6499999999990784 0
675 1.25 0.69999999999921 0
676 1.4 0.6499999999990784 0
677 1.35 0.69999999999921 0
678 1.45 0.69999999999921 0
679 1.1 0.7499999999993414 0
680 1.05 0.7999999999994734 0
681 1.2 0.7499999999993416 0
682 1.15 0.7999999999994734 0
683 1.3 0.7499999999993416 0
684 1.25 0.7999999999994734 0
685 1.4 0.7499999999993416 0
686 1.35 0.7999999999994734 0
687 1.45 0.7999999999994734 0
688 1.1 0.8499999999996051 0
689 1.05 0.8999999999997368 0
690 1.2 0.8499999999996048 0
691 1.15 0.8999999999997368 0
692 1.3 0.8499999999996051 0
693 1.25 0.8999999999997368 0
694 1.4 0.8499999999996051 0
695 1.35 0.8999999999997368 0
696 1.45 0.8999999999997368 0
697 1.1 0.9499999999998686 0
698 1.2 0.9499999999998686 0
699 1.3 0.9499999999998686 0
700 1.4 0.9499999999998684 0
701 1.1 1.1 0
702 1.1 1.2 0
703 1.1 1.3 0
704 1.1 1.4 0
705 1.2 1.1 0
706 1.2 1.2 0
707 1.2 1.3 0
708 1.2 1.4 0
709 1.3 1.1 0
710 1.3 1.2 0
711 1.3 1.3 0
712 1.3 1.4 0
713 1.4 1.1 0
714 1.4 1.2 0
715 1.4 1.3 0
716 1.4 1.4 0
717 1.1 1.05 0
718 1.05 1.1 0
719 1.1 1.15 0
720 1.05 1.2 0
721 1.1 1.25 0
722 1.05 1.3 0
723 1.1 1.35 0
724 1.05 1.4 0
725 1.1 1.45 0
726 1.2 1.05 0
727 1.15 1.1 0
728 1.2 1.15 0
729 1.15 1.2 0
730 1.2 1.25 0
731 1.15 1.3 0
732 1.2 1.35 0
733 1.15 1.4 0
734 1.2 1.45 0
735 1.3 1.05 0
736 1.25 1.1 0
737 1.3 1.15 0
738 1.25 1.2 0
739 1.3 1.25 0
740 1.25 1.3 0
741 1.3 1.35 0
742 1.25 1.4 0
743 1.3 1.45 0
744 1.4 1.05 0
745 1.35 1.1 0
746 1.4 1.15 0
747 1.35 1.2 0
748 1.4 1.25 0
749 1.35 1.3 0
750 1.4 1.35 0
751 1.35 1.4 0
752 1.4 1.45 0
753 1.45 1.1 0
754 1.45 1.2 0
755 1.45 1.3 0
756 1.45 1.4 0
757 0.8999999999995836 1.4 0
758 0.8999999999995836 1.3 0
759 0.8999999999995836 1.2 0
760 0.8999999999995836 1.1 0
761 0.7999999999999998 1.4 0
762 0.7999999999999998 1.3 0
763 0.7999999999999998 1.2 0
764 0.7999999999999998 1.1 0
765 0.7000000000006934 1.4 0
766 0.7000000000006934 1.3 0
767 0.7000000000006934 1.2 0
768 0.7000000000006934 1.1 0
769 0.6000000000013869 1.4 0
770 0.6000000000013869 1.3 0
771 0.6000000000013869 1.2 0
772 0.6000000000013869 1.1 0
773 0.5000000000020588 1.4 0
774 0.5000000000020587 1.3 0
775 0.5000000000020587 1.2 0
776 0.5000000000020587 1.1 0
777 0.4000000000016644 1.4 0
778 0.4000000000016644 1.3 0
779 0.4000000000016644 1.2 0
780 0.4000000000016644 1.1 0
781 0.300000000001248 1.4 0
782 0.3000000000012483 1.3 0
783 0.3000000000012483 1.2 0
784 0.3000000000012483 1.1 0
785 0.2000000000008322 1.4 0
786 0.2000000000008322 1.3 0
787 0.2000000000008322 1.2 0
788 0.2000000000008322 1.1 0
789 0.1000000000004162 1.4 0
790 0.100000000000416 1.3 0
791 0.100000000000416 1.2 0
792 0.100000000000416 1.1 0
793 0.8999999999995836 1.45 0
794 0.9499999999997916 1.400000000000001 0
795 0.8999999999995836 1.35 0
796 0.9499999999997918 1.3 0
797 0.8999999999995836 1.25 0
798 0.9499999999997916 1.2 0
799 0.8999999999995836 1.15 0
800 0.9499999999997918 1.1 0
801 0.8999999999995836 1.05 0
802 0.7999999999999998 1.45 0
803 0.8499999999997916 1.4 0
804 0.7999999999999998 1.35 0
805 0.8499999999997917 1.3 0
806 0.7999999999999998 1.25 0
807 0.8499999999997915 1.2 0
808 0.7999999999999998 1.15 0
809 0.8499999999997917 1.1 0
810 0.7999999999999998 1.05 0
811 0.7000000000006933 1.45 0
812 0.7500000000003463 1.4 0
813 0.7000000000006934 1.35 0
814 0.7500000000003466 1.3 0
815 0.7000000000006934 1.25 0
816 0.7500000000003466 1.2 0
817 0.7000000000006934 1.15 0
818 0.7500000000003466 1.1 0
819 0.7000000000006934 1.05 0
820 0.6000000000013866 1.45 0
821 0.6500000000010401 1.4 0
822 0.6000000000013869 1.35 0
823 0.6500000000010402 1.3 0
824 0.6000000000013869 1.25 0
825 0.6500000000010402 1.2 0
826 0.6000000000013869 1.15 0
827 0.6500000000010402 1.1 0
828 0.6000000000013869 1.05 0
829 0.5000000000020588 1.45 0
830 0.5500000000017229 1.4 0
831 0.5000000000020588 1.35 0
832 0.5500000000017228 1.3 0
833 0.5000000000020587 1.25 0
834 0.5500000000017228 1.2 0
835 0.5000000000020587 1.15 0
836 0.5500000000017228 1.1 0
837 0.5000000000020587 1.05 0
838 0.4000000000016645 1.45 0
839 0.4500000000018617 1.4 0
840 0.4000000000016644 1.35 0
841 0.4500000000018616 1.3 0
842 0.4000000000016644 1.25 0
843 0.4500000000018616 1.2 0
844 0.4000000000016644 1.15 0
845 0.4500000000018616 1.1 0
846 0.4000000000016644 1.05 0
847 0.3000000000012482 1.45 0
848 0.3500000000014564 1.4 0
849 0.3000000000012482 1.35 0
850 0.3500000000014563 1.3 0
851 0.3000000000012483 1.25 0
852 0.3500000000014563 1.2 0
853 0.3000000000012483 1.15 0
854 0.3500000000014563 1.1 0
855 0.3000000000012483 1.05 0
856 0.2000000000008322 1.45 0
857 0.2500000000010401 1.399999999999999 0
858 0.2000000000008322 1.35 0
859 0.2500000000010403 1.3 0
860 0.2000000000008322 1.25 0
861 0.2500000000010403 1.2 0
862 0.2000000000008322 1.15 0
863 0.2500000000010403 1.1 0
864 0.2000000000008322 1.05 0
865 0.1000000000004161 1.45 0
866 0.1500000000006242 1.4 0
867 0.1000000000004161 1.35 0
868 0.1500000000006241 1.3 0
869 0.100000000000416 1.25 0
870 0.1500000000006241 1.2 0
871 0.100000000000416 1.15 0
872 0.1500000000006241 1.1 0
873 0.100000000000416 1.05 0
874 0.0500000000002081 1.4 0
875 0.05000000000020799 1.3 0
876 0.05000000000020799 1.2 0
877 0.05000000000020799 1.1 0
878 0.205371015351914 0.2007661812897781 0
879 0.3307364428117598 0.1381853277285337 0
880 0.139962147301237 0.3292981220577662 0
881 0.13483369295519 0.1340662206115001 0
882 0.2935317975525326 0.2603116911680721 0
883 0.2414098064194697 0.09732302769995359 0
884 0.09791697637910975 0.2403915926849211 0
885 0.2390973152046675 0.3304772805947901 0
886 0.4029438016398404 0.08792692357328837 0
887 0.09054344555546971 0.4059112577185777 0
888 0.3762255540374073 0.2000706508395927 0
889 0.1919283573829338 0.3853324035622744 0
890 0.06757178783950855 0.06757178783950855 0
891 0.335018010174056 0.06468705580035512 0
892 0.0656845138471633 0.335120194492095 0
893 0.2801645738090224 0.1849925120400129 0
894 0.1493689068583341 0.05671483817077684 0
895 0.05685375868331216 0.1491866939932077 0
896 0.1845872109588432 0.2755600832146621 0
897 0.4466682209207541 0.09273604229054408 0
898 0.4514719008199202 0.04396346178664418 0
899 0.04527172277773486 0.4529556288592889 0
900 0.09404430328184545 0.4481519489600808 0
901 0.4014719008197886 0.04396346178664418 0
902 0.04527172277773486 0.4029556288591572 0
903 0.170102354153552 0.1674162009506391 0
904 0.1881217496873298 0.1156946241557268 0
905 0.2233904108856918 0.1490446044948659 0
906 0.1516439958655119 0.2205788869873496 0
907 0.1163753346671499 0.1872289066482106 0
908 0.2963253528993061 0.3420153355936965 0
909 0.2663145563786 0.2953944858814311 0
910 0.3235425940732387 0.3069325408803374 0
911 0.2707049032094715 0.04866151384997679 0
912 0.2207049032094786 0.04866151384997679 0
913 0.04895848818955487 0.2201957963422043 0
914 0.04895848818955487 0.2701957963421973 0
915 0.4190826601466261 0.1957061835108255 0
916 0.3895846778386238 0.1439987872064405 0
917 0.4324417839478427 0.1396343198776733 0
918 0.2494514064522233 0.2305389362289251 0
919 0.2390595042556879 0.2679358871913671 0
920 0.1949791131553786 0.2381631322522201 0
921 0.2118422630817554 0.3030186819047261 0
922 0.2584412158575192 0.373106043372841 0
923 0.3175090050867647 0.03234352790017756 0
924 0.2882139082967629 0.08100504175015436 0
925 0.08180074511313652 0.2877558935885081 0
926 0.03284225692358165 0.3175600972457842 0
927 0.3546333018521135 0.269048403838621 0
928 0.1409425808692026 0.4339255119870297 0
929 0.1412359014692018 0.3956218306404261 0
930 0.1916350367829346 0.4236360849088779 0
931 0.3668401222258001 0.113056125650911 0
932 0.3534809984245836 0.1691279892840632 0
933 0.2860731246156147 0.1177541777142436 0
934 0.3328772264929079 0.1014361917644444 0
935 0.1028233305742002 0.3322091582749306 0
936 0.1189395618401734 0.2848448573713436 0
937 0.33487867579497 0.2301911710038324 0
938 0.3959801800945508 0.2389278836743813 0
939 0.2427677945804682 0.1928793466648955 0
940 0.2868481856807775 0.2226521016040425 0
941 0.142101299906762 0.09539052939113846 0
942 0.1953893566389019 0.07701893293536521 0
943 0.07738536753121095 0.1947891433390644 0
944 0.09584372581925107 0.1416264573023539 0
945 0.3054505083103911 0.1615889198842733 0
946 0.260787190114246 0.1411577698699833 0
947 0.1412520936689765 0.2579758379497916 0
948 0.1622746791300401 0.3024291026362141 0
949 0.1746844534289108 0.02835741908538842 0
950 0.02842687934165608 0.1745933469963476 0
951 0.1659452523420854 0.3573152628100203 0
952 0.1152527964283534 0.367604689888172 0
953 0.3281950639232148 0.1925315814398028 0
954 0.2348567369466523 0.4005336048565832 0
955 0.2155128362938006 0.3579048420785322 0
956 0.08378589391964375 0.03378589391975428 0
957 0.03378589391975428 0.03378589391975428 0
958 0.03378589391975428 0.08378589391964375 0
959 0.3675090050868963 0.03234352790017756 0
960 0.03284225692358165 0.3675600972459159 0
961 0.1895297312529522 0.3298877013262782 0
962 0.1246844534290565 0.02835741908538842 0
963 0.02842687934165608 0.1245933469964933 0
964 0.3689809059069482 0.07630698968682174 0
965 0.0781139797013165 0.3705157261053363 0
966 0.1012027403973493 0.1008190042255043 0
967 0.1084703473489213 0.0621433130051427 0
968 0.06221277326141036 0.1083792409163581 0
$EndNodes
$Elements
476
1 15 2 11 1 1
2 15 2 12 5 5
3 8 2 6 1 1 12 16
4 8 2 7 1 1 12 16
5 8 2 6 1 12 13 17
6 8 2 7 1 12 13 17
7 8 2 6 1 13 14 18
8 8 2 7 1 13 14 18
9 8 2 6 1 14 15 19
10 8 2 7 1 14 15 19
11 8 2 6 1 15 5 20
12 8 2 7 1 15 5 20
13 8 2 4 2 2 21 30
14 8 2 4 2 21 22 31
15 8 2 4 2 22 23 32
16 8 2 4 2 23 24 33
17 8 2 4 2 24 25 34
18 8 2 4 2 25 26 35
19 8 2 4 2 26 27 36
20 8 2 4 2 27 28 37
21 8 2 4 2 28 29 38
22 8 2 4 2 29 3 39
23 8 2 4 3 3 40 49
24 8 2 4 3 40 41 50
25 8 2 4 3 41 42 51
26 8 2 4 3 42 43 52
27 8 2 4 3 43 44 53
28 8 2 4 3 44 45 54
29 8 2 4 3 45 46 55
30 8 2 4 3 46 47 56
31 8 2 4 3 47 48 57
32 8 2 4 3 48 4 58
33 8 2 5 4 4 59 63
34 8 2 10 4 4 59 63
35 8 2 5 4 59 60 64
36 8 2 10 4 59 60 64
37 8 2 5 4 60 61 65
38 8 2 10 4 60 61 65
39 8 2 5 4 61 62 66
40 8 2 10 4 61 62 66
41 8 2 5 4 62 11 67
42 8 2 10 4 62 11 67
43 8 2 6 5 5 68 72
44 8 2 9 5 5 68 72
45 8 2 6 5 68 69 73
46 8 2 9 5 68 69 73
47 8 2 6 5 69 70 74
48 8 2 9 5 69 70 74
49 8 2 6 5 70 71 75
50 8 2 9 5 70 71 75
51 8 2 6 5 71 2 76
52 8 2 9 5 71 2 76
53 8 2 6 6 2 77 81
54 8 2 9 6 2 77 81
55 8 2 6 6 77 78 82
56 8 2 9 6 77 78 82
57 8 2 6 6 78 79 83
58 8 2 9 6 78 79 83
59 8 2 6 6 79 80 84
60 8 2 9 6 79 80 84
61 8 2 6 6 80 6 85
62 8 2 9 6 80 6 85
63 8 2 5 9 4 104 108
64 8 2 10 9 4 104 108
65 8 2 5 9 104 105 109
66 8 2 10 9 104 105 109
67 8 2 5 9 105 106 110
68 8 2 10 9 105 106 110
69 8 2 5 9 106 107 111
70 8 2 10 9 106 107 111
71 8 2 5 9 107 10 112
72 8 2 10 9 107 10 112
73 8 2 8 14 5 169 176
74 8 2 8 14 169 170 177
75 8 2 8 14 170 171 178
76 8 2 8 14 171 172 179
77 8 2 8 14 172 173 180
78 8 2 8 14 173 174 181
79 8 2 8 14 174 175 182
80 8 2 8 14 175 11 183
81 8 2 5 15 1 184 188
82 8 2 5 15 184 185 189
83 8 2 5 15 185 186 190
84 8 2 5 15 186 187 191
85 8 2 5 15 187 11 192
86 9 2 2 1 196 212 222 281 282 283
87 9 2 2 1 196 223 212 284 285 281
88 9 2 2 1 207 246 216 286 287 288
89 9 2 2 1 193 216 246 289 287 290
90 9 2 2 1 247 69 70 291 74 292
91 9 2 2 1 60 61 248 65 293 294
92 9 2 2 1 217 69 247 295 291 296
93 9 2 2 1 248 61 218 293 297 298
94 9 2 2 1 203 217 232 299 300 301
95 9 2 2 1 204 233 218 302 303 304
96 9 2 2 1 200 232 217 305 300 306
97 9 2 2 1 201 218 233 307 303 308
98 9 2 2 1 5 235 169 309 310 176
99 9 2 2 1 11 175 236 183 311 312
100 9 2 2 1 196 214 251 313 314 315
101 9 2 2 1 5 68 235 72 316 309
102 9 2 2 1 11 236 62 312 317 67
103 9 2 2 1 175 240 236 318 319 311
104 9 2 2 1 215 246 268 320 321 322
105 9 2 2 1 214 275 251 323 324 314
106 9 2 2 1 268 246 198 321 325 326
107 9 2 2 1 24 25 219 34 327 328
108 9 2 2 1 44 45 220 54 329 330
109 9 2 2 1 172 221 238 331 332 333
110 9 2 2 1 199 220 229 334 335 336
111 9 2 2 1 198 228 219 337 338 339
112 9 2 2 1 206 229 220 340 335 341
113 9 2 2 1 205 219 228 342 338 343
114 9 2 2 1 41 42 222 51 344 345
115 9 2 2 1 27 28 223 37 346 347
116 9 2 2 1 174 240 175 348 318 182
117 9 2 2 1 196 266 214 349 350 313
118 9 2 2 1 25 230 219 351 352 327
119 9 2 2 1 44 220 231 330 353 354
120 9 2 2 1 196 251 223 315 355 284
121 9 2 2 1 27 223 257 347 356 357
122 9 2 2 1 42 256 222 358 359 344
123 9 2 2 1 24 219 254 328 360 361
124 9 2 2 1 45 255 220 362 363 329
125 9 2 2 1 202 245 213 364 365 366
126 9 2 2 1 71 224 247 367 368 369
127 9 2 2 1 59 248 225 370 371 372
128 9 2 2 1 172 245 221 373 374 331
129 9 2 2 1 172 238 173 333 375 180
130 9 2 2 1 199 231 220 376 353 334
131 9 2 2 1 198 219 230 339 352 377
132 9 2 2 1 209 223 251 378 355 379
133 9 2 2 1 70 71 247 75 369 292
134 9 2 2 1 59 60 248 64 294 370
135 9 2 2 1 202 213 239 366 380 381
136 9 2 2 1 203 213 242 382 383 384
137 9 2 2 1 203 259 217 385 386 299
138 9 2 2 1 204 218 260 304 387 388
139 9 2 2 1 203 252 213 389 390 382
140 9 2 2 1 209 257 223 391 356 378
141 9 2 2 1 208 222 256 392 359 393
142 9 2 2 1 205 254 219 394 360 342
143 9 2 2 1 206 220 255 341 363 395
144 9 2 2 1 171 245 172 396 373 179
145 9 2 2 1 228 267 258 397 398 399
146 9 2 2 1 25 26 230 35 400 351
147 9 2 2 1 43 44 231 53 354 401
148 9 2 2 1 194 228 258 402 399 403
149 9 2 2 1 22 23 226 32 404 405
150 9 2 2 1 46 47 227 56 406 407
151 9 2 2 1 204 240 241 408 409 410
152 9 2 2 1 194 232 271 411 412 413
153 9 2 2 1 195 272 233 414 415 416
154 9 2 2 1 232 244 271 417 418 412
155 9 2 2 1 233 272 243 415 419 420
156 9 2 2 1 197 238 221 421 332 422
157 9 2 2 1 196 222 266 283 423 349
158 9 2 2 1 210 241 240 424 409 425
159 9 2 2 1 197 216 280 426 427 428
160 9 2 2 1 204 236 240 429 319 408
161 9 2 2 1 203 235 259 430 431 385
162 9 2 2 1 204 260 236 388 432 429
163 9 2 2 1 199 250 231 433 434 376
164 9 2 2 1 193 275 237 435 436 437
165 9 2 2 1 214 237 275 438 436 323
166 9 2 2 1 198 246 267 325 439 440
167 9 2 2 1 202 239 258 381 441 442
168 9 2 2 1 200 224 265 443 444 445
169 9 2 2 1 201 264 225 446 447 448
170 9 2 2 1 200 265 226 445 449 450
171 9 2 2 1 201 227 264 451 452 446
172 9 2 2 1 202 258 262 442 453 454
173 9 2 2 1 200 217 247 306 296 455
174 9 2 2 1 201 248 218 456 298 307
175 9 2 2 1 208 231 250 457 434 458
176 9 2 2 1 197 253 216 459 460 426
177 9 2 2 1 208 266 222 461 423 392
178 9 2 2 1 207 216 262 288 462 463
179 9 2 2 1 215 251 275 464 324 465
180 9 2 2 1 193 249 216 466 467 289
181 9 2 2 1 23 254 226 468 469 404
182 9 2 2 1 46 227 255 407 470 471
183 9 2 2 1 205 226 254 472 469 394
184 9 2 2 1 206 255 227 395 470 473
185 9 2 2 1 200 247 224 455 368 443
186 9 2 2 1 201 225 248 448 371 456
187 9 2 2 1 205 244 226 474 475 472
188 9 2 2 1 206 227 243 473 476 477
189 9 2 2 1 200 226 244 450 475 478
190 9 2 2 1 201 243 227 479 476 451
191 9 2 2 1 21 265 224 480 444 481
192 9 2 2 1 48 225 264 482 447 483
193 9 2 2 1 69 217 259 295 386 484
194 9 2 2 1 61 260 218 485 387 297
195 9 2 2 1 197 221 253 422 486 459
196 9 2 2 1 210 234 241 487 488 424
197 9 2 2 1 195 241 234 489 488 490
198 9 2 2 1 202 221 245 491 374 364
199 9 2 2 1 169 235 242 310 492 493
200 9 2 2 1 193 237 249 437 494 466
201 9 2 2 1 211 273 234 495 496 497
202 9 2 2 1 169 242 170 493 498 177
203 9 2 2 1 216 249 280 467 499 427
204 9 2 2 1 212 269 222 500 501 282
205 9 2 2 1 212 223 270 285 502 503
206 9 2 2 1 41 222 269 345 501 504
207 9 2 2 1 28 270 223 505 502 346
208 9 2 2 1 198 230 268 377 506 326
209 9 2 2 1 204 241 233 410 507 302
210 9 2 2 1 211 249 237 508 494 509
211 9 2 2 1 202 253 221 510 486 491
212 9 2 2 1 194 252 232 511 512 411
213 9 2 2 1 211 234 280 497 513 514
214 9 2 2 1 195 233 241 416 507 489
215 9 2 2 1 47 48 264 57 483 515
216 9 2 2 1 21 22 265 31 516 480
217 9 2 2 1 21 224 277 481 517 518
218 9 2 2 1 71 277 224 519 517 367
219 9 2 2 1 59 225 278 372 520 521
220 9 2 2 1 48 278 225 522 520 482
221 9 2 2 1 3 40 261 49 523 524
222 9 2 2 1 3 261 29 524 525 39
223 9 2 2 1 201 233 243 308 420 479
224 9 2 2 1 200 244 232 478 417 305
225 9 2 2 1 209 268 230 526 506 527
226 9 2 2 1 22 226 265 405 449 516
227 9 2 2 1 47 264 227 515 452 406
228 9 2 2 1 213 245 276 365 528 529
229 9 2 2 1 207 258 267 530 398 531
230 9 2 2 1 203 242 235 384 492 430
231 9 2 2 1 195 234 273 490 496 532
232 9 2 2 1 208 256 231 393 533 457
233 9 2 2 1 209 230 257 527 534 391
234 9 2 2 1 43 231 256 401 533 535
235 9 2 2 1 26 257 230 536 534 400
236 9 2 2 1 214 250 237 537 538 438
237 9 2 2 1 199 237 250 539 538 433
238 9 2 2 1 213 276 242 529 540 383
239 9 2 2 1 194 239 252 541 542 511
240 9 2 2 1 170 242 276 498 540 543
241 9 2 2 1 173 238 263 375 544 545
242 9 2 2 1 194 271 228 413 546 402
243 9 2 2 1 199 229 274 336 547 548
244 9 2 2 1 198 267 228 440 397 337
245 9 2 2 1 210 263 238 549 544 550
246 9 2 2 1 205 228 271 343 546 551
247 9 2 2 1 206 272 229 552 553 340
248 9 2 2 1 68 259 235 554 431 316
249 9 2 2 1 62 236 260 317 432 555
250 9 2 2 1 203 232 252 301 512 389
251 9 2 2 1 213 252 239 390 542 380
252 9 2 2 1 68 69 259 73 484 554
253 9 2 2 1 61 62 260 66 555 485
254 9 2 2 1 197 280 234 428 513 556
255 9 2 2 1 193 246 275 290 557 435
256 9 2 2 1 215 275 246 465 557 320
257 9 2 2 1 197 279 238 558 559 421
258 9 2 2 1 211 237 274 509 560 561
259 9 2 2 1 199 274 237 548 560 539
260 9 2 2 1 195 273 272 532 562 414
261 9 2 2 1 229 272 273 553 562 563
262 9 2 2 1 210 279 234 564 565 487
263 9 2 2 1 197 234 279 556 565 558
264 9 2 2 1 215 268 251 322 566 464
265 9 2 2 1 209 251 268 379 566 526
266 9 2 2 1 23 24 254 33 361 468
267 9 2 2 1 45 46 255 55 471 362
268 9 2 2 1 42 43 256 52 535 358
269 9 2 2 1 26 27 257 36 357 536
270 9 2 2 1 207 267 246 531 439 286
271 9 2 2 1 214 266 250 350 567 537
272 9 2 2 1 208 250 266 458 567 461
273 9 2 2 1 2 277 71 568 519 76
274 9 2 2 1 4 278 48 569 522 58
275 9 2 2 1 2 21 277 30 518 568
276 9 2 2 1 4 59 278 63 521 569
277 9 2 2 1 173 263 174 545 570 181
278 9 2 2 1 40 41 269 50 504 571
279 9 2 2 1 28 29 270 38 572 505
280 9 2 2 1 170 276 171 543 573 178
281 9 2 2 1 210 238 279 550 559 564
282 9 2 2 1 174 263 240 570 574 348
283 9 2 2 1 210 240 263 425 574 549
284 9 2 2 1 194 258 239 403 441 541
285 9 2 2 1 171 276 245 573 528 396
286 9 2 2 1 207 262 258 463 453 530
287 9 2 2 1 205 271 244 551 418 474
288 9 2 2 1 206 243 272 477 419 552
289 9 2 2 1 202 262 253 454 575 510
290 9 2 2 1 216 253 262 460 575 462
291 9 2 2 1 212 270 261 503 576 577
292 9 2 2 1 212 261 269 577 578 500
293 9 2 2 1 40 269 261 571 578 523
294 9 2 2 1 29 261 270 525 576 572
295 9 2 2 1 211 280 249 514 499 508
296 9 2 2 1 211 274 273 561 579 495
297 9 2 2 1 229 273 274 563 579 547
298 9 2 3 5 5 169 886 176 897 898
299 9 2 3 5 11 887 175 899 900 183
300 9 2 3 5 5 886 15 898 901 20
301 9 2 3 5 11 187 887 192 902 899
302 9 2 3 5 878 881 883 903 904 905
303 9 2 3 5 878 884 881 906 907 903
304 9 2 3 5 172 885 882 908 909 910
305 9 2 3 5 13 14 883 18 911 912
306 9 2 3 5 185 884 186 913 914 190
307 9 2 3 5 170 888 886 915 916 917
308 9 2 3 5 878 882 896 918 919 920
309 9 2 3 5 882 885 896 909 921 919
310 9 2 3 5 172 173 885 180 922 908
311 9 2 3 5 14 891 883 923 924 911
312 9 2 3 5 186 884 892 914 925 926
313 9 2 3 5 171 172 882 179 910 927
314 9 2 3 5 174 175 887 182 900 928
315 9 2 3 5 169 170 886 177 917 897
316 9 2 3 5 174 887 889 928 929 930
317 9 2 3 5 879 886 888 931 916 932
318 9 2 3 5 879 883 891 933 924 934
319 9 2 3 5 880 892 884 935 925 936
320 9 2 3 5 171 882 888 927 937 938
321 9 2 3 5 878 893 882 939 940 918
322 9 2 3 5 881 894 883 941 942 904
323 9 2 3 5 881 884 895 907 943 944
324 9 2 3 5 879 893 883 945 946 933
325 9 2 3 5 878 883 893 905 946 939
326 9 2 3 5 880 884 896 936 947 948
327 9 2 3 5 878 896 884 920 947 906
328 9 2 3 5 13 883 894 912 942 949
329 9 2 3 5 185 895 884 950 943 913
330 9 2 3 5 880 889 887 951 929 952
331 9 2 3 5 882 893 888 940 953 937
332 9 2 3 5 879 888 893 932 953 945
333 9 2 3 5 173 889 885 954 955 922
334 9 2 3 5 1 12 890 16 956 957
335 9 2 3 5 1 890 184 957 958 188
336 9 2 3 5 173 174 889 181 930 954
337 9 2 3 5 14 15 891 19 959 923
338 9 2 3 5 186 892 187 926 960 191
339 9 2 3 5 170 171 888 178 938 915
340 9 2 3 5 880 885 889 961 955 951
341 9 2 3 5 880 896 885 948 921 961
342 9 2 3 5 12 13 894 17 949 962
343 9 2 3 5 184 895 185 963 950 189
344 9 2 3 5 15 886 891 901 964 959
345 9 2 3 5 187 892 887 960 965 902
346 9 2 3 5 879 891 886 934 964 931
347 9 2 3 5 880 887 892 952 965 935
348 9 2 3 5 881 890 894 966 967 941
349 9 2 3 5 881 895 890 944 968 966
350 9 2 3 5 12 894 890 962 967 956
351 9 2 3 5 184 890 895 958 968 963
352 16 2 1 2 2 77 580 21 81 616 617 30
353 16 2 1 2 77 78 581 580 82 618 619 616
354 16 2 1 2 78 79 582 581 83 620 621 618
355 16 2 1 2 79 80 583 582 84 622 623 620
356 16 2 1 2 80 6 113 583 85 122 624 622
357 16 2 1 2 21 580 584 22 617 625 626 31
358 16 2 1 2 580 581 585 584 619 627 628 625
359 16 2 1 2 581 582 586 585 621 629 630 627
360 16 2 1 2 582 583 587 586 623 631 632 629
361 16 2 1 2 583 113 114 587 624 123 633 631
362 16 2 1 2 22 584 588 23 626 634 635 32
363 16 2 1 2 584 585 589 588 628 636 637 634
364 16 2 1 2 585 586 590 589 630 638 639 636
365 16 2 1 2 586 587 591 590 632 640 641 638
366 16 2 1 2 587 114 115 591 633 124 642 640
367 16 2 1 2 23 588 592 24 635 643 644 33
368 16 2 1 2 588 589 593 592 637 645 646 643
369 16 2 1 2 589 590 594 593 639 647 648 645
370 16 2 1 2 590 591 595 594 641 649 650 647
371 16 2 1 2 591 115 116 595 642 125 651 649
372 16 2 1 2 24 592 596 25 644 652 653 34
373 16 2 1 2 592 593 597 596 646 654 655 652
374 16 2 1 2 593 594 598 597 648 656 657 654
375 16 2 1 2 594 595 599 598 650 658 659 656
376 16 2 1 2 595 116 117 599 651 126 660 658
377 16 2 1 2 25 596 600 26 653 661 662 35
378 16 2 1 2 596 597 601 600 655 663 664 661
379 16 2 1 2 597 598 602 601 657 665 666 663
380 16 2 1 2 598 599 603 602 659 667 668 665
381 16 2 1 2 599 117 118 603 660 127 669 667
382 16 2 1 2 26 600 604 27 662 670 671 36
383 16 2 1 2 600 601 605 604 664 672 673 670
384 16 2 1 2 601 602 606 605 666 674 675 672
385 16 2 1 2 602 603 607 606 668 676 677 674
386 16 2 1 2 603 118 119 607 669 128 678 676
387 16 2 1 2 27 604 608 28 671 679 680 37
388 16 2 1 2 604 605 609 608 673 681 682 679
389 16 2 1 2 605 606 610 609 675 683 684 681
390 16 2 1 2 606 607 611 610 677 685 686 683
391 16 2 1 2 607 119 120 611 678 129 687 685
392 16 2 1 2 28 608 612 29 680 688 689 38
393 16 2 1 2 608 609 613 612 682 690 691 688
394 16 2 1 2 609 610 614 613 684 692 693 690
395 16 2 1 2 610 611 615 614 686 694 695 692
396 16 2 1 2 611 120 121 615 687 130 696 694
397 16 2 1 2 29 612 86 3 689 697 90 39
398 16 2 1 2 612 613 87 86 691 698 91 697
399 16 2 1 2 613 614 88 87 693 699 92 698
400 16 2 1 2 614 615 89 88 695 700 93 699
401 16 2 1 2 615 121 7 89 696 131 94 700
402 16 2 1 3 3 86 701 95 90 717 718 99
403 16 2 1 3 95 701 702 96 718 719 720 100
404 16 2 1 3 96 702 703 97 720 721 722 101
405 16 2 1 3 97 703 704 98 722 723 724 102
406 16 2 1 3 98 704 144 9 724 725 149 103
407 16 2 1 3 86 87 705 701 91 726 727 717
408 16 2 1 3 701 705 706 702 727 728 729 719
409 16 2 1 3 702 706 707 703 729 730 731 721
410 16 2 1 3 703 707 708 704 731 732 733 723
411 16 2 1 3 704 708 143 144 733 734 148 725
412 16 2 1 3 87 88 709 705 92 735 736 726
413 16 2 1 3 705 709 710 706 736 737 738 728
414 16 2 1 3 706 710 711 707 738 739 740 730
415 16 2 1 3 707 711 712 708 740 741 742 732
416 16 2 1 3 708 712 142 143 742 743 147 734
417 16 2 1 3 88 89 713 709 93 744 745 735
418 16 2 1 3 709 713 714 710 745 746 747 737
419 16 2 1 3 710 714 715 711 747 748 749 739
420 16 2 1 3 711 715 716 712 749 750 751 741
421 16 2 1 3 712 716 141 142 751 752 146 743
422 16 2 1 3 89 7 132 713 94 136 753 744
423 16 2 1 3 713 132 133 714 753 137 754 746
424 16 2 1 3 714 133 134 715 754 138 755 748
425 16 2 1 3 715 134 135 716 755 139 756 750
426 16 2 1 3 716 135 8 141 756 140 145 752
427 16 2 1 4 9 150 757 98 159 793 794 103
428 16 2 1 4 98 757 758 97 794 795 796 102
429 16 2 1 4 97 758 759 96 796 797 798 101
430 16 2 1 4 96 759 760 95 798 799 800 100
431 16 2 1 4 95 760 40 3 800 801 49 99
432 16 2 1 4 150 151 761 757 160 802 803 793
433 16 2 1 4 757 761 762 758 803 804 805 795
434 16 2 1 4 758 762 763 759 805 806 807 797
435 16 2 1 4 759 763 764 760 807 808 809 799
436 16 2 1 4 760 764 41 40 809 810 50 801
437 16 2 1 4 151 152 765 761 161 811 812 802
438 16 2 1 4 761 765 766 762 812 813 814 804
439 16 2 1 4 762 766 767 763 814 815 816 806
440 16 2 1 4 763 767 768 764 816 817 818 808
441 16 2 1 4 764 768 42 41 818 819 51 810
442 16 2 1 4 152 153 769 765 162 820 821 811
443 16 2 1 4 765 769 770 766 821 822 823 813
444 16 2 1 4 766 770 771 767 823 824 825 815
445 16 2 1 4 767 771 772 768 825 826 827 817
446 16 2 1 4 768 772 43 42 827 828 52 819
447 16 2 1 4 153 154 773 769 163 829 830 820
448 16 2 1 4 769 773 774 770 830 831 832 822
449 16 2 1 4 770 774 775 771 832 833 834 824
450 16 2 1 4 771 775 776 772 834 835 836 826
451 16 2 1 4 772 776 44 43 836 837 53 828
452 16 2 1 4 154 155 777 773 164 838 839 829
453 16 2 1 4 773 777 778 774 839 840 841 831
454 16 2 1 4 774 778 779 775 841 842 843 833
455 16 2 1 4 775 779 780 776 843 844 845 835
456 16 2 1 4 776 780 45 44 845 846 54 837
457 16 2 1 4 155 156 781 777 165 847 848 838
458 16 2 1 4 777 781 782 778 848 849 850 840
459 16 2 1 4 778 782 783 779 850 851 852 842
460 16 2 1 4 779 783 784 780 852 853 854 844
461 16 2 1 4 780 784 46 45 854 855 55 846
462 16 2 1 4 156 157 785 781 166 856 857 847
463 16 2 1 4 781 785 786 782 857 858 859 849
464 16 2 1 4 782 786 787 783 859 860 861 851
465 16 2 1 4 783 787 788 784 861 862 863 853
466 16 2 1 4 784 788 47 46 863 864 56 855
467 16 2 1 4 157 158 789 785 167 865 866 856
468 16 2 1 4 785 789 790 786 866 867 868 858
469 16 2 1 4 786 790 791 787 868 869 870 860
470 16 2 1 4 787 791 792 788 870 871 872 862
471 16 2 1 4 788 792 48 47 872 873 57 864
472 16 2 1 4 158 10 107 789 168 112 874 865
473 16 2 1 4 789 107 106 790 874 111 875 867
474 16 2 1 4 790 106 105 791 875 110 876 869
475 16 2 1 4 791 105 104 792 876 109 877 871
476 16 2 1 4 792 104 4 48 877 108 58 873
$EndElements
