[Info]
Version 1
Dimension 3
NumNodes 370
Num3DElements 243
Num2DElements 216
Num1DElements 0
NumNodeBC 7
NumSaveNodes 0
NumSaveElements 0
Num 2d-line      : 0
Num 2d-line,quad : 0
Num 3d-line      : 0
Num 3d-line,quad : 0
Num triangle     : 0
Num triangle,quad: 0
Num quadr        : 216
Num quadr,quad   : 0
Num tetra        : 0
Num tetra,quad   : 0
Num brick        : 243
Num brick,quad   : 0
Num pyramid      : 0
Num pyramid,quad : 0
Num wedge        : 0
Num wedge,quad   : 0

[Nodes]
#NodeNr x-coord y-coord z-coord
       1  1.0000000000000e+01  1.0000000000000e+01 -2.0000000000000e+00 
       2  1.0000000000000e+01  1.0000000000000e+01 -1.0000000000000e+00 
       3  1.0000000000000e+01  1.0000000000000e+01  0.0000000000000e+00 
       4  1.0000000000000e+01  1.0000000000000e+01  5.0000000000000e-01 
       5  8.0000000000000e+00  8.0000000000000e+00 -2.0000000000000e+00 
       6  1.0000000000000e+01  1.0000000000000e+01  1.0000000000000e+00 
       7  8.0000000000000e+00  8.0000000000000e+00 -1.0000000000000e+00 
       8  6.6666666666667e+00  1.0000000000000e+01 -2.0000000000000e+00 
       9  1.0000000000000e+01  6.6666666666667e+00 -2.0000000000000e+00 
      10  8.0000000000000e+00  8.0000000000000e+00  0.0000000000000e+00 
      11  6.6666666666667e+00  1.0000000000000e+01 -1.0000000000000e+00 
      12  1.0000000000000e+01  6.6666666666667e+00 -1.0000000000000e+00 
      13  1.0000000000000e+01  1.0000000000000e+01  1.5000000000000e+00 
      14  8.0000000000000e+00  8.0000000000000e+00  5.0000000000000e-01 
      15  6.6666666666667e+00  1.0000000000000e+01  0.0000000000000e+00 
      16  1.0000000000000e+01  6.6666666666667e+00  0.0000000000000e+00 
      17  1.0000000000000e+01  1.0000000000000e+01  2.0000000000000e+00 
      18  8.0000000000000e+00  8.0000000000000e+00  1.0000000000000e+00 
      19  6.6666666666667e+00  1.0000000000000e+01  5.0000000000000e-01 
      20  1.0000000000000e+01  6.6666666666667e+00  5.0000000000000e-01 
      21  6.6666666666667e+00  1.0000000000000e+01  1.0000000000000e+00 
      22  1.0000000000000e+01  6.6666666666667e+00  1.0000000000000e+00 
      23  1.0000000000000e+01  1.0000000000000e+01  2.5000000000000e+00 
      24  8.0000000000000e+00  8.0000000000000e+00  1.5000000000000e+00 
      25  6.6666666666667e+00  1.0000000000000e+01  1.5000000000000e+00 
      26  1.0000000000000e+01  6.6666666666667e+00  1.5000000000000e+00 
      27  8.0000000000000e+00  8.0000000000000e+00  2.0000000000000e+00 
      28  1.0000000000000e+01  1.0000000000000e+01  3.0000000000000e+00 
      29  8.0000000002238e+00  5.3333333334094e+00 -2.0000000000000e+00 
      30  5.3333332571945e+00  8.0000000006328e+00 -2.0000000000000e+00 
      31  5.3333332953020e+00  8.0000000004283e+00 -1.0000000000000e+00 
      32  8.0000000004283e+00  5.3333332953020e+00 -1.0000000000000e+00 
      33  6.6666666666667e+00  1.0000000000000e+01  2.0000000000000e+00 
      34  1.0000000000000e+01  6.6666666666667e+00  2.0000000000000e+00 
      35  8.0000000000000e+00  8.0000000000000e+00  2.5000000000000e+00 
      36  5.3333333334094e+00  8.0000000002238e+00  0.0000000000000e+00 
      37  8.0000000006328e+00  5.3333332571945e+00  0.0000000000000e+00 
      38  1.0000000000000e+01  1.0000000000000e+01  3.5000000000000e+00 
      39  6.6666666666667e+00  1.0000000000000e+01  2.5000000000000e+00 
      40  1.0000000000000e+01  6.6666666666667e+00  2.5000000000000e+00 
      41  6.0000000000000e+00  6.0000000000000e+00 -2.0000000000000e+00 
      42  5.3333333334094e+00  8.0000000002238e+00  5.0000000000000e-01 
      43  8.0000000006328e+00  5.3333332571945e+00  5.0000000000000e-01 
      44  6.0000000000000e+00  6.0000000000000e+00 -1.0000000000000e+00 
      45  8.0000000000000e+00  8.0000000000000e+00  3.0000000000000e+00 
      46  5.3333333334094e+00  8.0000000002238e+00  1.0000000000000e+00 
      47  8.0000000006328e+00  5.3333332571945e+00  1.0000000000000e+00 
      48  6.0000000000000e+00  6.0000000000000e+00  0.0000000000000e+00 
      49  6.6666666666667e+00  1.0000000000000e+01  3.0000000000000e+00 
      50  1.0000000000000e+01  6.6666666666667e+00  3.0000000000000e+00 
      51  5.3333333334094e+00  8.0000000002238e+00  1.5000000000000e+00 
      52  8.0000000006328e+00  5.3333332571945e+00  1.5000000000000e+00 
      53  6.0000000000000e+00  6.0000000000000e+00  5.0000000000000e-01 
      54  8.0000000000000e+00  8.0000000000000e+00  3.5000000000000e+00 
      55  6.0000000000000e+00  6.0000000000000e+00  1.0000000000000e+00 
      56  6.6666666666667e+00  1.0000000000000e+01  3.5000000000000e+00 
      57  1.0000000000000e+01  6.6666666666667e+00  3.5000000000000e+00 
      58  5.3333333334094e+00  8.0000000002238e+00  2.0000000000000e+00 
      59  8.0000000006328e+00  5.3333332571945e+00  2.0000000000000e+00 
      60  6.0000000000000e+00  6.0000000000000e+00  1.5000000000000e+00 
      61  3.3333333333333e+00  1.0000000000000e+01 -2.0000000000000e+00 
      62  1.0000000000000e+01  3.3333333333333e+00 -2.0000000000000e+00 
      63  1.0000000000000e+01  3.3333333333333e+00 -1.0000000000000e+00 
      64  3.3333333333333e+00  1.0000000000000e+01 -1.0000000000000e+00 
      65  5.3333333334094e+00  8.0000000002238e+00  2.5000000000000e+00 
      66  8.0000000006328e+00  5.3333332571945e+00  2.5000000000000e+00 
      67  6.0000000000000e+00  6.0000000000000e+00  2.0000000000000e+00 
      68  3.3333333333333e+00  1.0000000000000e+01  0.0000000000000e+00 
      69  1.0000000000000e+01  3.3333333333333e+00  0.0000000000000e+00 
      70  5.0000000000000e+00  5.0000000000000e+00 -2.0000000000000e+00 
      71  3.3333333333333e+00  1.0000000000000e+01  5.0000000000000e-01 
      72  1.0000000000000e+01  3.3333333333333e+00  5.0000000000000e-01 
      73  5.3333333334094e+00  8.0000000002238e+00  3.0000000000000e+00 
      74  8.0000000006328e+00  5.3333332571945e+00  3.0000000000000e+00 
      75  5.0000000000000e+00  5.0000000000000e+00 -1.0000000000000e+00 
      76  4.0000000000000e+00  6.0000000000000e+00 -2.0000000000000e+00 
      77  6.0000000000000e+00  4.0000000000000e+00 -2.0000000000000e+00 
      78  6.0000000000000e+00  6.0000000000000e+00  2.5000000000000e+00 
      79  4.0000000000000e+00  6.0000000000000e+00 -1.0000000000000e+00 
      80  6.0000000000000e+00  4.0000000000000e+00 -1.0000000000000e+00 
      81  3.3333333333333e+00  1.0000000000000e+01  1.0000000000000e+00 
      82  1.0000000000000e+01  3.3333333333333e+00  1.0000000000000e+00 
      83  5.0000000000000e+00  5.0000000000000e+00  0.0000000000000e+00 
      84  6.0000000000000e+00  4.0000000000000e+00  0.0000000000000e+00 
      85  4.0000000000000e+00  6.0000000000000e+00  0.0000000000000e+00 
      86  5.3333333334094e+00  8.0000000002238e+00  3.5000000000000e+00 
      87  8.0000000006328e+00  5.3333332571945e+00  3.5000000000000e+00 
      88  5.0000000000000e+00  5.0000000000000e+00  5.0000000000000e-01 
      89  3.3333333333333e+00  1.0000000000000e+01  1.5000000000000e+00 
      90  1.0000000000000e+01  3.3333333333333e+00  1.5000000000000e+00 
      91  6.0000000000000e+00  6.0000000000000e+00  3.0000000000000e+00 
      92  8.0000000024771e+00  2.6666666030092e+00 -2.0000000000000e+00 
      93  2.6666664933053e+00  8.0000001831678e+00 -2.0000000000000e+00 
      94  4.0000000000000e+00  6.0000000000000e+00  5.0000000000000e-01 
      95  6.0000000000000e+00  4.0000000000000e+00  5.0000000000000e-01 
      96  2.6666665481572e+00  8.0000000928225e+00 -1.0000000000000e+00 
      97  8.0000000928225e+00  2.6666665481572e+00 -1.0000000000000e+00 
      98  5.0000000000000e+00  5.0000000000000e+00  1.0000000000000e+00 
      99  3.3333333333333e+00  1.0000000000000e+01  2.0000000000000e+00 
     100  1.0000000000000e+01  3.3333333333333e+00  2.0000000000000e+00 
     101  4.0000000000000e+00  6.0000000000000e+00  1.0000000000000e+00 
     102  6.0000000000000e+00  4.0000000000000e+00  1.0000000000000e+00 
     103  2.6666666030092e+00  8.0000000024771e+00  0.0000000000000e+00 
     104  8.0000001831678e+00  2.6666664933053e+00  0.0000000000000e+00 
     105  6.0000000000000e+00  6.0000000000000e+00  3.5000000000000e+00 
     106  5.0000000000000e+00  5.0000000000000e+00  1.5000000000000e+00 
     107  2.6666666030092e+00  8.0000000024771e+00  5.0000000000000e-01 
     108  8.0000001831678e+00  2.6666664933053e+00  5.0000000000000e-01 
     109  4.0000000000000e+00  6.0000000000000e+00  1.5000000000000e+00 
     110  6.0000000000000e+00  4.0000000000000e+00  1.5000000000000e+00 
     111  3.3333333333333e+00  1.0000000000000e+01  2.5000000000000e+00 
     112  1.0000000000000e+01  3.3333333333333e+00  2.5000000000000e+00 
     113  5.0000000000000e+00  5.0000000000000e+00  2.0000000000000e+00 
     114  2.6666666030092e+00  8.0000000024771e+00  1.0000000000000e+00 
     115  8.0000001831678e+00  2.6666664933053e+00  1.0000000000000e+00 
     116  4.0000000000000e+00  6.0000000000000e+00  2.0000000000000e+00 
     117  6.0000000000000e+00  4.0000000000000e+00  2.0000000000000e+00 
     118  3.3333333333333e+00  5.0000000000000e+00 -2.0000000000000e+00 
     119  5.0000000000000e+00  3.3333333333333e+00 -2.0000000000000e+00 
     120  3.3333333333333e+00  1.0000000000000e+01  3.0000000000000e+00 
     121  1.0000000000000e+01  3.3333333333333e+00  3.0000000000000e+00 
     122  2.6666666030092e+00  8.0000000024771e+00  1.5000000000000e+00 
     123  8.0000001831678e+00  2.6666664933053e+00  1.5000000000000e+00 
     124  5.0000000000000e+00  5.0000000000000e+00  2.5000000000000e+00 
     125  3.3333333333333e+00  5.0000000000000e+00 -1.0000000000000e+00 
     126  5.0000000000000e+00  3.3333333333333e+00 -1.0000000000000e+00 
     127  4.0000000000000e+00  6.0000000000000e+00  2.5000000000000e+00 
     128  6.0000000000000e+00  4.0000000000000e+00  2.5000000000000e+00 
     129  3.3333333333333e+00  5.0000000000000e+00  0.0000000000000e+00 
     130  5.0000000000000e+00  3.3333333333333e+00  0.0000000000000e+00 
     131  2.6666666030092e+00  8.0000000024771e+00  2.0000000000000e+00 
     132  8.0000001831678e+00  2.6666664933053e+00  2.0000000000000e+00 
     133  3.3333333333333e+00  1.0000000000000e+01  3.5000000000000e+00 
     134  1.0000000000000e+01  3.3333333333333e+00  3.5000000000000e+00 
     135  5.0000000000000e+00  5.0000000000000e+00  3.0000000000000e+00 
     136  3.3333333333333e+00  5.0000000000000e+00  5.0000000000000e-01 
     137  5.0000000000000e+00  3.3333333333333e+00  5.0000000000000e-01 
     138  4.0000000000000e+00  6.0000000000000e+00  3.0000000000000e+00 
     139  6.0000000000000e+00  4.0000000000000e+00  3.0000000000000e+00 
     140  2.6666666030092e+00  8.0000000024771e+00  2.5000000000000e+00 
     141  8.0000001831678e+00  2.6666664933053e+00  2.5000000000000e+00 
     142  3.3333333333333e+00  5.0000000000000e+00  1.0000000000000e+00 
     143  5.0000000000000e+00  3.3333333333333e+00  1.0000000000000e+00 
     144  2.0000000000000e+00  6.0000000000000e+00 -2.0000000000000e+00 
     145  6.0000000000000e+00  2.0000000000000e+00 -2.0000000000000e+00 
     146  5.0000000000000e+00  5.0000000000000e+00  3.5000000000000e+00 
     147  2.0000000000000e+00  6.0000000000000e+00 -1.0000000000000e+00 
     148  6.0000000000000e+00  2.0000000000000e+00 -1.0000000000000e+00 
     149  3.3333333333333e+00  5.0000000000000e+00  1.5000000000000e+00 
     150  5.0000000000000e+00  3.3333333333333e+00  1.5000000000000e+00 
     151  4.0000000000000e+00  6.0000000000000e+00  3.5000000000000e+00 
     152  6.0000000000000e+00  4.0000000000000e+00  3.5000000000000e+00 
     153  2.6666666030092e+00  8.0000000024771e+00  3.0000000000000e+00 
     154  8.0000001831678e+00  2.6666664933053e+00  3.0000000000000e+00 
     155  6.0000000000000e+00  2.0000000000000e+00  0.0000000000000e+00 
     156  2.0000000000000e+00  6.0000000000000e+00  0.0000000000000e+00 
     157  3.3333333333333e+00  5.0000000000000e+00  2.0000000000000e+00 
     158  5.0000000000000e+00  3.3333333333333e+00  2.0000000000000e+00 
     159  6.0000000000000e+00  2.0000000000000e+00  5.0000000000000e-01 
     160  2.0000000000000e+00  6.0000000000000e+00  5.0000000000000e-01 
     161  2.6666666030092e+00  8.0000000024771e+00  3.5000000000000e+00 
     162  8.0000001831678e+00  2.6666664933053e+00  3.5000000000000e+00 
     163  3.3333333333333e+00  3.3333333333333e+00 -2.0000000000000e+00 
     164  2.0000000000000e+00  6.0000000000000e+00  1.0000000000000e+00 
     165  6.0000000000000e+00  2.0000000000000e+00  1.0000000000000e+00 
     166  3.3333333333333e+00  5.0000000000000e+00  2.5000000000000e+00 
     167  5.0000000000000e+00  3.3333333333333e+00  2.5000000000000e+00 
     168  3.3333333333333e+00  3.3333333333333e+00 -1.0000000000000e+00 
     169  6.0000000000000e+00  2.0000000000000e+00  1.5000000000000e+00 
     170  2.0000000000000e+00  6.0000000000000e+00  1.5000000000000e+00 
     171  3.3333333333333e+00  3.3333333333333e+00  0.0000000000000e+00 
     172  1.6666666666667e+00  5.0000000000000e+00 -2.0000000000000e+00 
     173  5.0000000000000e+00  1.6666666666667e+00 -2.0000000000000e+00 
     174  3.3333333333333e+00  5.0000000000000e+00  3.0000000000000e+00 
     175  5.0000000000000e+00  3.3333333333333e+00  3.0000000000000e+00 
     176  3.3333333333333e+00  3.3333333333333e+00  5.0000000000000e-01 
     177  5.0000000000000e+00  1.6666666666667e+00 -1.0000000000000e+00 
     178  1.6666666666667e+00  5.0000000000000e+00 -1.0000000000000e+00 
     179  2.0000000000000e+00  6.0000000000000e+00  2.0000000000000e+00 
     180  6.0000000000000e+00  2.0000000000000e+00  2.0000000000000e+00 
     181  3.3333333333333e+00  3.3333333333333e+00  1.0000000000000e+00 
     182  1.6666666666667e+00  5.0000000000000e+00  0.0000000000000e+00 
     183  5.0000000000000e+00  1.6666666666667e+00  0.0000000000000e+00 
     184  3.3333333333333e+00  5.0000000000000e+00  3.5000000000000e+00 
     185  5.0000000000000e+00  3.3333333333333e+00  3.5000000000000e+00 
     186  1.0000000000000e+01  0.0000000000000e+00 -2.0000000000000e+00 
     187  0.0000000000000e+00  1.0000000000000e+01 -2.0000000000000e+00 
     188  2.0000000000000e+00  6.0000000000000e+00  2.5000000000000e+00 
     189  6.0000000000000e+00  2.0000000000000e+00  2.5000000000000e+00 
     190  1.6666666666667e+00  5.0000000000000e+00  5.0000000000000e-01 
     191  5.0000000000000e+00  1.6666666666667e+00  5.0000000000000e-01 
     192  1.0000000000000e+01  0.0000000000000e+00 -1.0000000000000e+00 
     193  0.0000000000000e+00  1.0000000000000e+01 -1.0000000000000e+00 
     194  3.3333333333333e+00  3.3333333333333e+00  1.5000000000000e+00 
     195  1.6666666666667e+00  5.0000000000000e+00  1.0000000000000e+00 
     196  5.0000000000000e+00  1.6666666666667e+00  1.0000000000000e+00 
     197  1.0000000000000e+01  0.0000000000000e+00  0.0000000000000e+00 
     198  0.0000000000000e+00  1.0000000000000e+01  0.0000000000000e+00 
     199  8.0000000000000e+00  0.0000000000000e+00 -2.0000000000000e+00 
     200  0.0000000000000e+00  8.0000000000000e+00 -2.0000000000000e+00 
     201  3.3333333333333e+00  3.3333333333333e+00  2.0000000000000e+00 
     202  8.0000000000000e+00  0.0000000000000e+00 -1.0000000000000e+00 
     203  0.0000000000000e+00  8.0000000000000e+00 -1.0000000000000e+00 
     204  6.0000000000000e+00  2.0000000000000e+00  3.0000000000000e+00 
     205  2.0000000000000e+00  6.0000000000000e+00  3.0000000000000e+00 
     206  1.0000000000000e+01  0.0000000000000e+00  5.0000000000000e-01 
     207  0.0000000000000e+00  1.0000000000000e+01  5.0000000000000e-01 
     208  1.6666666666667e+00  5.0000000000000e+00  1.5000000000000e+00 
     209  5.0000000000000e+00  1.6666666666667e+00  1.5000000000000e+00 
     210  8.0000000000000e+00  0.0000000000000e+00  0.0000000000000e+00 
     211  0.0000000000000e+00  8.0000000000000e+00  0.0000000000000e+00 
     212  1.0000000000000e+01  0.0000000000000e+00  1.0000000000000e+00 
     213  0.0000000000000e+00  1.0000000000000e+01  1.0000000000000e+00 
     214  3.3333333333333e+00  3.3333333333333e+00  2.5000000000000e+00 
     215  2.0000000000000e+00  6.0000000000000e+00  3.5000000000000e+00 
     216  6.0000000000000e+00  2.0000000000000e+00  3.5000000000000e+00 
     217  8.0000000000000e+00  0.0000000000000e+00  5.0000000000000e-01 
     218  0.0000000000000e+00  8.0000000000000e+00  5.0000000000000e-01 
     219  1.6666666666667e+00  5.0000000000000e+00  2.0000000000000e+00 
     220  5.0000000000000e+00  1.6666666666667e+00  2.0000000000000e+00 
     221  1.0000000000000e+01  0.0000000000000e+00  1.5000000000000e+00 
     222  0.0000000000000e+00  1.0000000000000e+01  1.5000000000000e+00 
     223  8.0000000000000e+00  0.0000000000000e+00  1.0000000000000e+00 
     224  0.0000000000000e+00  8.0000000000000e+00  1.0000000000000e+00 
     225  1.6666666666667e+00  3.3333333333333e+00 -2.0000000000000e+00 
     226  3.3333333333333e+00  3.3333333333333e+00  3.0000000000000e+00 
     227  3.3333333333333e+00  1.6666666666667e+00 -2.0000000000000e+00 
     228  1.6666666666667e+00  5.0000000000000e+00  2.5000000000000e+00 
     229  5.0000000000000e+00  1.6666666666667e+00  2.5000000000000e+00 
     230  3.3333333333333e+00  1.6666666666667e+00 -1.0000000000000e+00 
     231  1.6666666666667e+00  3.3333333333333e+00 -1.0000000000000e+00 
     232  6.0000000000000e+00  0.0000000000000e+00 -2.0000000000000e+00 
     233  0.0000000000000e+00  6.0000000000000e+00 -2.0000000000000e+00 
     234  1.0000000000000e+01  0.0000000000000e+00  2.0000000000000e+00 
     235  0.0000000000000e+00  1.0000000000000e+01  2.0000000000000e+00 
     236  8.0000000000000e+00  0.0000000000000e+00  1.5000000000000e+00 
     237  0.0000000000000e+00  8.0000000000000e+00  1.5000000000000e+00 
     238  0.0000000000000e+00  6.0000000000000e+00 -1.0000000000000e+00 
     239  6.0000000000000e+00  0.0000000000000e+00 -1.0000000000000e+00 
     240  3.3333333333333e+00  1.6666666666667e+00  0.0000000000000e+00 
     241  1.6666666666667e+00  3.3333333333333e+00  0.0000000000000e+00 
     242  3.3333333333333e+00  3.3333333333333e+00  3.5000000000000e+00 
     243  1.6666666666667e+00  5.0000000000000e+00  3.0000000000000e+00 
     244  5.0000000000000e+00  1.6666666666667e+00  3.0000000000000e+00 
     245  6.0000000000000e+00  0.0000000000000e+00  0.0000000000000e+00 
     246  0.0000000000000e+00  6.0000000000000e+00  0.0000000000000e+00 
     247  8.0000000000000e+00  0.0000000000000e+00  2.0000000000000e+00 
     248  0.0000000000000e+00  8.0000000000000e+00  2.0000000000000e+00 
     249  3.3333333333333e+00  1.6666666666667e+00  5.0000000000000e-01 
     250  1.6666666666667e+00  3.3333333333333e+00  5.0000000000000e-01 
     251  1.0000000000000e+01  0.0000000000000e+00  2.5000000000000e+00 
     252  0.0000000000000e+00  1.0000000000000e+01  2.5000000000000e+00 
     253  0.0000000000000e+00  6.0000000000000e+00  5.0000000000000e-01 
     254  6.0000000000000e+00  0.0000000000000e+00  5.0000000000000e-01 
     255  3.3333333333333e+00  1.6666666666667e+00  1.0000000000000e+00 
     256  1.6666666666667e+00  3.3333333333333e+00  1.0000000000000e+00 
     257  8.0000000000000e+00  0.0000000000000e+00  2.5000000000000e+00 
     258  0.0000000000000e+00  8.0000000000000e+00  2.5000000000000e+00 
     259  1.6666666666667e+00  5.0000000000000e+00  3.5000000000000e+00 
     260  5.0000000000000e+00  1.6666666666667e+00  3.5000000000000e+00 
     261  5.0000000000000e+00  0.0000000000000e+00 -2.0000000000000e+00 
     262  0.0000000000000e+00  5.0000000000000e+00 -2.0000000000000e+00 
     263  6.0000000000000e+00  0.0000000000000e+00  1.0000000000000e+00 
     264  0.0000000000000e+00  6.0000000000000e+00  1.0000000000000e+00 
     265  1.0000000000000e+01  0.0000000000000e+00  3.0000000000000e+00 
     266  0.0000000000000e+00  1.0000000000000e+01  3.0000000000000e+00 
     267  0.0000000000000e+00  5.0000000000000e+00 -1.0000000000000e+00 
     268  5.0000000000000e+00  0.0000000000000e+00 -1.0000000000000e+00 
     269  3.3333333333333e+00  1.6666666666667e+00  1.5000000000000e+00 
     270  1.6666666666667e+00  3.3333333333333e+00  1.5000000000000e+00 
     271  0.0000000000000e+00  6.0000000000000e+00  1.5000000000000e+00 
     272  6.0000000000000e+00  0.0000000000000e+00  1.5000000000000e+00 
     273  5.0000000000000e+00  0.0000000000000e+00  0.0000000000000e+00 
     274  0.0000000000000e+00  5.0000000000000e+00  0.0000000000000e+00 
     275  8.0000000000000e+00  0.0000000000000e+00  3.0000000000000e+00 
     276  0.0000000000000e+00  8.0000000000000e+00  3.0000000000000e+00 
     277  3.3333333333333e+00  1.6666666666667e+00  2.0000000000000e+00 
     278  1.6666666666667e+00  3.3333333333333e+00  2.0000000000000e+00 
     279  1.0000000000000e+01  0.0000000000000e+00  3.5000000000000e+00 
     280  0.0000000000000e+00  1.0000000000000e+01  3.5000000000000e+00 
     281  0.0000000000000e+00  5.0000000000000e+00  5.0000000000000e-01 
     282  5.0000000000000e+00  0.0000000000000e+00  5.0000000000000e-01 
     283  6.0000000000000e+00  0.0000000000000e+00  2.0000000000000e+00 
     284  0.0000000000000e+00  6.0000000000000e+00  2.0000000000000e+00 
     285  5.0000000000000e+00  0.0000000000000e+00  1.0000000000000e+00 
     286  0.0000000000000e+00  5.0000000000000e+00  1.0000000000000e+00 
     287  3.3333333333333e+00  1.6666666666667e+00  2.5000000000000e+00 
     288  1.6666666666667e+00  3.3333333333333e+00  2.5000000000000e+00 
     289  8.0000000000000e+00  0.0000000000000e+00  3.5000000000000e+00 
     290  0.0000000000000e+00  8.0000000000000e+00  3.5000000000000e+00 
     291  6.0000000000000e+00  0.0000000000000e+00  2.5000000000000e+00 
     292  0.0000000000000e+00  6.0000000000000e+00  2.5000000000000e+00 
     293  0.0000000000000e+00  5.0000000000000e+00  1.5000000000000e+00 
     294  5.0000000000000e+00  0.0000000000000e+00  1.5000000000000e+00 
     295  1.6666666666667e+00  1.6666666666667e+00 -2.0000000000000e+00 
     296  3.3333333333333e+00  1.6666666666667e+00  3.0000000000000e+00 
     297  1.6666666666667e+00  3.3333333333333e+00  3.0000000000000e+00 
     298  1.6666666666667e+00  1.6666666666667e+00 -1.0000000000000e+00 
     299  5.0000000000000e+00  0.0000000000000e+00  2.0000000000000e+00 
     300  0.0000000000000e+00  5.0000000000000e+00  2.0000000000000e+00 
     301  0.0000000000000e+00  6.0000000000000e+00  3.0000000000000e+00 
     302  6.0000000000000e+00  0.0000000000000e+00  3.0000000000000e+00 
     303  1.6666666666667e+00  1.6666666666667e+00  0.0000000000000e+00 
     304  3.3333333333333e+00  1.6666666666667e+00  3.5000000000000e+00 
     305  1.6666666666667e+00  3.3333333333333e+00  3.5000000000000e+00 
     306  0.0000000000000e+00  3.3333333333333e+00 -2.0000000000000e+00 
     307  3.3333333333333e+00  0.0000000000000e+00 -2.0000000000000e+00 
     308  1.6666666666667e+00  1.6666666666667e+00  5.0000000000000e-01 
     309  5.0000000000000e+00  0.0000000000000e+00  2.5000000000000e+00 
     310  0.0000000000000e+00  5.0000000000000e+00  2.5000000000000e+00 
     311  0.0000000000000e+00  3.3333333333333e+00 -1.0000000000000e+00 
     312  3.3333333333333e+00  0.0000000000000e+00 -1.0000000000000e+00 
     313  6.0000000000000e+00  0.0000000000000e+00  3.5000000000000e+00 
     314  0.0000000000000e+00  6.0000000000000e+00  3.5000000000000e+00 
     315  1.6666666666667e+00  1.6666666666667e+00  1.0000000000000e+00 
     316  0.0000000000000e+00  3.3333333333333e+00  0.0000000000000e+00 
     317  3.3333333333333e+00  0.0000000000000e+00  0.0000000000000e+00 
     318  0.0000000000000e+00  5.0000000000000e+00  3.0000000000000e+00 
     319  5.0000000000000e+00  0.0000000000000e+00  3.0000000000000e+00 
     320  0.0000000000000e+00  3.3333333333333e+00  5.0000000000000e-01 
     321  3.3333333333333e+00  0.0000000000000e+00  5.0000000000000e-01 
     322  1.6666666666667e+00  1.6666666666667e+00  1.5000000000000e+00 
     323  0.0000000000000e+00  3.3333333333333e+00  1.0000000000000e+00 
     324  3.3333333333333e+00  0.0000000000000e+00  1.0000000000000e+00 
     325  1.6666666666667e+00  1.6666666666667e+00  2.0000000000000e+00 
     326  5.0000000000000e+00  0.0000000000000e+00  3.5000000000000e+00 
     327  0.0000000000000e+00  5.0000000000000e+00  3.5000000000000e+00 
     328  0.0000000000000e+00  3.3333333333333e+00  1.5000000000000e+00 
     329  3.3333333333333e+00  0.0000000000000e+00  1.5000000000000e+00 
     330  1.6666666666667e+00  1.6666666666667e+00  2.5000000000000e+00 
     331  0.0000000000000e+00  3.3333333333333e+00  2.0000000000000e+00 
     332  3.3333333333333e+00  0.0000000000000e+00  2.0000000000000e+00 
     333  1.6666666666667e+00  1.6666666666667e+00  3.0000000000000e+00 
     334  0.0000000000000e+00  3.3333333333333e+00  2.5000000000000e+00 
     335  3.3333333333333e+00  0.0000000000000e+00  2.5000000000000e+00 
     336  1.6666666666667e+00  1.6666666666667e+00  3.5000000000000e+00 
     337  0.0000000000000e+00  3.3333333333333e+00  3.0000000000000e+00 
     338  0.0000000000000e+00  1.6666666666667e+00 -2.0000000000000e+00 
     339  1.6666666666667e+00  0.0000000000000e+00 -2.0000000000000e+00 
     340  3.3333333333333e+00  0.0000000000000e+00  3.0000000000000e+00 
     341  1.6666666666667e+00  0.0000000000000e+00 -1.0000000000000e+00 
     342  0.0000000000000e+00  1.6666666666667e+00 -1.0000000000000e+00 
     343  0.0000000000000e+00  1.6666666666667e+00  0.0000000000000e+00 
     344  1.6666666666667e+00  0.0000000000000e+00  0.0000000000000e+00 
     345  0.0000000000000e+00  3.3333333333333e+00  3.5000000000000e+00 
     346  3.3333333333333e+00  0.0000000000000e+00  3.5000000000000e+00 
     347  0.0000000000000e+00  1.6666666666667e+00  5.0000000000000e-01 
     348  1.6666666666667e+00  0.0000000000000e+00  5.0000000000000e-01 
     349  0.0000000000000e+00  1.6666666666667e+00  1.0000000000000e+00 
     350  1.6666666666667e+00  0.0000000000000e+00  1.0000000000000e+00 
     351  0.0000000000000e+00  1.6666666666667e+00  1.5000000000000e+00 
     352  1.6666666666667e+00  0.0000000000000e+00  1.5000000000000e+00 
     353  0.0000000000000e+00  1.6666666666667e+00  2.0000000000000e+00 
     354  1.6666666666667e+00  0.0000000000000e+00  2.0000000000000e+00 
     355  0.0000000000000e+00  1.6666666666667e+00  2.5000000000000e+00 
     356  1.6666666666667e+00  0.0000000000000e+00  2.5000000000000e+00 
     357  0.0000000000000e+00  1.6666666666667e+00  3.0000000000000e+00 
     358  1.6666666666667e+00  0.0000000000000e+00  3.0000000000000e+00 
     359  0.0000000000000e+00  1.6666666666667e+00  3.5000000000000e+00 
     360  1.6666666666667e+00  0.0000000000000e+00  3.5000000000000e+00 
     361  0.0000000000000e+00  0.0000000000000e+00 -2.0000000000000e+00 
     362  0.0000000000000e+00  0.0000000000000e+00 -1.0000000000000e+00 
     363  0.0000000000000e+00  0.0000000000000e+00  0.0000000000000e+00 
     364  0.0000000000000e+00  0.0000000000000e+00  5.0000000000000e-01 
     365  0.0000000000000e+00  0.0000000000000e+00  1.0000000000000e+00 
     366  0.0000000000000e+00  0.0000000000000e+00  1.5000000000000e+00 
     367  0.0000000000000e+00  0.0000000000000e+00  2.0000000000000e+00 
     368  0.0000000000000e+00  0.0000000000000e+00  2.5000000000000e+00 
     369  0.0000000000000e+00  0.0000000000000e+00  3.0000000000000e+00 
     370  0.0000000000000e+00  0.0000000000000e+00  3.5000000000000e+00 


[1D Elements]
#ElemNr  ElemType  NrOfNodes  Level
#Node1 Node2 ... NodeNrOfNodes

[2D Elements]
#ElemNr  ElemType  NrOfNodes  Level
#Node1 Node2 ... NodeNrOfNodes
244 6 4 surfxInner
274 267 238 246
245 6 4 surfxInner
267 262 233 238
246 6 4 surfyInner
344 341 362 363
247 6 4 surfyInner
317 312 341 344
248 6 4 surfyInner
273 268 312 317
249 6 4 surfyInner
341 339 361 362
250 6 4 surfyInner
312 307 339 341
251 6 4 surfyInner
268 261 307 312
252 6 4 surfxInner
316 311 267 274
253 6 4 surfxInner
343 342 311 316
254 6 4 surfxInner
363 362 342 343
255 6 4 surfxInner
311 306 262 267
256 6 4 surfxInner
342 338 306 311
257 6 4 surfxInner
362 361 338 342
258 6 4 surfyInner
210 202 239 245
259 6 4 surfyInner
197 192 202 210
260 6 4 surfyInner
202 199 232 239
261 6 4 surfyInner
192 186 199 202
262 6 4 surfxOuter
69 63 192 197
263 6 4 surfxOuter
16 12 63 69
264 6 4 surfxOuter
3 2 12 16
265 6 4 surfxOuter
63 62 186 192
266 6 4 surfxOuter
12 9 62 63
267 6 4 surfxOuter
2 1 9 12
268 6 4 surfyOuter
15 11 2 3
269 6 4 surfyOuter
68 64 11 15
270 6 4 surfyOuter
198 193 64 68
271 6 4 surfyOuter
11 8 1 2
272 6 4 surfyOuter
64 61 8 11
273 6 4 surfyOuter
193 187 61 64
274 6 4 surfxInner
211 203 193 198
275 6 4 surfxInner
246 238 203 211
276 6 4 surfxInner
203 200 187 193
277 6 4 surfxInner
238 233 200 203
278 6 4 surfyInner
245 239 268 273
279 6 4 surfyInner
239 232 261 268
280 6 4 bottom
339 295 338 361
281 6 4 bottom
307 227 295 339
282 6 4 bottom
261 173 227 307
283 6 4 bottom
295 225 306 338
284 6 4 bottom
227 163 225 295
285 6 4 bottom
173 119 163 227
286 6 4 bottom
225 172 262 306
287 6 4 bottom
163 118 172 225
288 6 4 bottom
119 70 118 163
289 6 4 bottom
62 92 199 186
290 6 4 bottom
9 29 92 62
291 6 4 bottom
1 5 29 9
292 6 4 bottom
92 145 232 199
293 6 4 bottom
29 77 145 92
294 6 4 bottom
5 41 77 29
295 6 4 bottom
8 30 5 1
296 6 4 bottom
61 93 30 8
297 6 4 bottom
187 200 93 61
298 6 4 bottom
30 76 41 5
299 6 4 bottom
93 144 76 30
300 6 4 bottom
200 233 144 93
301 6 4 bottom
145 173 261 232
302 6 4 bottom
77 119 173 145
303 6 4 bottom
41 70 119 77
304 6 4 bottom
76 118 70 41
305 6 4 bottom
144 172 118 76
306 6 4 bottom
233 262 172 144
307 6 4 surfxInner
246 253 281 274
308 6 4 surfxInner
253 264 286 281
309 6 4 surfyInner
317 321 282 273
310 6 4 surfyInner
344 348 321 317
311 6 4 surfyInner
363 364 348 344
312 6 4 surfyInner
321 324 285 282
313 6 4 surfyInner
348 350 324 321
314 6 4 surfyInner
364 365 350 348
315 6 4 surfxInner
343 347 364 363
316 6 4 surfxInner
316 320 347 343
317 6 4 surfxInner
274 281 320 316
318 6 4 surfxInner
347 349 365 364
319 6 4 surfxInner
320 323 349 347
320 6 4 surfxInner
281 286 323 320
321 6 4 surfyInner
210 217 206 197
322 6 4 surfyInner
245 254 217 210
323 6 4 surfyInner
217 223 212 206
324 6 4 surfyInner
254 263 223 217
325 6 4 surfxOuter
16 20 4 3
326 6 4 surfxOuter
69 72 20 16
327 6 4 surfxOuter
197 206 72 69
328 6 4 surfxOuter
20 22 6 4
329 6 4 surfxOuter
72 82 22 20
330 6 4 surfxOuter
206 212 82 72
331 6 4 surfyOuter
68 71 207 198
332 6 4 surfyOuter
15 19 71 68
333 6 4 surfyOuter
3 4 19 15
334 6 4 surfyOuter
71 81 213 207
335 6 4 surfyOuter
19 21 81 71
336 6 4 surfyOuter
4 6 21 19
337 6 4 surfxInner
211 218 253 246
338 6 4 surfxInner
198 207 218 211
339 6 4 surfxInner
218 224 264 253
340 6 4 surfxInner
207 213 224 218
341 6 4 surfyInner
273 282 254 245
342 6 4 surfyInner
282 285 263 254
343 6 4 surfxInner
264 271 293 286
344 6 4 surfxInner
271 284 300 293
345 6 4 surfyInner
324 329 294 285
346 6 4 surfyInner
350 352 329 324
347 6 4 surfyInner
365 366 352 350
348 6 4 surfyInner
329 332 299 294
349 6 4 surfyInner
352 354 332 329
350 6 4 surfyInner
366 367 354 352
351 6 4 surfxInner
349 351 366 365
352 6 4 surfxInner
323 328 351 349
353 6 4 surfxInner
286 293 328 323
354 6 4 surfxInner
351 353 367 366
355 6 4 surfxInner
328 331 353 351
356 6 4 surfxInner
293 300 331 328
357 6 4 surfyInner
223 236 221 212
358 6 4 surfyInner
263 272 236 223
359 6 4 surfyInner
236 247 234 221
360 6 4 surfyInner
272 283 247 236
361 6 4 surfxOuter
22 26 13 6
362 6 4 surfxOuter
82 90 26 22
363 6 4 surfxOuter
212 221 90 82
364 6 4 surfxOuter
26 34 17 13
365 6 4 surfxOuter
90 100 34 26
366 6 4 surfxOuter
221 234 100 90
367 6 4 surfyOuter
81 89 222 213
368 6 4 surfyOuter
21 25 89 81
369 6 4 surfyOuter
6 13 25 21
370 6 4 surfyOuter
89 99 235 222
371 6 4 surfyOuter
25 33 99 89
372 6 4 surfyOuter
13 17 33 25
373 6 4 surfxInner
224 237 271 264
374 6 4 surfxInner
213 222 237 224
375 6 4 surfxInner
237 248 284 271
376 6 4 surfxInner
222 235 248 237
377 6 4 surfyInner
285 294 272 263
378 6 4 surfyInner
294 299 283 272
379 6 4 surfxInner
284 292 310 300
380 6 4 surfyInner
332 335 309 299
381 6 4 surfyInner
354 356 335 332
382 6 4 surfyInner
367 368 356 354
383 6 4 surfxInner
353 355 368 367
384 6 4 surfxInner
331 334 355 353
385 6 4 surfxInner
300 310 334 331
386 6 4 surfyInner
247 257 251 234
387 6 4 surfyInner
283 291 257 247
388 6 4 surfxOuter
34 40 23 17
389 6 4 surfxOuter
100 112 40 34
390 6 4 surfxOuter
234 251 112 100
391 6 4 surfyOuter
99 111 252 235
392 6 4 surfyOuter
33 39 111 99
393 6 4 surfyOuter
17 23 39 33
394 6 4 surfxInner
248 258 292 284
395 6 4 surfxInner
235 252 258 248
396 6 4 surfyInner
299 309 291 283
397 6 4 surfxInner
292 301 318 310
398 6 4 surfxInner
301 314 327 318
399 6 4 surfyInner
335 340 319 309
400 6 4 surfyInner
356 358 340 335
401 6 4 surfyInner
368 369 358 356
402 6 4 surfyInner
340 346 326 319
403 6 4 surfyInner
358 360 346 340
404 6 4 surfyInner
369 370 360 358
405 6 4 surfxInner
355 357 369 368
406 6 4 surfxInner
334 337 357 355
407 6 4 surfxInner
310 318 337 334
408 6 4 surfxInner
357 359 370 369
409 6 4 surfxInner
337 345 359 357
410 6 4 surfxInner
318 327 345 337
411 6 4 surfyInner
257 275 265 251
412 6 4 surfyInner
291 302 275 257
413 6 4 surfyInner
275 289 279 265
414 6 4 surfyInner
302 313 289 275
415 6 4 surfxOuter
40 50 28 23
416 6 4 surfxOuter
112 121 50 40
417 6 4 surfxOuter
251 265 121 112
418 6 4 surfxOuter
50 57 38 28
419 6 4 surfxOuter
121 134 57 50
420 6 4 surfxOuter
265 279 134 121
421 6 4 surfyOuter
111 120 266 252
422 6 4 surfyOuter
39 49 120 111
423 6 4 surfyOuter
23 28 49 39
424 6 4 surfyOuter
120 133 280 266
425 6 4 surfyOuter
49 56 133 120
426 6 4 surfyOuter
28 38 56 49
427 6 4 surfxInner
258 276 301 292
428 6 4 surfxInner
252 266 276 258
429 6 4 surfxInner
276 290 314 301
430 6 4 surfxInner
266 280 290 276
431 6 4 surfyInner
309 319 302 291
432 6 4 surfyInner
319 326 313 302
433 6 4 top
346 304 260 326
434 6 4 top
360 336 304 346
435 6 4 top
370 359 336 360
436 6 4 top
304 242 185 260
437 6 4 top
336 305 242 304
438 6 4 top
359 345 305 336
439 6 4 top
242 184 146 185
440 6 4 top
305 259 184 242
441 6 4 top
345 327 259 305
442 6 4 top
57 87 54 38
443 6 4 top
134 162 87 57
444 6 4 top
279 289 162 134
445 6 4 top
87 152 105 54
446 6 4 top
162 216 152 87
447 6 4 top
289 313 216 162
448 6 4 top
133 161 290 280
449 6 4 top
56 86 161 133
450 6 4 top
38 54 86 56
451 6 4 top
161 215 314 290
452 6 4 top
86 151 215 161
453 6 4 top
54 105 151 86
454 6 4 top
152 185 146 105
455 6 4 top
216 260 185 152
456 6 4 top
313 326 260 216
457 6 4 top
215 259 327 314
458 6 4 top
151 184 259 215
459 6 4 top
105 146 184 151


[3D Elements]
#ElemNr  ElemType  NrOfNodes  Level
#Node1 Node2 ... NodeNrOfNodes
1 10 8 airV
230 177 183 240 312 268 273 317
2 10 8 airV
298 230 240 303 341 312 317 344
3 10 8 airV
342 298 303 343 362 341 344 363
4 10 8 airV
227 173 177 230 307 261 268 312
5 10 8 airV
295 227 230 298 339 307 312 341
6 10 8 airV
338 295 298 342 361 339 341 362
7 10 8 airV
168 126 130 171 230 177 183 240
8 10 8 airV
231 168 171 241 298 230 240 303
9 10 8 airV
311 231 241 316 342 298 303 343
10 10 8 airV
163 119 126 168 227 173 177 230
11 10 8 airV
225 163 168 231 295 227 230 298
12 10 8 airV
306 225 231 311 338 295 298 342
13 10 8 airV
125 75 83 129 168 126 130 171
14 10 8 airV
178 125 129 182 231 168 171 241
15 10 8 airV
267 178 182 274 311 231 241 316
16 10 8 airV
118 70 75 125 163 119 126 168
17 10 8 airV
172 118 125 178 225 163 168 231
18 10 8 airV
262 172 178 267 306 225 231 311
19 10 8 airV
32 7 10 37 12 2 3 16
20 10 8 airV
97 32 37 104 63 12 16 69
21 10 8 airV
202 97 104 210 192 63 69 197
22 10 8 airV
29 5 7 32 9 1 2 12
23 10 8 airV
92 29 32 97 62 9 12 63
24 10 8 airV
199 92 97 202 186 62 63 192
25 10 8 airV
80 44 48 84 32 7 10 37
26 10 8 airV
148 80 84 155 97 32 37 104
27 10 8 airV
239 148 155 245 202 97 104 210
28 10 8 airV
77 41 44 80 29 5 7 32
29 10 8 airV
145 77 80 148 92 29 32 97
30 10 8 airV
232 145 148 239 199 92 97 202
31 10 8 airV
96 203 211 103 64 193 198 68
32 10 8 airV
31 96 103 36 11 64 68 15
33 10 8 airV
7 31 36 10 2 11 15 3
34 10 8 airV
93 200 203 96 61 187 193 64
35 10 8 airV
30 93 96 31 8 61 64 11
36 10 8 airV
5 30 31 7 1 8 11 2
37 10 8 airV
147 238 246 156 96 203 211 103
38 10 8 airV
79 147 156 85 31 96 103 36
39 10 8 airV
44 79 85 48 7 31 36 10
40 10 8 airV
144 233 238 147 93 200 203 96
41 10 8 airV
76 144 147 79 30 93 96 31
42 10 8 airV
41 76 79 44 5 30 31 7
43 10 8 airV
126 75 83 130 80 44 48 84
44 10 8 airV
177 126 130 183 148 80 84 155
45 10 8 airV
268 177 183 273 239 148 155 245
46 10 8 airV
119 70 75 126 77 41 44 80
47 10 8 airV
173 119 126 177 145 77 80 148
48 10 8 airV
261 173 177 268 232 145 148 239
49 10 8 airV
178 267 274 182 147 238 246 156
50 10 8 airV
125 178 182 129 79 147 156 85
51 10 8 airV
75 125 129 83 44 79 85 48
52 10 8 airV
172 262 267 178 144 233 238 147
53 10 8 airV
118 172 178 125 76 144 147 79
54 10 8 airV
70 118 125 75 41 76 79 44
55 10 8 coreV
308 347 343 303 348 364 363 344
56 10 8 coreV
249 308 303 240 321 348 344 317
57 10 8 coreV
191 249 240 183 282 321 317 273
58 10 8 coreV
315 349 347 308 350 365 364 348
59 10 8 coreV
255 315 308 249 324 350 348 321
60 10 8 coreV
196 255 249 191 285 324 321 282
61 10 8 coreV
250 320 316 241 308 347 343 303
62 10 8 coreV
176 250 241 171 249 308 303 240
63 10 8 coreV
137 176 171 130 191 249 240 183
64 10 8 coreV
256 323 320 250 315 349 347 308
65 10 8 coreV
181 256 250 176 255 315 308 249
66 10 8 coreV
143 181 176 137 196 255 249 191
67 10 8 coreV
190 281 274 182 250 320 316 241
68 10 8 coreV
136 190 182 129 176 250 241 171
69 10 8 coreV
88 136 129 83 137 176 171 130
70 10 8 coreV
195 286 281 190 256 323 320 250
71 10 8 coreV
142 195 190 136 181 256 250 176
72 10 8 coreV
98 142 136 88 143 181 176 137
73 10 8 airV
108 217 210 104 72 206 197 69
74 10 8 airV
43 108 104 37 20 72 69 16
75 10 8 airV
14 43 37 10 4 20 16 3
76 10 8 airV
115 223 217 108 82 212 206 72
77 10 8 airV
47 115 108 43 22 82 72 20
78 10 8 airV
18 47 43 14 6 22 20 4
79 10 8 airV
159 254 245 155 108 217 210 104
80 10 8 airV
95 159 155 84 43 108 104 37
81 10 8 airV
53 95 84 48 14 43 37 10
82 10 8 airV
165 263 254 159 115 223 217 108
83 10 8 airV
102 165 159 95 47 115 108 43
84 10 8 airV
55 102 95 53 18 47 43 14
85 10 8 airV
42 14 10 36 19 4 3 15
86 10 8 airV
107 42 36 103 71 19 15 68
87 10 8 airV
218 107 103 211 207 71 68 198
88 10 8 airV
46 18 14 42 21 6 4 19
89 10 8 airV
114 46 42 107 81 21 19 71
90 10 8 airV
224 114 107 218 213 81 71 207
91 10 8 airV
94 53 48 85 42 14 10 36
92 10 8 airV
160 94 85 156 107 42 36 103
93 10 8 airV
253 160 156 246 218 107 103 211
94 10 8 airV
101 55 53 94 46 18 14 42
95 10 8 airV
164 101 94 160 114 46 42 107
96 10 8 airV
264 164 160 253 224 114 107 218
97 10 8 coilV1
191 282 273 183 159 254 245 155
98 10 8 coilV1
137 191 183 130 95 159 155 84
99 10 8 coilV1
88 137 130 83 53 95 84 48
100 10 8 coilV1
196 285 282 191 165 263 254 159
101 10 8 coilV1
143 196 191 137 102 165 159 95
102 10 8 coilV1
98 143 137 88 55 102 95 53
103 10 8 coilV2
136 88 83 129 94 53 48 85
104 10 8 coilV2
190 136 129 182 160 94 85 156
105 10 8 coilV2
281 190 182 274 253 160 156 246
106 10 8 coilV2
142 98 88 136 101 55 53 94
107 10 8 coilV2
195 142 136 190 164 101 94 160
108 10 8 coilV2
286 195 190 281 264 164 160 253
109 10 8 airV
322 351 349 315 352 366 365 350
110 10 8 airV
269 322 315 255 329 352 350 324
111 10 8 airV
209 269 255 196 294 329 324 285
112 10 8 airV
325 353 351 322 354 367 366 352
113 10 8 airV
277 325 322 269 332 354 352 329
114 10 8 airV
220 277 269 209 299 332 329 294
115 10 8 airV
270 328 323 256 322 351 349 315
116 10 8 airV
194 270 256 181 269 322 315 255
117 10 8 airV
150 194 181 143 209 269 255 196
118 10 8 airV
278 331 328 270 325 353 351 322
119 10 8 airV
201 278 270 194 277 325 322 269
120 10 8 airV
158 201 194 150 220 277 269 209
121 10 8 airV
208 293 286 195 270 328 323 256
122 10 8 airV
149 208 195 142 194 270 256 181
123 10 8 airV
106 149 142 98 150 194 181 143
124 10 8 airV
219 300 293 208 278 331 328 270
125 10 8 airV
157 219 208 149 201 278 270 194
126 10 8 airV
113 157 149 106 158 201 194 150
127 10 8 airV
123 236 223 115 90 221 212 82
128 10 8 airV
52 123 115 47 26 90 82 22
129 10 8 airV
24 52 47 18 13 26 22 6
130 10 8 airV
132 247 236 123 100 234 221 90
131 10 8 airV
59 132 123 52 34 100 90 26
132 10 8 airV
27 59 52 24 17 34 26 13
133 10 8 airV
169 272 263 165 123 236 223 115
134 10 8 airV
110 169 165 102 52 123 115 47
135 10 8 airV
60 110 102 55 24 52 47 18
136 10 8 airV
180 283 272 169 132 247 236 123
137 10 8 airV
117 180 169 110 59 132 123 52
138 10 8 airV
67 117 110 60 27 59 52 24
139 10 8 airV
51 24 18 46 25 13 6 21
140 10 8 airV
122 51 46 114 89 25 21 81
141 10 8 airV
237 122 114 224 222 89 81 213
142 10 8 airV
58 27 24 51 33 17 13 25
143 10 8 airV
131 58 51 122 99 33 25 89
144 10 8 airV
248 131 122 237 235 99 89 222
145 10 8 airV
109 60 55 101 51 24 18 46
146 10 8 airV
170 109 101 164 122 51 46 114
147 10 8 airV
271 170 164 264 237 122 114 224
148 10 8 airV
116 67 60 109 58 27 24 51
149 10 8 airV
179 116 109 170 131 58 51 122
150 10 8 airV
284 179 170 271 248 131 122 237
151 10 8 airV
209 294 285 196 169 272 263 165
152 10 8 airV
150 209 196 143 110 169 165 102
153 10 8 airV
106 150 143 98 60 110 102 55
154 10 8 airV
220 299 294 209 180 283 272 169
155 10 8 airV
158 220 209 150 117 180 169 110
156 10 8 airV
113 158 150 106 67 117 110 60
157 10 8 airV
149 106 98 142 109 60 55 101
158 10 8 airV
208 149 142 195 170 109 101 164
159 10 8 airV
293 208 195 286 271 170 164 264
160 10 8 airV
157 113 106 149 116 67 60 109
161 10 8 airV
219 157 149 208 179 116 109 170
162 10 8 airV
300 219 208 293 284 179 170 271
163 10 8 plateV
330 355 353 325 356 368 367 354
164 10 8 plateV
287 330 325 277 335 356 354 332
165 10 8 plateV
229 287 277 220 309 335 332 299
166 10 8 plateV
288 334 331 278 330 355 353 325
167 10 8 plateV
214 288 278 201 287 330 325 277
168 10 8 plateV
167 214 201 158 229 287 277 220
169 10 8 plateV
228 310 300 219 288 334 331 278
170 10 8 plateV
166 228 219 157 214 288 278 201
171 10 8 plateV
124 166 157 113 167 214 201 158
172 10 8 plateV
141 257 247 132 112 251 234 100
173 10 8 plateV
66 141 132 59 40 112 100 34
174 10 8 plateV
35 66 59 27 23 40 34 17
175 10 8 plateV
189 291 283 180 141 257 247 132
176 10 8 plateV
128 189 180 117 66 141 132 59
177 10 8 plateV
78 128 117 67 35 66 59 27
178 10 8 plateV
65 35 27 58 39 23 17 33
179 10 8 plateV
140 65 58 131 111 39 33 99
180 10 8 plateV
258 140 131 248 252 111 99 235
181 10 8 plateV
127 78 67 116 65 35 27 58
182 10 8 plateV
188 127 116 179 140 65 58 131
183 10 8 plateV
292 188 179 284 258 140 131 248
184 10 8 plateV
229 309 299 220 189 291 283 180
185 10 8 plateV
167 229 220 158 128 189 180 117
186 10 8 plateV
124 167 158 113 78 128 117 67
187 10 8 plateV
166 124 113 157 127 78 67 116
188 10 8 plateV
228 166 157 219 188 127 116 179
189 10 8 plateV
310 228 219 300 292 188 179 284
190 10 8 airV
333 357 355 330 358 369 368 356
191 10 8 airV
296 333 330 287 340 358 356 335
192 10 8 airV
244 296 287 229 319 340 335 309
193 10 8 airV
336 359 357 333 360 370 369 358
194 10 8 airV
304 336 333 296 346 360 358 340
195 10 8 airV
260 304 296 244 326 346 340 319
196 10 8 airV
297 337 334 288 333 357 355 330
197 10 8 airV
226 297 288 214 296 333 330 287
198 10 8 airV
175 226 214 167 244 296 287 229
199 10 8 airV
305 345 337 297 336 359 357 333
200 10 8 airV
242 305 297 226 304 336 333 296
201 10 8 airV
185 242 226 175 260 304 296 244
202 10 8 airV
243 318 310 228 297 337 334 288
203 10 8 airV
174 243 228 166 226 297 288 214
204 10 8 airV
135 174 166 124 175 226 214 167
205 10 8 airV
259 327 318 243 305 345 337 297
206 10 8 airV
184 259 243 174 242 305 297 226
207 10 8 airV
146 184 174 135 185 242 226 175
208 10 8 airV
154 275 257 141 121 265 251 112
209 10 8 airV
74 154 141 66 50 121 112 40
210 10 8 airV
45 74 66 35 28 50 40 23
211 10 8 airV
162 289 275 154 134 279 265 121
212 10 8 airV
87 162 154 74 57 134 121 50
213 10 8 airV
54 87 74 45 38 57 50 28
214 10 8 airV
204 302 291 189 154 275 257 141
215 10 8 airV
139 204 189 128 74 154 141 66
216 10 8 airV
91 139 128 78 45 74 66 35
217 10 8 airV
216 313 302 204 162 289 275 154
218 10 8 airV
152 216 204 139 87 162 154 74
219 10 8 airV
105 152 139 91 54 87 74 45
220 10 8 airV
73 45 35 65 49 28 23 39
221 10 8 airV
153 73 65 140 120 49 39 111
222 10 8 airV
276 153 140 258 266 120 111 252
223 10 8 airV
86 54 45 73 56 38 28 49
224 10 8 airV
161 86 73 153 133 56 49 120
225 10 8 airV
290 161 153 276 280 133 120 266
226 10 8 airV
138 91 78 127 73 45 35 65
227 10 8 airV
205 138 127 188 153 73 65 140
228 10 8 airV
301 205 188 292 276 153 140 258
229 10 8 airV
151 105 91 138 86 54 45 73
230 10 8 airV
215 151 138 205 161 86 73 153
231 10 8 airV
314 215 205 301 290 161 153 276
232 10 8 airV
244 319 309 229 204 302 291 189
233 10 8 airV
175 244 229 167 139 204 189 128
234 10 8 airV
135 175 167 124 91 139 128 78
235 10 8 airV
260 326 319 244 216 313 302 204
236 10 8 airV
185 260 244 175 152 216 204 139
237 10 8 airV
146 185 175 135 105 152 139 91
238 10 8 airV
174 135 124 166 138 91 78 127
239 10 8 airV
243 174 166 228 205 138 127 188
240 10 8 airV
318 243 228 310 301 205 188 292
241 10 8 airV
184 146 135 174 151 105 91 138
242 10 8 airV
259 184 174 243 215 151 138 205
243 10 8 airV
327 259 243 318 314 215 205 301

[Node BC]
#NodeNr Level
100 fixMech
17 fixMech
234 fixMech
235 fixMech
33 fixMech
34 fixMech
99 fixMech

[Save Nodes]
#NodeNr Level


[Save Elements]
#ElemNr Level

