$MeshFormat
2.2 0 8
$EndMeshFormat
$PhysicalNames
2
1 1 "SURFACE"
2 2 "FLUID"
$EndPhysicalNames
$Nodes
793
1 75 0 0
2 -75 0 0
3 -75 -30 0
4 75 -30 0
5 69.99999999998815 0 0
6 64.99999999997628 0 0
7 59.99999999998274 0 0
8 54.99999999999457 0 0
9 50.00000000000641 0 0
10 45.00000000001824 0 0
11 40.00000000003007 0 0
12 35.00000000004191 0 0
13 30.00000000005375 0 0
14 25.00000000006558 0 0
15 20.00000000007741 0 0
16 15.00000000008924 0 0
17 10.00000000010644 0 0
18 5.000000000141924 0 0
19 1.746656153045478e-10 0 0
20 -4.999999999834401 0 0
21 -9.999999999846239 0 0
22 -14.99999999985806 0 0
23 -19.99999999986989 0 0
24 -24.99999999988171 0 0
25 -29.99999999989355 0 0
26 -34.99999999990537 0 0
27 -39.99999999991719 0 0
28 -44.99999999992902 0 0
29 -49.99999999994085 0 0
30 -54.99999999995268 0 0
31 -59.9999999999645 0 0
32 -64.99999999997632 0 0
33 -69.99999999998815 0 0
34 72.49999999999363 0 0
35 67.49999999998454 0 0
36 62.49999999998023 0 0
37 57.49999999998823 0 0
38 52.49999999999859 0 0
39 47.50000000001242 0 0
40 42.50000000002521 0 0
41 37.50000000003534 0 0
42 32.50000000004837 0 0
43 27.50000000005924 0 0
44 22.50000000007245 0 0
45 17.50000000008387 0 0
46 12.5000000000972 0 0
47 7.500000000124189 0 0
48 2.500000000158323 0 0
49 -2.499999999829868 0 0
50 -7.499999999840313 0 0
51 -12.49999999985131 0 0
52 -17.49999999986397 0 0
53 -22.4999999998758 0 0
54 -27.49999999988762 0 0
55 -32.49999999989946 0 0
56 -37.49999999991128 0 0
57 -42.49999999992311 0 0
58 -47.49999999993429 0 0
59 -52.49999999994633 0 0
60 -57.49999999995859 0 0
61 -62.49999999997041 0 0
62 -67.49999999998224 0 0
63 -72.49999999999409 0 0
64 -75 -4.999999999998839 0
65 -75 -9.999999999988622 0
66 -75 -14.99999999996962 0
67 -75 -19.99999999997951 0
68 -75 -24.99999999998975 0
69 -75 -2.500000000000099 0
70 -75 -7.499999999993605 0
71 -75 -12.49999999997884 0
72 -75 -17.49999999997531 0
73 -75 -22.49999999998468 0
74 -75 -27.4999999999948 0
75 -69.99999999998815 -30 0
76 -64.99999999997628 -30 0
77 -59.99999999998274 -30 0
78 -54.99999999999457 -30 0
79 -50.00000000000641 -30 0
80 -45.00000000001824 -30 0
81 -40.00000000003007 -30 0
82 -35.00000000004191 -30 0
83 -30.00000000005375 -30 0
84 -25.00000000006558 -30 0
85 -20.00000000007741 -30 0
86 -15.00000000008924 -30 0
87 -10.00000000010644 -30 0
88 -5.000000000141924 -30 0
89 -1.746656153045478e-10 -30 0
90 4.999999999834401 -30 0
91 9.999999999846239 -30 0
92 14.99999999985806 -30 0
93 19.99999999986989 -30 0
94 24.99999999988171 -30 0
95 29.99999999989355 -30 0
96 34.99999999990537 -30 0
97 39.99999999991719 -30 0
98 44.99999999992902 -30 0
99 49.99999999994085 -30 0
100 54.99999999995268 -30 0
101 59.9999999999645 -30 0
102 64.99999999997632 -30 0
103 69.99999999998815 -30 0
104 -72.49999999999363 -30 0
105 -67.49999999998454 -30 0
106 -62.49999999998023 -30 0
107 -57.49999999998823 -30 0
108 -52.49999999999859 -30 0
109 -47.50000000001242 -30 0
110 -42.50000000002521 -30 0
111 -37.50000000003534 -30 0
112 -32.50000000004837 -30 0
113 -27.50000000005924 -30 0
114 -22.50000000007245 -30 0
115 -17.50000000008387 -30 0
116 -12.5000000000972 -30 0
117 -7.500000000124189 -30 0
118 -2.500000000158323 -30 0
119 2.499999999829868 -30 0
120 7.499999999840313 -30 0
121 12.49999999985131 -30 0
122 17.49999999986397 -30 0
123 22.4999999998758 -30 0
124 27.49999999988762 -30 0
125 32.49999999989946 -30 0
126 37.49999999991128 -30 0
127 42.49999999992311 -30 0
128 47.49999999993429 -30 0
129 52.49999999994633 -30 0
130 57.49999999995859 -30 0
131 62.49999999997041 -30 0
132 67.49999999998224 -30 0
133 72.49999999999409 -30 0
134 75 -24.99999999998739 0
135 75 -19.99999999999744 0
136 75 -15.00000000003744 0
137 75 -10.00000000002519 0
138 75 -5.000000000012594 0
139 75 -27.49999999999249 0
140 75 -22.49999999999512 0
141 75 -17.50000000001766 0
142 75 -12.50000000003156 0
143 75 -7.500000000019888 0
144 75 -2.50000000000616 0
145 69.99999999998816 -5.000000000012135 0
146 69.99999999998815 -10.00000000002398 0
147 69.99999999998815 -15.00000000003518 0
148 69.99999999998815 -19.99999999999684 0
149 69.99999999998816 -24.99999999998747 0
150 64.99999999997628 -5.000000000011678 0
151 64.9999999999763 -10.00000000002275 0
152 64.99999999997631 -15.00000000003292 0
153 64.99999999997632 -19.99999999999624 0
154 64.99999999997634 -24.99999999998755 0
155 59.9999999999797 -5.000000000011219 0
156 59.99999999997666 -10.00000000002154 0
157 59.99999999997362 -15.00000000003066 0
158 59.99999999997058 -19.99999999999565 0
159 59.99999999996754 -24.99999999998763 0
160 54.99999999998758 -5.00000000001076 0
161 54.99999999998062 -10.00000000002032 0
162 54.99999999997362 -15.0000000000284 0
163 54.99999999996663 -19.99999999999505 0
164 54.99999999995967 -24.99999999998771 0
165 49.99999999999549 -5.000000000010302 0
166 49.99999999998456 -10.0000000000191 0
167 49.99999999997363 -15.00000000002614 0
168 49.9999999999627 -19.99999999999445 0
169 49.99999999995178 -24.99999999998778 0
170 45.00000000000338 -5.000000000009844 0
171 44.9999999999885 -10.00000000001788 0
172 44.99999999997364 -15.00000000002388 0
173 44.99999999995877 -19.99999999999386 0
174 44.9999999999439 -24.99999999998786 0
175 40.00000000001128 -5.000000000009386 0
176 39.99999999999244 -10.00000000001666 0
177 39.99999999997364 -15.00000000002161 0
178 39.99999999995482 -19.99999999999326 0
179 39.99999999993601 -24.99999999998794 0
180 35.00000000001915 -5.000000000008927 0
181 34.99999999999638 -10.00000000001544 0
182 34.99999999997364 -15.00000000001936 0
183 34.99999999995087 -19.99999999999266 0
184 34.99999999992812 -24.99999999998802 0
185 30.00000000002704 -5.000000000008469 0
186 30.00000000000035 -10.00000000001422 0
187 29.99999999997365 -15.0000000000171 0
188 29.99999999994695 -19.99999999999207 0
189 29.99999999992024 -24.99999999998811 0
190 25.00000000003493 -5.00000000000801 0
191 25.00000000000429 -10.00000000001301 0
192 24.99999999997364 -15.00000000001483 0
193 24.999999999943 -19.99999999999146 0
194 24.99999999991235 -24.99999999998818 0
195 20.00000000004282 -5.000000000007551 0
196 20.00000000000824 -10.00000000001178 0
197 19.99999999997365 -15.00000000001257 0
198 19.99999999993906 -19.99999999999086 0
199 19.99999999990449 -24.99999999998826 0
200 15.00000000005071 -5.000000000007095 0
201 15.00000000001218 -10.00000000001057 0
202 14.99999999997366 -15.00000000001031 0
203 14.99999999993512 -19.99999999999026 0
204 14.9999999998966 -24.99999999998833 0
205 10.00000000006307 -5.000000000006634 0
206 10.0000000000197 -10.00000000000935 0
207 9.999999999976335 -15.00000000000805 0
208 9.999999999932967 -19.99999999998966 0
209 9.999999999889603 -24.99999999998842 0
210 5.000000000090665 -5.000000000006176 0
211 5.000000000039419 -10.00000000000813 0
212 4.999999999988162 -15.00000000000579 0
213 4.999999999936907 -19.99999999998907 0
214 4.999999999885654 -24.99999999998849 0
215 1.16442855357959e-10 -5.000000000005716 0
216 5.822187176831516e-11 -10.00000000000691 0
217 3.552714032601159e-15 -15.00000000000353 0
218 -5.822187176794405e-11 -19.99999999998847 0
219 -1.164437435362459e-10 -24.99999999998857 0
220 -4.999999999885652 -5.000000000005258 0
221 -4.999999999936916 -10.00000000000569 0
222 -4.999999999988169 -15.00000000000127 0
223 -5.000000000039416 -19.99999999998787 0
224 -5.000000000090671 -24.99999999998865 0
225 -9.999999999889607 -5.000000000004799 0
226 -9.999999999932971 -10.00000000000447 0
227 -9.999999999976339 -14.99999999999901 0
228 -10.00000000001971 -19.99999999998727 0
229 -10.00000000006307 -24.99999999998873 0
230 -14.99999999989659 -5.000000000004341 0
231 -14.99999999993512 -10.00000000000325 0
232 -14.99999999997365 -14.99999999999674 0
233 -15.00000000001218 -19.99999999998668 0
234 -15.00000000005071 -24.99999999998881 0
235 -19.99999999990447 -5.000000000003882 0
236 -19.99999999993906 -10.00000000000204 0
237 -19.99999999997365 -14.99999999999449 0
238 -20.00000000000822 -19.99999999998608 0
239 -20.00000000004282 -24.99999999998889 0
240 -24.99999999991235 -5.000000000003425 0
241 -24.99999999994299 -10.00000000000081 0
242 -24.99999999997365 -14.99999999999223 0
243 -25.00000000000428 -19.99999999998548 0
244 -25.00000000003493 -24.99999999998897 0
245 -29.99999999992024 -5.000000000002966 0
246 -29.99999999994695 -9.999999999999595 0
247 -29.99999999997365 -14.99999999998996 0
248 -30.00000000000034 -19.99999999998489 0
249 -30.00000000002704 -24.99999999998904 0
250 -34.99999999992814 -5.000000000002507 0
251 -34.99999999995087 -9.999999999998375 0
252 -34.99999999997365 -14.9999999999877 0
253 -34.99999999999639 -19.99999999998429 0
254 -35.00000000001916 -24.99999999998912 0
255 -39.99999999993601 -5.00000000000205 0
256 -39.99999999995482 -9.999999999997158 0
257 -39.99999999997362 -14.99999999998544 0
258 -39.99999999999244 -19.9999999999837 0
259 -40.00000000001125 -24.9999999999892 0
260 -44.99999999994388 -5.000000000001591 0
261 -44.99999999995876 -9.999999999995939 0
262 -44.99999999997363 -14.99999999998318 0
263 -44.9999999999885 -19.9999999999831 0
264 -45.00000000000338 -24.99999999998929 0
265 -49.99999999995177 -5.000000000001132 0
266 -49.99999999996271 -9.999999999994715 0
267 -49.99999999997362 -14.99999999998092 0
268 -49.99999999998455 -19.9999999999825 0
269 -49.99999999999548 -24.99999999998936 0
270 -54.99999999995966 -5.000000000000674 0
271 -54.99999999996665 -9.9999999999935 0
272 -54.99999999997362 -14.99999999997866 0
273 -54.9999999999806 -19.99999999998191 0
274 -54.99999999998759 -24.99999999998944 0
275 -59.99999999996754 -5.000000000000214 0
276 -59.99999999997058 -9.999999999992278 0
277 -59.99999999997362 -14.9999999999764 0
278 -59.99999999997667 -19.9999999999813 0
279 -59.9999999999797 -24.99999999998952 0
280 -64.99999999997634 -4.999999999999756 0
281 -64.99999999997632 -9.99999999999106 0
282 -64.99999999997632 -14.99999999997414 0
283 -64.9999999999763 -19.9999999999807 0
284 -64.99999999997631 -24.9999999999896 0
285 -69.99999999998816 -4.999999999999297 0
286 -69.99999999998815 -9.999999999989843 0
287 -69.99999999998815 -14.99999999997188 0
288 -69.99999999998816 -19.99999999998012 0
289 -69.99999999998816 -24.99999999998968 0
290 69.99999999998811 -2.500000000006067 0
291 72.49999999999409 -5.000000000012365 0
292 72.49999999999383 -2.500000000006113 0
293 69.99999999998811 -7.500000000018052 0
294 72.49999999999406 -10.00000000002458 0
295 72.49999999999403 -7.500000000018968 0
296 69.99999999998812 -12.50000000002957 0
297 72.49999999999406 -15.00000000003631 0
298 72.49999999999405 -12.50000000003056 0
299 69.99999999998818 -17.50000000001602 0
300 72.49999999999407 -19.99999999999714 0
301 72.49999999999409 -17.50000000001684 0
302 69.99999999998812 -22.49999999999214 0
303 72.4999999999941 -24.99999999998743 0
304 72.49999999999407 -22.49999999999363 0
305 69.99999999998815 -27.49999999999373 0
306 72.49999999999409 -27.49999999999311 0
307 64.99999999997628 -2.500000000005839 0
308 67.49999999998222 -5.000000000011907 0
309 67.49999999998334 -2.500000000005953 0
310 64.99999999997625 -7.500000000017211 0
311 67.49999999998222 -10.00000000002336 0
312 67.49999999998218 -7.50000000001763 0
313 64.99999999997628 -12.50000000002783 0
314 67.49999999998224 -15.00000000003405 0
315 67.49999999998219 -12.5000000000287 0
316 64.9999999999763 -17.50000000001457 0
317 67.49999999998225 -19.99999999999655 0
318 67.49999999998224 -17.5000000000153 0
319 64.99999999997632 -22.4999999999919 0
320 67.49999999998226 -24.99999999998752 0
321 67.49999999998224 -22.49999999999203 0
322 64.99999999997627 -27.49999999999375 0
323 67.49999999998222 -27.49999999999375 0
324 59.99999999998123 -2.50000000000561 0
325 62.49999999997795 -5.000000000011446 0
326 62.4999999999791 -2.500000000005723 0
327 59.99999999997819 -7.500000000016379 0
328 62.49999999997651 -10.00000000002215 0
329 62.49999999997722 -7.500000000016795 0
330 59.99999999997512 -12.50000000002609 0
331 62.49999999997497 -15.00000000003179 0
332 62.49999999997571 -12.50000000002697 0
333 59.99999999997213 -17.50000000001316 0
334 62.49999999997347 -19.99999999999595 0
335 62.49999999997422 -17.50000000001387 0
336 59.99999999996906 -22.49999999999164 0
337 62.49999999997194 -24.99999999998759 0
338 62.49999999997269 -22.49999999999177 0
339 59.999999999966 -27.49999999999381 0
340 62.49999999997114 -27.49999999999378 0
341 54.99999999999107 -2.50000000000538 0
342 57.49999999998364 -5.00000000001099 0
343 57.49999999998594 -2.500000000005495 0
344 54.99999999998413 -7.500000000015542 0
345 57.49999999997863 -10.00000000002093 0
346 57.49999999998115 -7.50000000001596 0
347 54.9999999999771 -12.50000000002435 0
348 57.49999999997364 -15.00000000002953 0
349 57.49999999997611 -12.50000000002522 0
350 54.99999999997013 -17.50000000001172 0
351 57.4999999999686 -19.99999999999535 0
352 57.49999999997113 -17.50000000001245 0
353 54.99999999996317 -22.49999999999138 0
354 57.49999999996363 -24.99999999998768 0
355 57.49999999996612 -22.49999999999152 0
356 54.99999999995619 -27.49999999999386 0
357 57.4999999999611 -27.49999999999384 0
358 50.00000000000095 -2.500000000005151 0
359 52.49999999999152 -5.00000000001053 0
360 52.49999999999505 -2.500000000005265 0
361 49.99999999999002 -7.500000000014699 0
362 52.49999999998259 -10.00000000001971 0
363 52.49999999998707 -7.50000000001512 0
364 49.99999999997908 -12.50000000002261 0
365 52.49999999997364 -15.00000000002727 0
366 52.4999999999781 -12.50000000002349 0
367 49.99999999996815 -17.50000000001029 0
368 52.49999999996465 -19.99999999999474 0
369 52.49999999996913 -17.50000000001101 0
370 49.99999999995723 -22.49999999999112 0
371 52.49999999995574 -24.99999999998775 0
372 52.49999999996021 -22.49999999999125 0
373 49.99999999994633 -27.4999999999939 0
374 52.49999999995104 -27.49999999999388 0
375 45.00000000001081 -2.500000000004922 0
376 47.49999999999943 -5.000000000010072 0
377 47.50000000000593 -2.500000000005036 0
378 44.99999999999593 -7.500000000013863 0
379 47.49999999998654 -10.00000000001849 0
380 47.49999999999297 -7.500000000014279 0
381 44.99999999998108 -12.50000000002088 0
382 47.49999999997365 -15.00000000002501 0
383 47.49999999998009 -12.50000000002175 0
384 44.99999999996621 -17.50000000000887 0
385 47.49999999996074 -19.99999999999416 0
386 47.49999999996719 -17.50000000000959 0
387 44.99999999995133 -22.49999999999086 0
388 47.49999999994785 -24.99999999998783 0
389 47.49999999995428 -22.499999999991 0
390 44.99999999993647 -27.49999999999394 0
391 47.49999999994108 -27.49999999999392 0
392 40.00000000002068 -2.500000000004693 0
393 42.50000000000733 -5.000000000009615 0
394 42.50000000001626 -2.500000000004807 0
395 40.00000000000186 -7.500000000013023 0
396 42.49999999999047 -10.00000000001727 0
397 42.49999999999889 -7.500000000013442 0
398 39.99999999998304 -12.50000000001914 0
399 42.49999999997364 -15.00000000002274 0
400 42.49999999998207 -12.50000000002001 0
401 39.99999999996423 -17.50000000000744 0
402 42.49999999995681 -19.99999999999357 0
403 42.49999999996523 -17.50000000000816 0
404 39.99999999994542 -22.4999999999906 0
405 42.49999999993996 -24.99999999998791 0
406 42.49999999994839 -22.49999999999073 0
407 39.99999999992659 -27.49999999999397 0
408 42.49999999993153 -27.49999999999396 0
409 35.00000000003052 -2.500000000004464 0
410 37.50000000001522 -5.000000000009158 0
411 37.50000000002528 -2.500000000004579 0
412 35.00000000000777 -7.500000000012184 0
413 37.49999999999441 -10.00000000001605 0
414 37.50000000000481 -7.500000000012603 0
415 34.99999999998501 -12.5000000000174 0
416 37.49999999997365 -15.00000000002049 0
417 37.49999999998403 -12.50000000001827 0
418 34.99999999996225 -17.50000000000601 0
419 37.49999999995285 -19.99999999999296 0
420 37.49999999996324 -17.50000000000673 0
421 34.9999999999395 -22.49999999999035 0
422 37.49999999993207 -24.99999999998798 0
423 37.49999999994246 -22.49999999999047 0
424 34.99999999991675 -27.49999999999401 0
425 37.49999999992167 -27.49999999999399 0
426 30.00000000004039 -2.500000000004234 0
427 32.50000000002309 -5.000000000008699 0
428 32.50000000003573 -2.500000000004349 0
429 30.00000000001369 -7.500000000011344 0
430 32.49999999999837 -10.00000000001483 0
431 32.50000000001073 -7.500000000011764 0
432 29.999999999987 -12.50000000001566 0
433 32.49999999997364 -15.00000000001823 0
434 32.499999999986 -12.50000000001653 0
435 29.9999999999603 -17.50000000000458 0
436 32.4999999999489 -19.99999999999237 0
437 32.49999999996127 -17.50000000000529 0
438 29.99999999993359 -22.49999999999009 0
439 32.49999999992418 -24.99999999998806 0
440 32.49999999993653 -22.49999999999022 0
441 29.99999999990689 -27.49999999999405 0
442 32.49999999991181 -27.49999999999403 0
443 25.00000000005025 -2.500000000004005 0
444 27.50000000003098 -5.00000000000824 0
445 27.50000000004511 -2.50000000000412 0
446 25.00000000001961 -7.500000000010509 0
447 27.50000000000232 -10.00000000001361 0
448 27.50000000001665 -7.500000000010926 0
449 24.99999999998897 -12.50000000001392 0
450 27.49999999997364 -15.00000000001596 0
451 27.49999999998798 -12.50000000001479 0
452 24.99999999995832 -17.50000000000315 0
453 27.49999999994498 -19.99999999999176 0
454 27.49999999995931 -17.50000000000387 0
455 24.99999999992767 -22.49999999998982 0
456 27.4999999999163 -24.99999999998814 0
457 27.49999999993064 -22.49999999998995 0
458 24.99999999989703 -27.49999999999408 0
459 27.49999999990196 -27.49999999999407 0
460 20.0000000000601 -2.500000000003774 0
461 22.50000000003887 -5.00000000000778 0
462 22.50000000005565 -2.50000000000389 0
463 20.00000000002554 -7.500000000009671 0
464 22.50000000000626 -10.0000000000124 0
465 22.50000000002257 -7.50000000001009 0
466 19.99999999999094 -12.50000000001218 0
467 22.49999999997365 -15.0000000000137 0
468 22.49999999998995 -12.50000000001305 0
469 19.99999999995636 -17.50000000000172 0
470 22.49999999994103 -19.99999999999116 0
471 22.49999999995734 -17.50000000000243 0
472 19.99999999992178 -22.49999999998956 0
473 22.49999999990842 -24.99999999998822 0
474 22.49999999992473 -22.49999999998969 0
475 19.99999999988719 -27.49999999999413 0
476 22.49999999989211 -27.49999999999411 0
477 15.00000000006998 -2.500000000003547 0
478 17.50000000004677 -5.000000000007323 0
479 17.50000000006531 -2.500000000003661 0
480 15.00000000003145 -7.500000000008832 0
481 17.50000000001021 -10.00000000001117 0
482 17.5000000000285 -7.500000000009251 0
483 14.99999999999292 -12.50000000001044 0
484 17.49999999997366 -15.00000000001144 0
485 17.49999999999193 -12.50000000001131 0
486 14.99999999995439 -17.50000000000028 0
487 17.4999999999371 -19.99999999999056 0
488 17.49999999995538 -17.500000000001 0
489 14.99999999991586 -22.4999999999893 0
490 17.49999999990054 -24.9999999999883 0
491 17.49999999991882 -22.49999999998943 0
492 14.99999999987733 -27.49999999999417 0
493 17.49999999988226 -27.49999999999415 0
494 10.00000000008475 -2.500000000003317 0
495 12.50000000005689 -5.000000000006865 0
496 12.50000000007705 -2.500000000003433 0
497 10.00000000004139 -7.500000000007991 0
498 12.50000000001594 -10.00000000000995 0
499 12.50000000003642 -7.500000000008411 0
500 9.999999999998018 -12.5000000000087 0
501 12.499999999975 -15.00000000000918 0
502 12.49999999999547 -12.50000000000957 0
503 9.999999999954651 -17.49999999999885 0
504 12.49999999993405 -19.99999999998996 0
505 12.49999999995452 -17.49999999999957 0
506 9.999999999911285 -22.49999999998904 0
507 12.4999999998931 -24.99999999998838 0
508 12.49999999991357 -22.49999999998917 0
509 9.999999999867921 -27.49999999999421 0
510 12.49999999987221 -27.49999999999419 0
511 5.000000000116295 -2.500000000003088 0
512 7.500000000076867 -5.000000000006406 0
513 7.500000000100528 -2.500000000003203 0
514 5.000000000065042 -7.50000000000715 0
515 7.500000000029559 -10.00000000000873 0
516 7.500000000053213 -7.500000000007569 0
517 5.000000000013792 -12.50000000000696 0
518 7.499999999982248 -15.00000000000692 0
519 7.500000000005904 -12.50000000000782 0
520 4.999999999962535 -17.49999999999743 0
521 7.499999999934937 -19.99999999998936 0
522 7.499999999958593 -17.49999999999814 0
523 4.999999999911281 -22.49999999998878 0
524 7.499999999887629 -24.99999999998845 0
525 7.499999999911283 -22.49999999998891 0
526 4.999999999860028 -27.49999999999424 0
527 7.499999999863971 -27.49999999999423 0
528 1.455542353312534e-10 -2.500000000002858 0
529 2.500000000103554 -5.000000000005946 0
530 2.500000000130938 -2.500000000002973 0
531 8.733236356313709e-11 -7.500000000006313 0
532 2.500000000048821 -10.00000000000752 0
533 2.500000000076188 -7.500000000006732 0
534 2.911271224117388e-11 -12.50000000000522 0
535 2.499999999994083 -15.00000000000466 0
536 2.500000000021452 -12.50000000000609 0
537 -2.910915952695572e-11 -17.499999999996 0
538 2.499999999939343 -19.99999999998877 0
539 2.499999999966713 -17.49999999999672 0
540 -8.733280765209497e-11 -22.49999999998852 0
541 2.499999999884605 -24.99999999998853 0
542 2.499999999911974 -22.49999999998865 0
543 -1.455546794203969e-10 -27.49999999999429 0
544 2.499999999857236 -27.49999999999427 0
545 -4.999999999860027 -2.500000000002629 0
546 -2.499999999884605 -5.000000000005487 0
547 -2.499999999857236 -2.500000000002744 0
548 -4.999999999911284 -7.500000000005471 0
549 -2.499999999939347 -10.0000000000063 0
550 -2.499999999911975 -7.500000000005891 0
551 -4.999999999962542 -12.50000000000348 0
552 -2.499999999994083 -15.0000000000024 0
553 -2.499999999966714 -12.50000000000435 0
554 -5.000000000013793 -17.49999999999457 0
555 -2.500000000048818 -19.99999999998817 0
556 -2.50000000002145 -17.49999999999528 0
557 -5.000000000065043 -22.49999999998826 0
558 -2.500000000103557 -24.99999999998861 0
559 -2.500000000076188 -22.49999999998838 0
560 -5.000000000116297 -27.49999999999433 0
561 -2.50000000013094 -27.49999999999431 0
562 -9.999999999867924 -2.5000000000024 0
563 -7.499999999887629 -5.000000000005029 0
564 -7.499999999863972 -2.500000000002514 0
565 -9.999999999911287 -7.500000000004634 0
566 -7.499999999934945 -10.00000000000508 0
567 -7.499999999911287 -7.500000000005052 0
568 -9.999999999954655 -12.50000000000174 0
569 -7.499999999982255 -15.00000000000014 0
570 -7.4999999999586 -12.50000000000261 0
571 -9.999999999998023 -17.49999999999314 0
572 -7.500000000029561 -19.99999999998757 0
573 -7.500000000005908 -17.49999999999386 0
574 -10.00000000004139 -22.499999999988 0
575 -7.500000000076873 -24.99999999998869 0
576 -7.500000000053216 -22.49999999998813 0
577 -10.00000000008476 -27.49999999999437 0
578 -7.500000000100531 -27.49999999999435 0
579 -14.99999999987733 -2.500000000002171 0
580 -12.4999999998931 -5.000000000004571 0
581 -12.49999999987221 -2.500000000002286 0
582 -14.99999999991585 -7.500000000003793 0
583 -12.49999999993405 -10.00000000000386 0
584 -12.49999999991357 -7.500000000004214 0
585 -14.99999999995439 -12.49999999999999 0
586 -12.49999999997499 -14.99999999999787 0
587 -12.49999999995452 -12.50000000000086 0
588 -14.99999999999292 -17.49999999999171 0
589 -12.50000000001594 -19.99999999998698 0
590 -12.49999999999547 -17.49999999999243 0
591 -15.00000000003145 -22.49999999998774 0
592 -12.50000000005689 -24.99999999998877 0
593 -12.50000000003642 -22.49999999998787 0
594 -15.00000000006998 -27.4999999999944 0
595 -12.50000000007705 -27.49999999999438 0
596 -19.99999999988718 -2.500000000001941 0
597 -17.49999999990053 -5.000000000004114 0
598 -17.49999999988226 -2.500000000002057 0
599 -19.99999999992177 -7.500000000002959 0
600 -17.49999999993708 -10.00000000000264 0
601 -17.49999999991881 -7.500000000003373 0
602 -19.99999999995635 -12.49999999999826 0
603 -17.49999999997365 -14.99999999999562 0
604 -17.49999999995537 -12.49999999999912 0
605 -19.99999999999094 -17.49999999999029 0
606 -17.5000000000102 -19.99999999998638 0
607 -17.49999999999193 -17.499999999991 0
608 -20.00000000002552 -22.49999999998749 0
609 -17.50000000004677 -24.99999999998885 0
610 -17.50000000002849 -22.49999999998762 0
611 -20.00000000006011 -27.49999999999444 0
612 -17.50000000006532 -27.49999999999442 0
613 -24.99999999989703 -2.500000000001712 0
614 -22.49999999990841 -5.000000000003654 0
615 -22.4999999998921 -2.500000000001827 0
616 -24.99999999992767 -7.500000000002118 0
617 -22.49999999994102 -10.00000000000142 0
618 -22.49999999992472 -7.500000000002538 0
619 -24.99999999995832 -12.49999999999652 0
620 -22.49999999997365 -14.99999999999336 0
621 -22.49999999995733 -12.49999999999739 0
622 -24.99999999998897 -17.49999999998886 0
623 -22.50000000000625 -19.99999999998578 0
624 -22.49999999998995 -17.49999999998957 0
625 -25.00000000001961 -22.49999999998722 0
626 -22.50000000003887 -24.99999999998893 0
627 -22.50000000002257 -22.49999999998736 0
628 -25.00000000005025 -27.49999999999448 0
629 -22.50000000005566 -27.49999999999446 0
630 -29.99999999990689 -2.500000000001483 0
631 -27.4999999999163 -5.000000000003196 0
632 -27.49999999990196 -2.500000000001598 0
633 -29.9999999999336 -7.500000000001281 0
634 -27.49999999994498 -10.0000000000002 0
635 -27.49999999993064 -7.500000000001698 0
636 -29.9999999999603 -12.49999999999478 0
637 -27.49999999997365 -14.9999999999911 0
638 -27.49999999995931 -12.49999999999565 0
639 -29.999999999987 -17.49999999998743 0
640 -27.50000000000231 -19.99999999998519 0
641 -27.49999999998798 -17.49999999998814 0
642 -30.00000000001369 -22.49999999998697 0
643 -27.50000000003099 -24.999999999989 0
644 -27.50000000001665 -22.49999999998709 0
645 -30.00000000004039 -27.49999999999453 0
646 -27.50000000004511 -27.49999999999451 0
647 -34.99999999991675 -2.500000000001254 0
648 -32.49999999992419 -5.000000000002736 0
649 -32.49999999991182 -2.500000000001368 0
650 -34.9999999999395 -7.500000000000441 0
651 -32.49999999994891 -9.999999999998984 0
652 -32.49999999993655 -7.500000000000861 0
653 -34.99999999996226 -12.49999999999304 0
654 -32.49999999997365 -14.99999999998883 0
655 -32.49999999996128 -12.49999999999391 0
656 -34.99999999998502 -17.499999999986 0
657 -32.49999999999837 -19.9999999999846 0
658 -32.49999999998601 -17.49999999998671 0
659 -35.00000000000777 -22.49999999998671 0
660 -32.50000000002311 -24.99999999998908 0
661 -32.50000000001074 -22.49999999998684 0
662 -35.00000000003054 -27.49999999999456 0
663 -32.50000000003574 -27.49999999999454 0
664 -39.99999999992661 -2.500000000001025 0
665 -37.49999999993207 -5.000000000002278 0
666 -37.49999999992168 -2.500000000001139 0
667 -39.99999999994542 -7.499999999999605 0
668 -37.49999999995285 -9.999999999997765 0
669 -37.49999999994246 -7.500000000000021 0
670 -39.99999999996423 -12.4999999999913 0
671 -37.49999999997364 -14.99999999998657 0
672 -37.49999999996324 -12.49999999999217 0
673 -39.99999999998303 -17.49999999998457 0
674 -37.49999999999442 -19.999999999984 0
675 -37.49999999998403 -17.49999999998528 0
676 -40.00000000000185 -22.49999999998646 0
677 -37.50000000001521 -24.99999999998916 0
678 -37.50000000000482 -22.49999999998658 0
679 -40.00000000002067 -27.4999999999946 0
680 -37.50000000002529 -27.49999999999459 0
681 -44.99999999993646 -2.500000000000796 0
682 -42.49999999993994 -5.000000000001821 0
683 -42.49999999993155 -2.50000000000091 0
684 -44.99999999995132 -7.499999999998765 0
685 -42.49999999995679 -9.99999999999655 0
686 -42.49999999994837 -7.499999999999186 0
687 -44.9999999999662 -12.49999999998956 0
688 -42.49999999997363 -14.99999999998431 0
689 -42.49999999996521 -12.49999999999043 0
690 -44.99999999998107 -17.49999999998314 0
691 -42.49999999999048 -19.9999999999834 0
692 -42.49999999998205 -17.49999999998385 0
693 -44.99999999999593 -22.49999999998619 0
694 -42.5000000000073 -24.99999999998923 0
695 -42.49999999999889 -22.49999999998632 0
696 -45.00000000001081 -27.49999999999465 0
697 -42.50000000001626 -27.49999999999462 0
698 -49.99999999994631 -2.500000000000566 0
699 -47.49999999994782 -5.000000000001362 0
700 -47.49999999994106 -2.500000000000681 0
701 -49.99999999995725 -7.499999999997925 0
702 -47.49999999996074 -9.99999999999533 0
703 -47.49999999995428 -7.499999999998346 0
704 -49.99999999996817 -12.49999999998782 0
705 -47.49999999997362 -14.99999999998205 0
706 -47.49999999996719 -12.49999999998869 0
707 -49.99999999997912 -17.49999999998172 0
708 -47.49999999998653 -19.9999999999828 0
709 -47.49999999998009 -17.49999999998243 0
710 -49.99999999999 -22.49999999998592 0
711 -47.49999999999943 -24.99999999998932 0
712 -47.49999999999297 -22.49999999998606 0
713 -50.00000000000093 -27.49999999999467 0
714 -47.50000000000591 -27.49999999999466 0
715 -54.99999999995616 -2.500000000000337 0
716 -52.49999999995571 -5.000000000000904 0
717 -52.49999999995102 -2.500000000000452 0
718 -54.99999999996314 -7.499999999997084 0
719 -52.49999999996468 -9.999999999994108 0
720 -52.4999999999602 -7.499999999997504 0
721 -54.99999999997014 -12.49999999998608 0
722 -52.4999999999736 -14.99999999997978 0
723 -52.49999999996915 -12.49999999998695 0
724 -54.99999999997709 -17.49999999998028 0
725 -52.49999999998258 -19.9999999999822 0
726 -52.49999999997809 -17.499999999981 0
727 -54.99999999998413 -22.49999999998569 0
728 -52.49999999999153 -24.9999999999894 0
729 -52.49999999998707 -22.49999999998581 0
730 -54.9999999999911 -27.49999999999473 0
731 -52.49999999999507 -27.4999999999947 0
732 -59.99999999996604 -2.500000000000108 0
733 -57.49999999996359 -5.000000000000444 0
734 -57.4999999999611 -2.500000000000222 0
735 -59.99999999996903 -7.499999999996242 0
736 -57.49999999996862 -9.999999999992891 0
737 -57.49999999996608 -7.499999999996665 0
738 -59.99999999997213 -12.49999999998434 0
739 -57.49999999997362 -14.99999999997753 0
740 -57.49999999997113 -12.49999999998521 0
741 -59.99999999997512 -17.49999999997884 0
742 -57.49999999997863 -19.9999999999816 0
743 -57.49999999997611 -17.49999999997956 0
744 -59.99999999997819 -22.49999999998541 0
745 -57.49999999998363 -24.99999999998948 0
746 -57.49999999998114 -22.49999999998554 0
747 -59.99999999998122 -27.49999999999476 0
748 -57.49999999998594 -27.49999999999474 0
749 -64.99999999997635 -2.499999999999879 0
750 -62.49999999997194 -4.999999999999986 0
751 -62.49999999997119 -2.499999999999994 0
752 -64.9999999999763 -7.499999999995405 0
753 -62.49999999997343 -9.999999999991667 0
754 -62.49999999997266 -7.499999999995823 0
755 -64.99999999997631 -12.4999999999826 0
756 -62.499999999975 -14.99999999997527 0
757 -62.49999999997422 -12.49999999998347 0
758 -64.99999999997627 -17.49999999997741 0
759 -62.49999999997648 -19.999999999981 0
760 -62.49999999997571 -17.49999999997813 0
761 -64.99999999997625 -22.49999999998514 0
762 -62.499999999978 -24.99999999998956 0
763 -62.49999999997721 -22.49999999998528 0
764 -64.99999999997625 -27.49999999999478 0
765 -62.4999999999791 -27.49999999999477 0
766 -69.99999999998812 -2.499999999999648 0
767 -67.49999999998224 -4.999999999999526 0
768 -67.49999999998222 -2.499999999999763 0
769 -69.99999999998815 -7.499999999994571 0
770 -67.49999999998224 -9.99999999999045 0
771 -67.49999999998222 -7.499999999994987 0
772 -69.99999999998813 -12.49999999998086 0
773 -67.49999999998225 -14.99999999997301 0
774 -67.49999999998224 -12.49999999998173 0
775 -69.99999999998812 -17.49999999997599 0
776 -67.49999999998224 -19.99999999998041 0
777 -67.49999999998221 -17.4999999999767 0
778 -69.99999999998811 -22.49999999998488 0
779 -67.49999999998225 -24.99999999998964 0
780 -67.49999999998218 -22.49999999998501 0
781 -69.99999999998813 -27.49999999999483 0
782 -67.49999999998337 -27.49999999999481 0
783 -72.49999999999406 -4.999999999999067 0
784 -72.49999999999406 -2.499999999999872 0
785 -72.49999999999409 -9.999999999989234 0
786 -72.49999999999406 -7.499999999994087 0
787 -72.49999999999409 -14.99999999997075 0
788 -72.49999999999409 -12.49999999997985 0
789 -72.4999999999941 -19.99999999997981 0
790 -72.49999999999409 -17.49999999997565 0
791 -72.49999999999413 -24.99999999998973 0
792 -72.49999999999409 -22.49999999998479 0
793 -72.49999999999386 -27.49999999999483 0
$EndNodes
$Elements
210
1 8 2 1 1 1 5 34
2 8 2 1 1 5 6 35
3 8 2 1 1 6 7 36
4 8 2 1 1 7 8 37
5 8 2 1 1 8 9 38
6 8 2 1 1 9 10 39
7 8 2 1 1 10 11 40
8 8 2 1 1 11 12 41
9 8 2 1 1 12 13 42
10 8 2 1 1 13 14 43
11 8 2 1 1 14 15 44
12 8 2 1 1 15 16 45
13 8 2 1 1 16 17 46
14 8 2 1 1 17 18 47
15 8 2 1 1 18 19 48
16 8 2 1 1 19 20 49
17 8 2 1 1 20 21 50
18 8 2 1 1 21 22 51
19 8 2 1 1 22 23 52
20 8 2 1 1 23 24 53
21 8 2 1 1 24 25 54
22 8 2 1 1 25 26 55
23 8 2 1 1 26 27 56
24 8 2 1 1 27 28 57
25 8 2 1 1 28 29 58
26 8 2 1 1 29 30 59
27 8 2 1 1 30 31 60
28 8 2 1 1 31 32 61
29 8 2 1 1 32 33 62
30 8 2 1 1 33 2 63
31 10 2 2 10 1 5 145 138 34 290 291 144 292
32 10 2 2 10 138 145 146 137 291 293 294 143 295
33 10 2 2 10 137 146 147 136 294 296 297 142 298
34 10 2 2 10 136 147 148 135 297 299 300 141 301
35 10 2 2 10 135 148 149 134 300 302 303 140 304
36 10 2 2 10 134 149 103 4 303 305 133 139 306
37 10 2 2 10 5 6 150 145 35 307 308 290 309
38 10 2 2 10 145 150 151 146 308 310 311 293 312
39 10 2 2 10 146 151 152 147 311 313 314 296 315
40 10 2 2 10 147 152 153 148 314 316 317 299 318
41 10 2 2 10 148 153 154 149 317 319 320 302 321
42 10 2 2 10 149 154 102 103 320 322 132 305 323
43 10 2 2 10 6 7 155 150 36 324 325 307 326
44 10 2 2 10 150 155 156 151 325 327 328 310 329
45 10 2 2 10 151 156 157 152 328 330 331 313 332
46 10 2 2 10 152 157 158 153 331 333 334 316 335
47 10 2 2 10 153 158 159 154 334 336 337 319 338
48 10 2 2 10 154 159 101 102 337 339 131 322 340
49 10 2 2 10 7 8 160 155 37 341 342 324 343
50 10 2 2 10 155 160 161 156 342 344 345 327 346
51 10 2 2 10 156 161 162 157 345 347 348 330 349
52 10 2 2 10 157 162 163 158 348 350 351 333 352
53 10 2 2 10 158 163 164 159 351 353 354 336 355
54 10 2 2 10 159 164 100 101 354 356 130 339 357
55 10 2 2 10 8 9 165 160 38 358 359 341 360
56 10 2 2 10 160 165 166 161 359 361 362 344 363
57 10 2 2 10 161 166 167 162 362 364 365 347 366
58 10 2 2 10 162 167 168 163 365 367 368 350 369
59 10 2 2 10 163 168 169 164 368 370 371 353 372
60 10 2 2 10 164 169 99 100 371 373 129 356 374
61 10 2 2 10 9 10 170 165 39 375 376 358 377
62 10 2 2 10 165 170 171 166 376 378 379 361 380
63 10 2 2 10 166 171 172 167 379 381 382 364 383
64 10 2 2 10 167 172 173 168 382 384 385 367 386
65 10 2 2 10 168 173 174 169 385 387 388 370 389
66 10 2 2 10 169 174 98 99 388 390 128 373 391
67 10 2 2 10 10 11 175 170 40 392 393 375 394
68 10 2 2 10 170 175 176 171 393 395 396 378 397
69 10 2 2 10 171 176 177 172 396 398 399 381 400
70 10 2 2 10 172 177 178 173 399 401 402 384 403
71 10 2 2 10 173 178 179 174 402 404 405 387 406
72 10 2 2 10 174 179 97 98 405 407 127 390 408
73 10 2 2 10 11 12 180 175 41 409 410 392 411
74 10 2 2 10 175 180 181 176 410 412 413 395 414
75 10 2 2 10 176 181 182 177 413 415 416 398 417
76 10 2 2 10 177 182 183 178 416 418 419 401 420
77 10 2 2 10 178 183 184 179 419 421 422 404 423
78 10 2 2 10 179 184 96 97 422 424 126 407 425
79 10 2 2 10 12 13 185 180 42 426 427 409 428
80 10 2 2 10 180 185 186 181 427 429 430 412 431
81 10 2 2 10 181 186 187 182 430 432 433 415 434
82 10 2 2 10 182 187 188 183 433 435 436 418 437
83 10 2 2 10 183 188 189 184 436 438 439 421 440
84 10 2 2 10 184 189 95 96 439 441 125 424 442
85 10 2 2 10 13 14 190 185 43 443 444 426 445
86 10 2 2 10 185 190 191 186 444 446 447 429 448
87 10 2 2 10 186 191 192 187 447 449 450 432 451
88 10 2 2 10 187 192 193 188 450 452 453 435 454
89 10 2 2 10 188 193 194 189 453 455 456 438 457
90 10 2 2 10 189 194 94 95 456 458 124 441 459
91 10 2 2 10 14 15 195 190 44 460 461 443 462
92 10 2 2 10 190 195 196 191 461 463 464 446 465
93 10 2 2 10 191 196 197 192 464 466 467 449 468
94 10 2 2 10 192 197 198 193 467 469 470 452 471
95 10 2 2 10 193 198 199 194 470 472 473 455 474
96 10 2 2 10 194 199 93 94 473 475 123 458 476
97 10 2 2 10 15 16 200 195 45 477 478 460 479
98 10 2 2 10 195 200 201 196 478 480 481 463 482
99 10 2 2 10 196 201 202 197 481 483 484 466 485
100 10 2 2 10 197 202 203 198 484 486 487 469 488
101 10 2 2 10 198 203 204 199 487 489 490 472 491
102 10 2 2 10 199 204 92 93 490 492 122 475 493
103 10 2 2 10 16 17 205 200 46 494 495 477 496
104 10 2 2 10 200 205 206 201 495 497 498 480 499
105 10 2 2 10 201 206 207 202 498 500 501 483 502
106 10 2 2 10 202 207 208 203 501 503 504 486 505
107 10 2 2 10 203 208 209 204 504 506 507 489 508
108 10 2 2 10 204 209 91 92 507 509 121 492 510
109 10 2 2 10 17 18 210 205 47 511 512 494 513
110 10 2 2 10 205 210 211 206 512 514 515 497 516
111 10 2 2 10 206 211 212 207 515 517 518 500 519
112 10 2 2 10 207 212 213 208 518 520 521 503 522
113 10 2 2 10 208 213 214 209 521 523 524 506 525
114 10 2 2 10 209 214 90 91 524 526 120 509 527
115 10 2 2 10 18 19 215 210 48 528 529 511 530
116 10 2 2 10 210 215 216 211 529 531 532 514 533
117 10 2 2 10 211 216 217 212 532 534 535 517 536
118 10 2 2 10 212 217 218 213 535 537 538 520 539
119 10 2 2 10 213 218 219 214 538 540 541 523 542
120 10 2 2 10 214 219 89 90 541 543 119 526 544
121 10 2 2 10 19 20 220 215 49 545 546 528 547
122 10 2 2 10 215 220 221 216 546 548 549 531 550
123 10 2 2 10 216 221 222 217 549 551 552 534 553
124 10 2 2 10 217 222 223 218 552 554 555 537 556
125 10 2 2 10 218 223 224 219 555 557 558 540 559
126 10 2 2 10 219 224 88 89 558 560 118 543 561
127 10 2 2 10 20 21 225 220 50 562 563 545 564
128 10 2 2 10 220 225 226 221 563 565 566 548 567
129 10 2 2 10 221 226 227 222 566 568 569 551 570
130 10 2 2 10 222 227 228 223 569 571 572 554 573
131 10 2 2 10 223 228 229 224 572 574 575 557 576
132 10 2 2 10 224 229 87 88 575 577 117 560 578
133 10 2 2 10 21 22 230 225 51 579 580 562 581
134 10 2 2 10 225 230 231 226 580 582 583 565 584
135 10 2 2 10 226 231 232 227 583 585 586 568 587
136 10 2 2 10 227 232 233 228 586 588 589 571 590
137 10 2 2 10 228 233 234 229 589 591 592 574 593
138 10 2 2 10 229 234 86 87 592 594 116 577 595
139 10 2 2 10 22 23 235 230 52 596 597 579 598
140 10 2 2 10 230 235 236 231 597 599 600 582 601
141 10 2 2 10 231 236 237 232 600 602 603 585 604
142 10 2 2 10 232 237 238 233 603 605 606 588 607
143 10 2 2 10 233 238 239 234 606 608 609 591 610
144 10 2 2 10 234 239 85 86 609 611 115 594 612
145 10 2 2 10 23 24 240 235 53 613 614 596 615
146 10 2 2 10 235 240 241 236 614 616 617 599 618
147 10 2 2 10 236 241 242 237 617 619 620 602 621
148 10 2 2 10 237 242 243 238 620 622 623 605 624
149 10 2 2 10 238 243 244 239 623 625 626 608 627
150 10 2 2 10 239 244 84 85 626 628 114 611 629
151 10 2 2 10 24 25 245 240 54 630 631 613 632
152 10 2 2 10 240 245 246 241 631 633 634 616 635
153 10 2 2 10 241 246 247 242 634 636 637 619 638
154 10 2 2 10 242 247 248 243 637 639 640 622 641
155 10 2 2 10 243 248 249 244 640 642 643 625 644
156 10 2 2 10 244 249 83 84 643 645 113 628 646
157 10 2 2 10 25 26 250 245 55 647 648 630 649
158 10 2 2 10 245 250 251 246 648 650 651 633 652
159 10 2 2 10 246 251 252 247 651 653 654 636 655
160 10 2 2 10 247 252 253 248 654 656 657 639 658
161 10 2 2 10 248 253 254 249 657 659 660 642 661
162 10 2 2 10 249 254 82 83 660 662 112 645 663
163 10 2 2 10 26 27 255 250 56 664 665 647 666
164 10 2 2 10 250 255 256 251 665 667 668 650 669
165 10 2 2 10 251 256 257 252 668 670 671 653 672
166 10 2 2 10 252 257 258 253 671 673 674 656 675
167 10 2 2 10 253 258 259 254 674 676 677 659 678
168 10 2 2 10 254 259 81 82 677 679 111 662 680
169 10 2 2 10 27 28 260 255 57 681 682 664 683
170 10 2 2 10 255 260 261 256 682 684 685 667 686
171 10 2 2 10 256 261 262 257 685 687 688 670 689
172 10 2 2 10 257 262 263 258 688 690 691 673 692
173 10 2 2 10 258 263 264 259 691 693 694 676 695
174 10 2 2 10 259 264 80 81 694 696 110 679 697
175 10 2 2 10 28 29 265 260 58 698 699 681 700
176 10 2 2 10 260 265 266 261 699 701 702 684 703
177 10 2 2 10 261 266 267 262 702 704 705 687 706
178 10 2 2 10 262 267 268 263 705 707 708 690 709
179 10 2 2 10 263 268 269 264 708 710 711 693 712
180 10 2 2 10 264 269 79 80 711 713 109 696 714
181 10 2 2 10 29 30 270 265 59 715 716 698 717
182 10 2 2 10 265 270 271 266 716 718 719 701 720
183 10 2 2 10 266 271 272 267 719 721 722 704 723
184 10 2 2 10 267 272 273 268 722 724 725 707 726
185 10 2 2 10 268 273 274 269 725 727 728 710 729
186 10 2 2 10 269 274 78 79 728 730 108 713 731
187 10 2 2 10 30 31 275 270 60 732 733 715 734
188 10 2 2 10 270 275 276 271 733 735 736 718 737
189 10 2 2 10 271 276 277 272 736 738 739 721 740
190 10 2 2 10 272 277 278 273 739 741 742 724 743
191 10 2 2 10 273 278 279 274 742 744 745 727 746
192 10 2 2 10 274 279 77 78 745 747 107 730 748
193 10 2 2 10 31 32 280 275 61 749 750 732 751
194 10 2 2 10 275 280 281 276 750 752 753 735 754
195 10 2 2 10 276 281 282 277 753 755 756 738 757
196 10 2 2 10 277 282 283 278 756 758 759 741 760
197 10 2 2 10 278 283 284 279 759 761 762 744 763
198 10 2 2 10 279 284 76 77 762 764 106 747 765
199 10 2 2 10 32 33 285 280 62 766 767 749 768
200 10 2 2 10 280 285 286 281 767 769 770 752 771
201 10 2 2 10 281 286 287 282 770 772 773 755 774
202 10 2 2 10 282 287 288 283 773 775 776 758 777
203 10 2 2 10 283 288 289 284 776 778 779 761 780
204 10 2 2 10 284 289 75 76 779 781 105 764 782
205 10 2 2 10 33 2 64 285 63 69 783 766 784
206 10 2 2 10 285 64 65 286 783 70 785 769 786
207 10 2 2 10 286 65 66 287 785 71 787 772 788
208 10 2 2 10 287 66 67 288 787 72 789 775 790
209 10 2 2 10 288 67 68 289 789 73 791 778 792
210 10 2 2 10 289 68 3 75 791 74 104 781 793
$EndElements
