$MeshFormat
2.2 0 8
$EndMeshFormat
$PhysicalNames
7
2 1 "hot"
2 2 "cold"
2 3 "anode"
2 4 "cathode"
3 5 "vWire1"
3 6 "chan"
3 7 "vWire2"
$EndPhysicalNames
$Nodes
48
1 0 0 0
2 0 1 0
3 1 1 0
4 1 0 0
5 0 1 5
6 1 1 5
7 1 0 5
8 0 0 5
9 0 1 8
10 1 1 8
11 1 0 8
12 0 0 8
13 0 1 13
14 1 1 13
15 1 0 13
16 0 0 13
17 0 1 1.25
18 0 1 2.5
19 0 1 3.75
20 1 1 1.25
21 1 1 2.5
22 1 1 3.75
23 1 0 1.25
24 1 0 2.5
25 1 0 3.75
26 0 0 1.25
27 0 0 2.5
28 0 0 3.75
29 0 1 6
30 0 1 7
31 1 1 6
32 1 1 7
33 1 0 6
34 1 0 7
35 0 0 6
36 0 0 7
37 0 1 9.25
38 0 1 10.5
39 0 1 11.75
40 1 1 9.25
41 1 1 10.5
42 1 1 11.75
43 1 0 9.25
44 1 0 10.5
45 1 0 11.75
46 0 0 9.25
47 0 0 10.5
48 0 0 11.75
$EndNodes
$Elements
15
1 3 2 2 6 4 1 2 3
2 3 2 3 28 7 8 5 6
3 3 2 4 50 11 12 9 10
4 3 2 1 72 15 16 13 14
5 5 2 5 1 4 3 2 1 23 20 17 26
6 5 2 5 1 23 20 17 26 24 21 18 27
7 5 2 5 1 24 21 18 27 25 22 19 28
8 5 2 5 1 25 22 19 28 7 6 5 8
9 5 2 6 2 7 6 5 8 33 31 29 35
10 5 2 6 2 33 31 29 35 34 32 30 36
11 5 2 6 2 34 32 30 36 11 10 9 12
12 5 2 7 3 11 10 9 12 43 40 37 46
13 5 2 7 3 43 40 37 46 44 41 38 47
14 5 2 7 3 44 41 38 47 45 42 39 48
15 5 2 7 3 45 42 39 48 15 14 13 16
$EndElements
