$MeshFormat
2.2 0 8
$EndMeshFormat
$PhysicalNames
9
1 3 "bottom"
1 4 "bottom_Inf"
1 5 "top"
1 6 "top_Inf"
1 7 "left"
1 8 "right"
1 9 "rightInner"
2 1 "S_inner"
2 2 "S_Inf"
$EndPhysicalNames
$Nodes
549
1 0 -0.5 0
2 10 -0.5 0
3 10 0.5 0
4 0 0.5 0
5 12 0.5 0
6 12 -0.5 0
7 0.199999999999856 -0.5 0
8 0.3999999999996677 -0.5 0
9 0.5999999999994682 -0.5 0
10 0.7999999999993285 -0.5 0
11 0.9999999999991888 -0.5 0
12 1.199999999999033 -0.5 0
13 1.399999999998577 -0.5 0
14 1.599999999997992 -0.5 0
15 1.799999999997408 -0.5 0
16 1.999999999996824 -0.5 0
17 2.19999999999624 -0.5 0
18 2.399999999995655 -0.5 0
19 2.599999999995072 -0.5 0
20 2.799999999994487 -0.5 0
21 2.999999999993903 -0.5 0
22 3.199999999993319 -0.5 0
23 3.399999999992735 -0.5 0
24 3.599999999992151 -0.5 0
25 3.799999999991566 -0.5 0
26 3.999999999991017 -0.5 0
27 4.199999999991183 -0.5 0
28 4.399999999991486 -0.5 0
29 4.59999999999179 -0.5 0
30 4.799999999992094 -0.5 0
31 4.999999999992399 -0.5 0
32 5.199999999992704 -0.5 0
33 5.399999999993007 -0.5 0
34 5.599999999993312 -0.5 0
35 5.799999999993616 -0.5 0
36 5.99999999999392 -0.5 0
37 6.199999999994223 -0.5 0
38 6.399999999994527 -0.5 0
39 6.599999999994831 -0.5 0
40 6.799999999995135 -0.5 0
41 6.999999999995438 -0.5 0
42 7.199999999995743 -0.5 0
43 7.399999999996048 -0.5 0
44 7.599999999996351 -0.5 0
45 7.799999999996655 -0.5 0
46 7.99999999999696 -0.5 0
47 8.199999999997264 -0.5 0
48 8.399999999997569 -0.5 0
49 8.599999999997872 -0.5 0
50 8.799999999998175 -0.5 0
51 8.999999999998479 -0.5 0
52 9.199999999998782 -0.5 0
53 9.399999999999087 -0.5 0
54 9.59999999999939 -0.5 0
55 9.799999999999695 -0.5 0
56 10 -0.3750000000003466 0
57 10 -0.2500000000006933 0
58 10 -0.1250000000010397 0
59 10 -1.375122238300719e-12 0
60 10 0.1249999999989605 0
61 10 0.249999999999307 0
62 10 0.3749999999996535 0
63 9.799999999999999 0.5 0
64 9.6 0.5 0
65 9.399999999999999 0.5 0
66 9.199999999999999 0.5 0
67 8.999999999999998 0.5 0
68 8.799999999999999 0.5 0
69 8.599999999999998 0.5 0
70 8.399999999999999 0.5 0
71 8.199999999999998 0.5 0
72 7.999999999999996 0.5 0
73 7.799999999999995 0.5 0
74 7.599999999999995 0.5 0
75 7.399999999999995 0.5 0
76 7.199999999999996 0.5 0
77 6.999999999999995 0.5 0
78 6.799999999999995 0.5 0
79 6.599999999999996 0.5 0
80 6.399999999999996 0.5 0
81 6.199999999999996 0.5 0
82 5.999999999999996 0.5 0
83 5.799999999999996 0.5 0
84 5.599999999999996 0.5 0
85 5.399999999999997 0.5 0
86 5.199999999999997 0.5 0
87 4.999999999999996 0.5 0
88 4.799999999999996 0.5 0
89 4.599999999999998 0.5 0
90 4.399999999999997 0.5 0
91 4.199999999999998 0.5 0
92 3.999999999999996 0.5 0
93 3.799999999999998 0.5 0
94 3.599999999999998 0.5 0
95 3.399999999999998 0.5 0
96 3.199999999999998 0.5 0
97 2.999999999999998 0.5 0
98 2.799999999999998 0.5 0
99 2.599999999999998 0.5 0
100 2.399999999999999 0.5 0
101 2.199999999999998 0.5 0
102 1.999999999999998 0.5 0
103 1.799999999999999 0.5 0
104 1.6 0.5 0
105 1.399999999999999 0.5 0
106 1.199999999999999 0.5 0
107 1 0.5 0
108 0.7999999999999989 0.5 0
109 0.5999999999999996 0.5 0
110 0.4000000000000004 0.5 0
111 0.1999999999999993 0.5 0
112 0 0.3750000000003466 0
113 0 0.2500000000006933 0
114 0 0.1250000000010397 0
115 0 1.375122238300719e-12 0
116 0 -0.1249999999989605 0
117 0 -0.249999999999307 0
118 0 -0.3749999999996535 0
119 10.2 0.5 0
120 10.4 0.5 0
121 10.6 0.5 0
122 10.8 0.5 0
123 11 0.5 0
124 11.2 0.5 0
125 11.4 0.5 0
126 11.6 0.5 0
127 11.8 0.5 0
128 12 0.3750000000003466 0
129 12 0.2500000000006933 0
130 12 0.1250000000010397 0
131 12 1.375122238300719e-12 0
132 12 -0.1249999999989605 0
133 12 -0.249999999999307 0
134 12 -0.3749999999996535 0
135 11.8 -0.5 0
136 11.6 -0.5 0
137 11.4 -0.5 0
138 11.2 -0.5 0
139 11 -0.5 0
140 10.8 -0.5 0
141 10.6 -0.5 0
142 10.4 -0.5 0
143 10.2 -0.5 0
144 0.1999999999998739 -0.3749999999996673 0
145 0.1999999999998918 -0.2499999999993346 0
146 0.1999999999999097 -0.1249999999990021 0
147 0.1999999999999277 1.320110687430542e-12 0
148 0.1999999999999456 0.1250000000009981 0
149 0.1999999999999635 0.2500000000006656 0
150 0.1999999999999814 0.3750000000003327 0
151 0.3999999999997094 -0.3749999999996812 0
152 0.3999999999997509 -0.2499999999993624 0
153 0.3999999999997925 -0.1249999999990436 0
154 0.399999999999834 1.26507138098475e-12 0
155 0.3999999999998757 0.1250000000009565 0
156 0.3999999999999172 0.2500000000006378 0
157 0.3999999999999588 0.375000000000319 0
158 0.5999999999995347 -0.3749999999996951 0
159 0.5999999999996012 -0.2499999999993902 0
160 0.5999999999996677 -0.1249999999990852 0
161 0.599999999999734 1.210115341265805e-12 0
162 0.5999999999998004 0.1250000000009149 0
163 0.5999999999998666 0.2500000000006101 0
164 0.5999999999999331 0.3750000000003049 0
165 0.7999999999994121 -0.374999999999709 0
166 0.7999999999994961 -0.2499999999994179 0
167 0.7999999999995798 -0.1249999999991268 0
168 0.7999999999996635 1.155076034820013e-12 0
169 0.7999999999997476 0.1250000000008733 0
170 0.7999999999998314 0.2500000000005824 0
171 0.7999999999999151 0.3750000000002912 0
172 0.99999999999929 -0.3749999999997227 0
173 0.9999999999993915 -0.2499999999994457 0
174 0.9999999999994929 -0.1249999999991684 0
175 0.9999999999995942 1.100092239525452e-12 0
176 0.9999999999996957 0.1250000000008318 0
177 0.9999999999997973 0.2500000000005547 0
178 0.9999999999998985 0.3750000000002773 0
179 1.199999999999154 -0.3749999999997367 0
180 1.199999999999275 -0.2499999999994734 0
181 1.199999999999396 -0.1249999999992099 0
182 1.199999999999516 1.04505293307966e-12 0
183 1.199999999999637 0.1250000000007901 0
184 1.199999999999758 0.250000000000527 0
185 1.199999999999878 0.3750000000002634 0
186 1.399999999998754 -0.3749999999997505 0
187 1.399999999998932 -0.2499999999995012 0
188 1.39999999999911 -0.1249999999992516 0
189 1.399999999999288 9.900968933607146e-13 0
190 1.399999999999465 0.1250000000007486 0
191 1.399999999999644 0.2500000000004993 0
192 1.399999999999821 0.3750000000002496 0
193 1.599999999998243 -0.3749999999997644 0
194 1.599999999998494 -0.2499999999995287 0
195 1.599999999998745 -0.1249999999992932 0
196 1.599999999998996 9.350575869149225e-13 0
197 1.599999999999246 0.125000000000707 0
198 1.599999999999497 0.2500000000004715 0
199 1.599999999999749 0.3750000000002357 0
200 1.799999999997732 -0.3749999999997783 0
201 1.799999999998056 -0.2499999999995565 0
202 1.79999999999838 -0.1249999999993347 0
203 1.799999999998704 8.800737916203616e-13 0
204 1.799999999999027 0.1250000000006654 0
205 1.799999999999351 0.2500000000004438 0
206 1.799999999999675 0.3750000000002218 0
207 1.999999999997221 -0.3749999999997921 0
208 1.999999999997618 -0.2499999999995842 0
209 1.999999999998014 -0.1249999999993764 0
210 1.999999999998411 8.250899963258007e-13 0
211 1.999999999998808 0.1250000000006238 0
212 1.999999999999205 0.2500000000004161 0
213 1.999999999999602 0.375000000000208 0
214 2.199999999996709 -0.374999999999806 0
215 2.199999999997179 -0.249999999999612 0
216 2.199999999997649 -0.1249999999994179 0
217 2.199999999998119 7.700506898800086e-13 0
218 2.199999999998589 0.1250000000005823 0
219 2.199999999999059 0.2500000000003884 0
220 2.199999999999529 0.3750000000001942 0
221 2.399999999996198 -0.3749999999998198 0
222 2.399999999996741 -0.2499999999996397 0
223 2.399999999997285 -0.1249999999994595 0
224 2.399999999997827 7.150668945854477e-13 0
225 2.39999999999837 0.1250000000005407 0
226 2.399999999998913 0.2500000000003606 0
227 2.399999999999455 0.3750000000001803 0
228 2.599999999995689 -0.3749999999998338 0
229 2.599999999996303 -0.2499999999996675 0
230 2.599999999996919 -0.124999999999501 0
231 2.599999999997535 6.600830992908868e-13 0
232 2.599999999998151 0.1250000000004991 0
233 2.599999999998766 0.2500000000003329 0
234 2.599999999999381 0.3750000000001664 0
235 2.799999999995176 -0.3749999999998476 0
236 2.799999999995865 -0.2499999999996952 0
237 2.799999999996554 -0.1249999999995427 0
238 2.799999999997243 6.050715484207103e-13 0
239 2.79999999999793 0.1250000000004575 0
240 2.79999999999862 0.2500000000003052 0
241 2.799999999999309 0.3750000000001525 0
242 2.999999999994665 -0.3749999999998614 0
243 2.999999999995427 -0.2499999999997228 0
244 2.999999999996189 -0.1249999999995842 0
245 2.99999999999695 5.500599975505338e-13 0
246 2.999999999997712 0.1250000000004159 0
247 2.999999999998475 0.2500000000002774 0
248 2.999999999999237 0.3750000000001387 0
249 3.199999999994154 -0.3749999999998753 0
250 3.199999999994989 -0.2499999999997505 0
251 3.199999999995824 -0.1249999999996258 0
252 3.199999999996659 4.950762022559729e-13 0
253 3.199999999997495 0.1250000000003743 0
254 3.199999999998329 0.2500000000002497 0
255 3.199999999999163 0.3750000000001248 0
256 3.399999999993643 -0.3749999999998891 0
257 3.39999999999455 -0.2499999999997783 0
258 3.399999999995459 -0.1249999999996674 0
259 3.399999999996366 4.400646513857964e-13 0
260 3.399999999997275 0.1250000000003328 0
261 3.399999999998181 0.250000000000222 0
262 3.39999999999909 0.375000000000111 0
263 3.599999999993133 -0.3749999999999031 0
264 3.599999999994113 -0.249999999999806 0
265 3.599999999995094 -0.124999999999709 0
266 3.599999999996074 3.850253449400043e-13 0
267 3.599999999997056 0.1250000000002912 0
268 3.599999999998036 0.2500000000001942 0
269 3.599999999999018 0.3750000000000971 0
270 3.799999999992619 -0.3749999999999168 0
271 3.799999999993674 -0.2499999999998337 0
272 3.799999999994727 -0.1249999999997506 0
273 3.799999999995781 3.300137940698278e-13 0
274 3.799999999996836 0.1250000000002496 0
275 3.79999999999789 0.2500000000001665 0
276 3.799999999998944 0.3750000000000833 0
277 3.99999999999214 -0.3749999999999307 0
278 3.999999999993262 -0.2499999999998616 0
279 3.999999999994384 -0.1249999999997921 0
280 3.999999999995507 2.750299987752669e-13 0
281 3.999999999996629 0.125000000000208 0
282 3.999999999997751 0.2500000000001388 0
283 3.999999999998874 0.3750000000000694 0
284 4.199999999992285 -0.3749999999999446 0
285 4.199999999993386 -0.2499999999998893 0
286 4.199999999994489 -0.1249999999998338 0
287 4.19999999999559 2.20046203480706e-13 0
288 4.199999999996692 0.1250000000001664 0
289 4.199999999997793 0.2500000000001111 0
290 4.199999999998896 0.3750000000000555 0
291 4.39999999999255 -0.3749999999999585 0
292 4.399999999993613 -0.2499999999999171 0
293 4.399999999994677 -0.1249999999998753 0
294 4.399999999995741 1.650346526105295e-13 0
295 4.399999999996805 0.1250000000001248 0
296 4.399999999997869 0.2500000000000834 0
297 4.399999999998933 0.3750000000000416 0
298 4.599999999992817 -0.3749999999999724 0
299 4.599999999993842 -0.2499999999999446 0
300 4.59999999999487 -0.1249999999999169 0
301 4.599999999995894 1.100508573159686e-13 0
302 4.59999999999692 0.1250000000000833 0
303 4.599999999997945 0.2500000000000556 0
304 4.599999999998972 0.3750000000000278 0
305 4.799999999993082 -0.3749999999999862 0
306 4.799999999994069 -0.2499999999999724 0
307 4.799999999995057 -0.1249999999999584 0
308 4.799999999996045 5.501155087017651e-14 0
309 4.799999999997033 0.1250000000000417 0
310 4.79999999999802 0.2500000000000279 0
311 4.799999999999009 0.3750000000000139 0
312 4.999999999993348 -0.375 0
313 4.999999999994298 -0.2500000000000002 0
314 4.999999999995248 -0.1250000000000001 0
315 4.999999999996197 0 0
316 4.999999999997147 0.1250000000000001 0
317 4.999999999998098 0.2500000000000002 0
318 4.999999999999046 0.375 0
319 5.199999999993617 -0.3750000000000139 0
320 5.199999999994526 -0.2500000000000279 0
321 5.199999999995438 -0.1250000000000416 0
322 5.199999999996351 -5.502542865798432e-14 0
323 5.199999999997262 0.1249999999999585 0
324 5.199999999998173 0.2499999999999725 0
325 5.199999999999085 0.3749999999999861 0
326 5.39999999999388 -0.3750000000000278 0
327 5.399999999994752 -0.2500000000000556 0
328 5.399999999995629 -0.1250000000000832 0
329 5.399999999996501 -1.10023101740353e-13 0
330 5.399999999997375 0.1249999999999169 0
331 5.399999999998249 0.2499999999999447 0
332 5.399999999999125 0.3749999999999724 0
333 5.599999999994147 -0.3750000000000416 0
334 5.599999999994981 -0.2500000000000834 0
335 5.599999999995819 -0.1250000000001249 0
336 5.599999999996655 -1.650485303983373e-13 0
337 5.59999999999749 0.1249999999998753 0
338 5.599999999998325 0.249999999999917 0
339 5.599999999999159 0.3749999999999585 0
340 5.799999999994412 -0.3750000000000555 0
341 5.799999999995211 -0.2500000000001111 0
342 5.799999999996009 -0.1250000000001664 0
343 5.799999999996806 -2.20046203480706e-13 0
344 5.799999999997604 0.1249999999998337 0
345 5.799999999998401 0.2499999999998893 0
346 5.799999999999198 0.3749999999999446 0
347 5.999999999994679 -0.3750000000000693 0
348 5.99999999999544 -0.2500000000001387 0
349 5.999999999996198 -0.125000000000208 0
350 5.999999999996957 -2.750022431996513e-13 0
351 5.999999999997716 0.1249999999997922 0
352 5.999999999998478 0.2499999999998616 0
353 5.999999999999236 0.3749999999999307 0
354 6.199999999994945 -0.3750000000000833 0
355 6.199999999995666 -0.2500000000001664 0
356 6.199999999996388 -0.1250000000002496 0
357 6.19999999999711 -3.2999991628202e-13 0
358 6.199999999997831 0.1249999999997506 0
359 6.199999999998552 0.2499999999998338 0
360 6.199999999999275 0.3749999999999168 0
361 6.39999999999521 -0.3750000000000971 0
362 6.399999999995894 -0.2500000000001942 0
363 6.399999999996578 -0.1250000000002912 0
364 6.399999999997261 -3.850253449400043e-13 0
365 6.399999999997943 0.124999999999709 0
366 6.399999999998627 0.249999999999806 0
367 6.399999999999314 0.3749999999999031 0
368 6.599999999995475 -0.3750000000001109 0
369 6.599999999996124 -0.2500000000002219 0
370 6.59999999999677 -0.1250000000003327 0
371 6.599999999997415 -4.40023018022373e-13 0
372 6.59999999999806 0.1249999999996674 0
373 6.599999999998706 0.2499999999997783 0
374 6.599999999999351 0.3749999999998891 0
375 6.799999999995743 -0.3750000000001249 0
376 6.79999999999635 -0.2500000000002497 0
377 6.799999999996958 -0.1250000000003743 0
378 6.799999999997565 -4.950484466803573e-13 0
379 6.799999999998173 0.1249999999996258 0
380 6.79999999999878 0.2499999999997506 0
381 6.799999999999387 0.3749999999998753 0
382 6.999999999996009 -0.3750000000001387 0
383 6.999999999996576 -0.2500000000002774 0
384 6.999999999997147 -0.1250000000004159 0
385 6.999999999997716 -5.500738753383416e-13 0
386 6.999999999998285 0.1249999999995843 0
387 6.999999999998856 0.2499999999997229 0
388 6.999999999999424 0.3749999999998614 0
389 7.199999999996275 -0.3750000000001525 0
390 7.199999999996807 -0.2500000000003053 0
391 7.199999999997338 -0.1250000000004575 0
392 7.199999999997869 -6.050715484207103e-13 0
393 7.199999999998401 0.1249999999995427 0
394 7.199999999998931 0.2499999999996952 0
395 7.199999999999465 0.3749999999998476 0
396 7.39999999999654 -0.3750000000001664 0
397 7.399999999997037 -0.250000000000333 0
398 7.399999999997529 -0.1250000000004991 0
399 7.39999999999802 -6.600969770786946e-13 0
400 7.399999999998515 0.1249999999995011 0
401 7.399999999999009 0.2499999999996675 0
402 7.399999999999501 0.3749999999998337 0
403 7.599999999996808 -0.3750000000001803 0
404 7.599999999997262 -0.2500000000003605 0
405 7.599999999997718 -0.1250000000005407 0
406 7.599999999998174 -7.150322001159282e-13 0
407 7.599999999998628 0.1249999999994595 0
408 7.599999999999083 0.2499999999996397 0
409 7.59999999999954 0.3749999999998198 0
410 7.799999999997071 -0.3750000000001942 0
411 7.799999999997489 -0.2500000000003882 0
412 7.799999999997908 -0.1250000000005823 0
413 7.799999999998324 -7.700576287739125e-13 0
414 7.799999999998742 0.1249999999994179 0
415 7.799999999999161 0.249999999999612 0
416 7.799999999999577 0.374999999999806 0
417 7.99999999999734 -0.3750000000002079 0
418 7.999999999997721 -0.250000000000416 0
419 7.999999999998098 -0.1250000000006238 0
420 7.999999999998479 -8.250483629623773e-13 0
421 7.999999999998859 0.1249999999993763 0
422 7.999999999999239 0.2499999999995843 0
423 7.999999999999618 0.3749999999997922 0
424 8.199999999997605 -0.3750000000002219 0
425 8.199999999997946 -0.2500000000004438 0
426 8.199999999998287 -0.1250000000006654 0
427 8.199999999998631 -8.800737916203616e-13 0
428 8.199999999998973 0.1249999999993348 0
429 8.199999999999314 0.2499999999995565 0
430 8.199999999999658 0.3749999999997783 0
431 8.399999999997871 -0.3750000000002357 0
432 8.399999999998176 -0.2500000000004715 0
433 8.399999999998478 -0.125000000000707 0
434 8.399999999998784 -9.350992202783459e-13 0
435 8.399999999999089 0.1249999999992932 0
436 8.399999999999391 0.2499999999995288 0
437 8.399999999999693 0.3749999999997644 0
438 8.599999999998138 -0.3750000000002496 0
439 8.599999999998404 -0.2500000000004993 0
440 8.599999999998673 -0.1250000000007486 0
441 8.599999999998934 -9.900968933607146e-13 0
442 8.5999999999992 0.1249999999992516 0
443 8.599999999999467 0.2499999999995011 0
444 8.59999999999973 0.3749999999997505 0
445 8.799999999998402 -0.3750000000002635 0
446 8.799999999998629 -0.250000000000527 0
447 8.799999999998857 -0.1250000000007901 0
448 8.799999999999088 -1.045118852571747e-12 0
449 8.799999999999315 0.12499999999921 0
450 8.799999999999542 0.2499999999994734 0
451 8.79999999999977 0.3749999999997367 0
452 8.999999999998671 -0.3750000000002773 0
453 8.99999999999886 -0.2500000000005548 0
454 8.999999999999048 -0.1250000000008318 0
455 8.99999999999924 -1.100113056207164e-12 0
456 8.999999999999428 0.1249999999991684 0
457 8.999999999999616 0.2499999999994457 0
458 8.999999999999808 0.3749999999997228 0
459 9.199999999998935 -0.3750000000002912 0
460 9.199999999999084 -0.2500000000005823 0
461 9.199999999999237 -0.1250000000008733 0
462 9.19999999999939 -1.155082973713917e-12 0
463 9.199999999999543 0.1249999999991268 0
464 9.199999999999696 0.2499999999994179 0
465 9.199999999999847 0.3749999999997089 0
466 9.399999999999205 -0.375000000000305 0
467 9.399999999999315 -0.2500000000006101 0
468 9.39999999999943 -0.1250000000009149 0
469 9.399999999999547 -1.210078912072809e-12 0
470 9.399999999999656 0.1249999999990852 0
471 9.399999999999773 0.2499999999993902 0
472 9.399999999999887 0.374999999999695 0
473 9.599999999999469 -0.3750000000003189 0
474 9.599999999999543 -0.2500000000006378 0
475 9.59999999999962 -0.1250000000009564 0
476 9.599999999999696 -1.265102606007318e-12 0
477 9.59999999999977 0.1249999999990437 0
478 9.599999999999845 0.2499999999993625 0
479 9.599999999999923 0.3749999999996813 0
480 9.799999999999731 -0.3750000000003327 0
481 9.799999999999773 -0.2500000000006656 0
482 9.799999999999809 -0.1250000000009981 0
483 9.799999999999848 -1.320098544366211e-12 0
484 9.799999999999885 0.124999999999002 0
485 9.799999999999923 0.2499999999993348 0
486 9.799999999999958 0.3749999999996673 0
487 10.2 0.3749999999997228 0
488 10.2 0.2499999999994457 0
489 10.2 0.1249999999991684 0
490 10.2 -1.100092239525452e-12 0
491 10.2 -0.1250000000008318 0
492 10.2 -0.2500000000005547 0
493 10.2 -0.3750000000002773 0
494 10.4 0.3749999999997921 0
495 10.4 0.2499999999995842 0
496 10.4 0.1249999999993764 0
497 10.4 -8.250622407501851e-13 0
498 10.4 -0.1250000000006238 0
499 10.4 -0.2500000000004161 0
500 10.4 -0.3750000000002079 0
501 10.6 0.3749999999998614 0
502 10.6 0.2499999999997227 0
503 10.6 0.1249999999995842 0
504 10.6 -5.500599975505338e-13 0
505 10.6 -0.1250000000004159 0
506 10.6 -0.2500000000002774 0
507 10.6 -0.3750000000001387 0
508 10.8 0.3749999999999307 0
509 10.8 0.2499999999998616 0
510 10.8 0.1249999999997921 0
511 10.8 -2.750022431996513e-13 0
512 10.8 -0.125000000000208 0
513 10.8 -0.2500000000001388 0
514 10.8 -0.3750000000000694 0
515 11 0.3750000000000001 0
516 11 0.2500000000000001 0
517 11 0.1250000000000001 0
518 11 0 0
519 11 -0.1250000000000001 0
520 11 -0.2500000000000002 0
521 11 -0.3750000000000001 0
522 11.2 0.3750000000000694 0
523 11.2 0.2500000000001387 0
524 11.2 0.125000000000208 0
525 11.2 2.750022431996513e-13 0
526 11.2 -0.1249999999997922 0
527 11.2 -0.2499999999998616 0
528 11.2 -0.3749999999999307 0
529 11.4 0.3750000000001387 0
530 11.4 0.2500000000002773 0
531 11.4 0.1250000000004159 0
532 11.4 5.500738753383416e-13 0
533 11.4 -0.1249999999995842 0
534 11.4 -0.2499999999997229 0
535 11.4 -0.3749999999998614 0
536 11.6 0.3750000000002079 0
537 11.6 0.250000000000416 0
538 11.6 0.1250000000006238 0
539 11.6 8.250483629623773e-13 0
540 11.6 -0.1249999999993763 0
541 11.6 -0.2499999999995843 0
542 11.6 -0.3749999999997921 0
543 11.8 0.3750000000002773 0
544 11.8 0.2500000000005548 0
545 11.8 0.1250000000008318 0
546 11.8 1.100113056207164e-12 0
547 11.8 -0.1249999999991684 0
548 11.8 -0.2499999999994457 0
549 11.8 -0.3749999999997228 0
$EndNodes
$Elements
624
1 1 2 3 5 1 7
2 1 2 3 5 7 8
3 1 2 3 5 8 9
4 1 2 3 5 9 10
5 1 2 3 5 10 11
6 1 2 3 5 11 12
7 1 2 3 5 12 13
8 1 2 3 5 13 14
9 1 2 3 5 14 15
10 1 2 3 5 15 16
11 1 2 3 5 16 17
12 1 2 3 5 17 18
13 1 2 3 5 18 19
14 1 2 3 5 19 20
15 1 2 3 5 20 21
16 1 2 3 5 21 22
17 1 2 3 5 22 23
18 1 2 3 5 23 24
19 1 2 3 5 24 25
20 1 2 3 5 25 26
21 1 2 3 5 26 27
22 1 2 3 5 27 28
23 1 2 3 5 28 29
24 1 2 3 5 29 30
25 1 2 3 5 30 31
26 1 2 3 5 31 32
27 1 2 3 5 32 33
28 1 2 3 5 33 34
29 1 2 3 5 34 35
30 1 2 3 5 35 36
31 1 2 3 5 36 37
32 1 2 3 5 37 38
33 1 2 3 5 38 39
34 1 2 3 5 39 40
35 1 2 3 5 40 41
36 1 2 3 5 41 42
37 1 2 3 5 42 43
38 1 2 3 5 43 44
39 1 2 3 5 44 45
40 1 2 3 5 45 46
41 1 2 3 5 46 47
42 1 2 3 5 47 48
43 1 2 3 5 48 49
44 1 2 3 5 49 50
45 1 2 3 5 50 51
46 1 2 3 5 51 52
47 1 2 3 5 52 53
48 1 2 3 5 53 54
49 1 2 3 5 54 55
50 1 2 3 5 55 2
51 1 2 9 6 2 56
52 1 2 9 6 56 57
53 1 2 9 6 57 58
54 1 2 9 6 58 59
55 1 2 9 6 59 60
56 1 2 9 6 60 61
57 1 2 9 6 61 62
58 1 2 9 6 62 3
59 1 2 5 7 3 63
60 1 2 5 7 63 64
61 1 2 5 7 64 65
62 1 2 5 7 65 66
63 1 2 5 7 66 67
64 1 2 5 7 67 68
65 1 2 5 7 68 69
66 1 2 5 7 69 70
67 1 2 5 7 70 71
68 1 2 5 7 71 72
69 1 2 5 7 72 73
70 1 2 5 7 73 74
71 1 2 5 7 74 75
72 1 2 5 7 75 76
73 1 2 5 7 76 77
74 1 2 5 7 77 78
75 1 2 5 7 78 79
76 1 2 5 7 79 80
77 1 2 5 7 80 81
78 1 2 5 7 81 82
79 1 2 5 7 82 83
80 1 2 5 7 83 84
81 1 2 5 7 84 85
82 1 2 5 7 85 86
83 1 2 5 7 86 87
84 1 2 5 7 87 88
85 1 2 5 7 88 89
86 1 2 5 7 89 90
87 1 2 5 7 90 91
88 1 2 5 7 91 92
89 1 2 5 7 92 93
90 1 2 5 7 93 94
91 1 2 5 7 94 95
92 1 2 5 7 95 96
93 1 2 5 7 96 97
94 1 2 5 7 97 98
95 1 2 5 7 98 99
96 1 2 5 7 99 100
97 1 2 5 7 100 101
98 1 2 5 7 101 102
99 1 2 5 7 102 103
100 1 2 5 7 103 104
101 1 2 5 7 104 105
102 1 2 5 7 105 106
103 1 2 5 7 106 107
104 1 2 5 7 107 108
105 1 2 5 7 108 109
106 1 2 5 7 109 110
107 1 2 5 7 110 111
108 1 2 5 7 111 4
109 1 2 7 8 4 112
110 1 2 7 8 112 113
111 1 2 7 8 113 114
112 1 2 7 8 114 115
113 1 2 7 8 115 116
114 1 2 7 8 116 117
115 1 2 7 8 117 118
116 1 2 7 8 118 1
117 1 2 6 9 3 119
118 1 2 6 9 119 120
119 1 2 6 9 120 121
120 1 2 6 9 121 122
121 1 2 6 9 122 123
122 1 2 6 9 123 124
123 1 2 6 9 124 125
124 1 2 6 9 125 126
125 1 2 6 9 126 127
126 1 2 6 9 127 5
127 1 2 8 10 5 128
128 1 2 8 10 128 129
129 1 2 8 10 129 130
130 1 2 8 10 130 131
131 1 2 8 10 131 132
132 1 2 8 10 132 133
133 1 2 8 10 133 134
134 1 2 8 10 134 6
135 1 2 4 11 6 135
136 1 2 4 11 135 136
137 1 2 4 11 136 137
138 1 2 4 11 137 138
139 1 2 4 11 138 139
140 1 2 4 11 139 140
141 1 2 4 11 140 141
142 1 2 4 11 141 142
143 1 2 4 11 142 143
144 1 2 4 11 143 2
145 3 2 1 6 1 7 144 118
146 3 2 1 6 118 144 145 117
147 3 2 1 6 117 145 146 116
148 3 2 1 6 116 146 147 115
149 3 2 1 6 115 147 148 114
150 3 2 1 6 114 148 149 113
151 3 2 1 6 113 149 150 112
152 3 2 1 6 112 150 111 4
153 3 2 1 6 7 8 151 144
154 3 2 1 6 144 151 152 145
155 3 2 1 6 145 152 153 146
156 3 2 1 6 146 153 154 147
157 3 2 1 6 147 154 155 148
158 3 2 1 6 148 155 156 149
159 3 2 1 6 149 156 157 150
160 3 2 1 6 150 157 110 111
161 3 2 1 6 8 9 158 151
162 3 2 1 6 151 158 159 152
163 3 2 1 6 152 159 160 153
164 3 2 1 6 153 160 161 154
165 3 2 1 6 154 161 162 155
166 3 2 1 6 155 162 163 156
167 3 2 1 6 156 163 164 157
168 3 2 1 6 157 164 109 110
169 3 2 1 6 9 10 165 158
170 3 2 1 6 158 165 166 159
171 3 2 1 6 159 166 167 160
172 3 2 1 6 160 167 168 161
173 3 2 1 6 161 168 169 162
174 3 2 1 6 162 169 170 163
175 3 2 1 6 163 170 171 164
176 3 2 1 6 164 171 108 109
177 3 2 1 6 10 11 172 165
178 3 2 1 6 165 172 173 166
179 3 2 1 6 166 173 174 167
180 3 2 1 6 167 174 175 168
181 3 2 1 6 168 175 176 169
182 3 2 1 6 169 176 177 170
183 3 2 1 6 170 177 178 171
184 3 2 1 6 171 178 107 108
185 3 2 1 6 11 12 179 172
186 3 2 1 6 172 179 180 173
187 3 2 1 6 173 180 181 174
188 3 2 1 6 174 181 182 175
189 3 2 1 6 175 182 183 176
190 3 2 1 6 176 183 184 177
191 3 2 1 6 177 184 185 178
192 3 2 1 6 178 185 106 107
193 3 2 1 6 12 13 186 179
194 3 2 1 6 179 186 187 180
195 3 2 1 6 180 187 188 181
196 3 2 1 6 181 188 189 182
197 3 2 1 6 182 189 190 183
198 3 2 1 6 183 190 191 184
199 3 2 1 6 184 191 192 185
200 3 2 1 6 185 192 105 106
201 3 2 1 6 13 14 193 186
202 3 2 1 6 186 193 194 187
203 3 2 1 6 187 194 195 188
204 3 2 1 6 188 195 196 189
205 3 2 1 6 189 196 197 190
206 3 2 1 6 190 197 198 191
207 3 2 1 6 191 198 199 192
208 3 2 1 6 192 199 104 105
209 3 2 1 6 14 15 200 193
210 3 2 1 6 193 200 201 194
211 3 2 1 6 194 201 202 195
212 3 2 1 6 195 202 203 196
213 3 2 1 6 196 203 204 197
214 3 2 1 6 197 204 205 198
215 3 2 1 6 198 205 206 199
216 3 2 1 6 199 206 103 104
217 3 2 1 6 15 16 207 200
218 3 2 1 6 200 207 208 201
219 3 2 1 6 201 208 209 202
220 3 2 1 6 202 209 210 203
221 3 2 1 6 203 210 211 204
222 3 2 1 6 204 211 212 205
223 3 2 1 6 205 212 213 206
224 3 2 1 6 206 213 102 103
225 3 2 1 6 16 17 214 207
226 3 2 1 6 207 214 215 208
227 3 2 1 6 208 215 216 209
228 3 2 1 6 209 216 217 210
229 3 2 1 6 210 217 218 211
230 3 2 1 6 211 218 219 212
231 3 2 1 6 212 219 220 213
232 3 2 1 6 213 220 101 102
233 3 2 1 6 17 18 221 214
234 3 2 1 6 214 221 222 215
235 3 2 1 6 215 222 223 216
236 3 2 1 6 216 223 224 217
237 3 2 1 6 217 224 225 218
238 3 2 1 6 218 225 226 219
239 3 2 1 6 219 226 227 220
240 3 2 1 6 220 227 100 101
241 3 2 1 6 18 19 228 221
242 3 2 1 6 221 228 229 222
243 3 2 1 6 222 229 230 223
244 3 2 1 6 223 230 231 224
245 3 2 1 6 224 231 232 225
246 3 2 1 6 225 232 233 226
247 3 2 1 6 226 233 234 227
248 3 2 1 6 227 234 99 100
249 3 2 1 6 19 20 235 228
250 3 2 1 6 228 235 236 229
251 3 2 1 6 229 236 237 230
252 3 2 1 6 230 237 238 231
253 3 2 1 6 231 238 239 232
254 3 2 1 6 232 239 240 233
255 3 2 1 6 233 240 241 234
256 3 2 1 6 234 241 98 99
257 3 2 1 6 20 21 242 235
258 3 2 1 6 235 242 243 236
259 3 2 1 6 236 243 244 237
260 3 2 1 6 237 244 245 238
261 3 2 1 6 238 245 246 239
262 3 2 1 6 239 246 247 240
263 3 2 1 6 240 247 248 241
264 3 2 1 6 241 248 97 98
265 3 2 1 6 21 22 249 242
266 3 2 1 6 242 249 250 243
267 3 2 1 6 243 250 251 244
268 3 2 1 6 244 251 252 245
269 3 2 1 6 245 252 253 246
270 3 2 1 6 246 253 254 247
271 3 2 1 6 247 254 255 248
272 3 2 1 6 248 255 96 97
273 3 2 1 6 22 23 256 249
274 3 2 1 6 249 256 257 250
275 3 2 1 6 250 257 258 251
276 3 2 1 6 251 258 259 252
277 3 2 1 6 252 259 260 253
278 3 2 1 6 253 260 261 254
279 3 2 1 6 254 261 262 255
280 3 2 1 6 255 262 95 96
281 3 2 1 6 23 24 263 256
282 3 2 1 6 256 263 264 257
283 3 2 1 6 257 264 265 258
284 3 2 1 6 258 265 266 259
285 3 2 1 6 259 266 267 260
286 3 2 1 6 260 267 268 261
287 3 2 1 6 261 268 269 262
288 3 2 1 6 262 269 94 95
289 3 2 1 6 24 25 270 263
290 3 2 1 6 263 270 271 264
291 3 2 1 6 264 271 272 265
292 3 2 1 6 265 272 273 266
293 3 2 1 6 266 273 274 267
294 3 2 1 6 267 274 275 268
295 3 2 1 6 268 275 276 269
296 3 2 1 6 269 276 93 94
297 3 2 1 6 25 26 277 270
298 3 2 1 6 270 277 278 271
299 3 2 1 6 271 278 279 272
300 3 2 1 6 272 279 280 273
301 3 2 1 6 273 280 281 274
302 3 2 1 6 274 281 282 275
303 3 2 1 6 275 282 283 276
304 3 2 1 6 276 283 92 93
305 3 2 1 6 26 27 284 277
306 3 2 1 6 277 284 285 278
307 3 2 1 6 278 285 286 279
308 3 2 1 6 279 286 287 280
309 3 2 1 6 280 287 288 281
310 3 2 1 6 281 288 289 282
311 3 2 1 6 282 289 290 283
312 3 2 1 6 283 290 91 92
313 3 2 1 6 27 28 291 284
314 3 2 1 6 284 291 292 285
315 3 2 1 6 285 292 293 286
316 3 2 1 6 286 293 294 287
317 3 2 1 6 287 294 295 288
318 3 2 1 6 288 295 296 289
319 3 2 1 6 289 296 297 290
320 3 2 1 6 290 297 90 91
321 3 2 1 6 28 29 298 291
322 3 2 1 6 291 298 299 292
323 3 2 1 6 292 299 300 293
324 3 2 1 6 293 300 301 294
325 3 2 1 6 294 301 302 295
326 3 2 1 6 295 302 303 296
327 3 2 1 6 296 303 304 297
328 3 2 1 6 297 304 89 90
329 3 2 1 6 29 30 305 298
330 3 2 1 6 298 305 306 299
331 3 2 1 6 299 306 307 300
332 3 2 1 6 300 307 308 301
333 3 2 1 6 301 308 309 302
334 3 2 1 6 302 309 310 303
335 3 2 1 6 303 310 311 304
336 3 2 1 6 304 311 88 89
337 3 2 1 6 30 31 312 305
338 3 2 1 6 305 312 313 306
339 3 2 1 6 306 313 314 307
340 3 2 1 6 307 314 315 308
341 3 2 1 6 308 315 316 309
342 3 2 1 6 309 316 317 310
343 3 2 1 6 310 317 318 311
344 3 2 1 6 311 318 87 88
345 3 2 1 6 31 32 319 312
346 3 2 1 6 312 319 320 313
347 3 2 1 6 313 320 321 314
348 3 2 1 6 314 321 322 315
349 3 2 1 6 315 322 323 316
350 3 2 1 6 316 323 324 317
351 3 2 1 6 317 324 325 318
352 3 2 1 6 318 325 86 87
353 3 2 1 6 32 33 326 319
354 3 2 1 6 319 326 327 320
355 3 2 1 6 320 327 328 321
356 3 2 1 6 321 328 329 322
357 3 2 1 6 322 329 330 323
358 3 2 1 6 323 330 331 324
359 3 2 1 6 324 331 332 325
360 3 2 1 6 325 332 85 86
361 3 2 1 6 33 34 333 326
362 3 2 1 6 326 333 334 327
363 3 2 1 6 327 334 335 328
364 3 2 1 6 328 335 336 329
365 3 2 1 6 329 336 337 330
366 3 2 1 6 330 337 338 331
367 3 2 1 6 331 338 339 332
368 3 2 1 6 332 339 84 85
369 3 2 1 6 34 35 340 333
370 3 2 1 6 333 340 341 334
371 3 2 1 6 334 341 342 335
372 3 2 1 6 335 342 343 336
373 3 2 1 6 336 343 344 337
374 3 2 1 6 337 344 345 338
375 3 2 1 6 338 345 346 339
376 3 2 1 6 339 346 83 84
377 3 2 1 6 35 36 347 340
378 3 2 1 6 340 347 348 341
379 3 2 1 6 341 348 349 342
380 3 2 1 6 342 349 350 343
381 3 2 1 6 343 350 351 344
382 3 2 1 6 344 351 352 345
383 3 2 1 6 345 352 353 346
384 3 2 1 6 346 353 82 83
385 3 2 1 6 36 37 354 347
386 3 2 1 6 347 354 355 348
387 3 2 1 6 348 355 356 349
388 3 2 1 6 349 356 357 350
389 3 2 1 6 350 357 358 351
390 3 2 1 6 351 358 359 352
391 3 2 1 6 352 359 360 353
392 3 2 1 6 353 360 81 82
393 3 2 1 6 37 38 361 354
394 3 2 1 6 354 361 362 355
395 3 2 1 6 355 362 363 356
396 3 2 1 6 356 363 364 357
397 3 2 1 6 357 364 365 358
398 3 2 1 6 358 365 366 359
399 3 2 1 6 359 366 367 360
400 3 2 1 6 360 367 80 81
401 3 2 1 6 38 39 368 361
402 3 2 1 6 361 368 369 362
403 3 2 1 6 362 369 370 363
404 3 2 1 6 363 370 371 364
405 3 2 1 6 364 371 372 365
406 3 2 1 6 365 372 373 366
407 3 2 1 6 366 373 374 367
408 3 2 1 6 367 374 79 80
409 3 2 1 6 39 40 375 368
410 3 2 1 6 368 375 376 369
411 3 2 1 6 369 376 377 370
412 3 2 1 6 370 377 378 371
413 3 2 1 6 371 378 379 372
414 3 2 1 6 372 379 380 373
415 3 2 1 6 373 380 381 374
416 3 2 1 6 374 381 78 79
417 3 2 1 6 40 41 382 375
418 3 2 1 6 375 382 383 376
419 3 2 1 6 376 383 384 377
420 3 2 1 6 377 384 385 378
421 3 2 1 6 378 385 386 379
422 3 2 1 6 379 386 387 380
423 3 2 1 6 380 387 388 381
424 3 2 1 6 381 388 77 78
425 3 2 1 6 41 42 389 382
426 3 2 1 6 382 389 390 383
427 3 2 1 6 383 390 391 384
428 3 2 1 6 384 391 392 385
429 3 2 1 6 385 392 393 386
430 3 2 1 6 386 393 394 387
431 3 2 1 6 387 394 395 388
432 3 2 1 6 388 395 76 77
433 3 2 1 6 42 43 396 389
434 3 2 1 6 389 396 397 390
435 3 2 1 6 390 397 398 391
436 3 2 1 6 391 398 399 392
437 3 2 1 6 392 399 400 393
438 3 2 1 6 393 400 401 394
439 3 2 1 6 394 401 402 395
440 3 2 1 6 395 402 75 76
441 3 2 1 6 43 44 403 396
442 3 2 1 6 396 403 404 397
443 3 2 1 6 397 404 405 398
444 3 2 1 6 398 405 406 399
445 3 2 1 6 399 406 407 400
446 3 2 1 6 400 407 408 401
447 3 2 1 6 401 408 409 402
448 3 2 1 6 402 409 74 75
449 3 2 1 6 44 45 410 403
450 3 2 1 6 403 410 411 404
451 3 2 1 6 404 411 412 405
452 3 2 1 6 405 412 413 406
453 3 2 1 6 406 413 414 407
454 3 2 1 6 407 414 415 408
455 3 2 1 6 408 415 416 409
456 3 2 1 6 409 416 73 74
457 3 2 1 6 45 46 417 410
458 3 2 1 6 410 417 418 411
459 3 2 1 6 411 418 419 412
460 3 2 1 6 412 419 420 413
461 3 2 1 6 413 420 421 414
462 3 2 1 6 414 421 422 415
463 3 2 1 6 415 422 423 416
464 3 2 1 6 416 423 72 73
465 3 2 1 6 46 47 424 417
466 3 2 1 6 417 424 425 418
467 3 2 1 6 418 425 426 419
468 3 2 1 6 419 426 427 420
469 3 2 1 6 420 427 428 421
470 3 2 1 6 421 428 429 422
471 3 2 1 6 422 429 430 423
472 3 2 1 6 423 430 71 72
473 3 2 1 6 47 48 431 424
474 3 2 1 6 424 431 432 425
475 3 2 1 6 425 432 433 426
476 3 2 1 6 426 433 434 427
477 3 2 1 6 427 434 435 428
478 3 2 1 6 428 435 436 429
479 3 2 1 6 429 436 437 430
480 3 2 1 6 430 437 70 71
481 3 2 1 6 48 49 438 431
482 3 2 1 6 431 438 439 432
483 3 2 1 6 432 439 440 433
484 3 2 1 6 433 440 441 434
485 3 2 1 6 434 441 442 435
486 3 2 1 6 435 442 443 436
487 3 2 1 6 436 443 444 437
488 3 2 1 6 437 444 69 70
489 3 2 1 6 49 50 445 438
490 3 2 1 6 438 445 446 439
491 3 2 1 6 439 446 447 440
492 3 2 1 6 440 447 448 441
493 3 2 1 6 441 448 449 442
494 3 2 1 6 442 449 450 443
495 3 2 1 6 443 450 451 444
496 3 2 1 6 444 451 68 69
497 3 2 1 6 50 51 452 445
498 3 2 1 6 445 452 453 446
499 3 2 1 6 446 453 454 447
500 3 2 1 6 447 454 455 448
501 3 2 1 6 448 455 456 449
502 3 2 1 6 449 456 457 450
503 3 2 1 6 450 457 458 451
504 3 2 1 6 451 458 67 68
505 3 2 1 6 51 52 459 452
506 3 2 1 6 452 459 460 453
507 3 2 1 6 453 460 461 454
508 3 2 1 6 454 461 462 455
509 3 2 1 6 455 462 463 456
510 3 2 1 6 456 463 464 457
511 3 2 1 6 457 464 465 458
512 3 2 1 6 458 465 66 67
513 3 2 1 6 52 53 466 459
514 3 2 1 6 459 466 467 460
515 3 2 1 6 460 467 468 461
516 3 2 1 6 461 468 469 462
517 3 2 1 6 462 469 470 463
518 3 2 1 6 463 470 471 464
519 3 2 1 6 464 471 472 465
520 3 2 1 6 465 472 65 66
521 3 2 1 6 53 54 473 466
522 3 2 1 6 466 473 474 467
523 3 2 1 6 467 474 475 468
524 3 2 1 6 468 475 476 469
525 3 2 1 6 469 476 477 470
526 3 2 1 6 470 477 478 471
527 3 2 1 6 471 478 479 472
528 3 2 1 6 472 479 64 65
529 3 2 1 6 54 55 480 473
530 3 2 1 6 473 480 481 474
531 3 2 1 6 474 481 482 475
532 3 2 1 6 475 482 483 476
533 3 2 1 6 476 483 484 477
534 3 2 1 6 477 484 485 478
535 3 2 1 6 478 485 486 479
536 3 2 1 6 479 486 63 64
537 3 2 1 6 55 2 56 480
538 3 2 1 6 480 56 57 481
539 3 2 1 6 481 57 58 482
540 3 2 1 6 482 58 59 483
541 3 2 1 6 483 59 60 484
542 3 2 1 6 484 60 61 485
543 3 2 1 6 485 61 62 486
544 3 2 1 6 486 62 3 63
545 3 2 2 8 3 119 487 62
546 3 2 2 8 62 487 488 61
547 3 2 2 8 61 488 489 60
548 3 2 2 8 60 489 490 59
549 3 2 2 8 59 490 491 58
550 3 2 2 8 58 491 492 57
551 3 2 2 8 57 492 493 56
552 3 2 2 8 56 493 143 2
553 3 2 2 8 119 120 494 487
554 3 2 2 8 487 494 495 488
555 3 2 2 8 488 495 496 489
556 3 2 2 8 489 496 497 490
557 3 2 2 8 490 497 498 491
558 3 2 2 8 491 498 499 492
559 3 2 2 8 492 499 500 493
560 3 2 2 8 493 500 142 143
561 3 2 2 8 120 121 501 494
562 3 2 2 8 494 501 502 495
563 3 2 2 8 495 502 503 496
564 3 2 2 8 496 503 504 497
565 3 2 2 8 497 504 505 498
566 3 2 2 8 498 505 506 499
567 3 2 2 8 499 506 507 500
568 3 2 2 8 500 507 141 142
569 3 2 2 8 121 122 508 501
570 3 2 2 8 501 508 509 502
571 3 2 2 8 502 509 510 503
572 3 2 2 8 503 510 511 504
573 3 2 2 8 504 511 512 505
574 3 2 2 8 505 512 513 506
575 3 2 2 8 506 513 514 507
576 3 2 2 8 507 514 140 141
577 3 2 2 8 122 123 515 508
578 3 2 2 8 508 515 516 509
579 3 2 2 8 509 516 517 510
580 3 2 2 8 510 517 518 511
581 3 2 2 8 511 518 519 512
582 3 2 2 8 512 519 520 513
583 3 2 2 8 513 520 521 514
584 3 2 2 8 514 521 139 140
585 3 2 2 8 123 124 522 515
586 3 2 2 8 515 522 523 516
587 3 2 2 8 516 523 524 517
588 3 2 2 8 517 524 525 518
589 3 2 2 8 518 525 526 519
590 3 2 2 8 519 526 527 520
591 3 2 2 8 520 527 528 521
592 3 2 2 8 521 528 138 139
593 3 2 2 8 124 125 529 522
594 3 2 2 8 522 529 530 523
595 3 2 2 8 523 530 531 524
596 3 2 2 8 524 531 532 525
597 3 2 2 8 525 532 533 526
598 3 2 2 8 526 533 534 527
599 3 2 2 8 527 534 535 528
600 3 2 2 8 528 535 137 138
601 3 2 2 8 125 126 536 529
602 3 2 2 8 529 536 537 530
603 3 2 2 8 530 537 538 531
604 3 2 2 8 531 538 539 532
605 3 2 2 8 532 539 540 533
606 3 2 2 8 533 540 541 534
607 3 2 2 8 534 541 542 535
608 3 2 2 8 535 542 136 137
609 3 2 2 8 126 127 543 536
610 3 2 2 8 536 543 544 537
611 3 2 2 8 537 544 545 538
612 3 2 2 8 538 545 546 539
613 3 2 2 8 539 546 547 540
614 3 2 2 8 540 547 548 541
615 3 2 2 8 541 548 549 542
616 3 2 2 8 542 549 135 136
617 3 2 2 8 127 5 128 543
618 3 2 2 8 543 128 129 544
619 3 2 2 8 544 129 130 545
620 3 2 2 8 545 130 131 546
621 3 2 2 8 546 131 132 547
622 3 2 2 8 547 132 133 548
623 3 2 2 8 548 133 134 549
624 3 2 2 8 549 134 6 135
$EndElements
