\relax 
\@input{preamble/coverpage.aux}
\@input{preamble/declaration.aux}
\@input{preamble/abstract.aux}
\@input{preamble/acknowledgements.aux}
\citation{Martin2001}
\citation{Smith1990}
\citation{Maqueda2004,Foldvik1988}
\citation{Maqueda2004}
\@writefile{toc}{\contentsline {chapter}{\numberline {1}Introduction to polynyas}{1}}
\@writefile{lof}{\addvspace {10\p@ }}
\@writefile{lot}{\addvspace {10\p@ }}
\citation{Leibovich1983}
\citation{Thorpe2004}
\citation{Thorpe2004}
\citation{Thorpe2004}
\citation{Arden1973}
\citation{Clark2004}
\citation{Clark2004}
\citation{Morse2009}
\@writefile{toc}{\contentsline {section}{\numberline {1.1}Frazil ice production}{2}}
\citation{Martin1981}
\citation{Martin1981}
\citation{Weeks2010}
\@writefile{lof}{\contentsline {figure}{\numberline {1.1}{\ignorespaces Deep convection cells which form perpendicular to the applied wind stress are shown schematically. From \cite  {Thorpe2004}.\relax }}{3}}
\providecommand*\caption@xref[2]{\@setref\relax\@undefined{#1}}
\newlabel{fig:Thorpeangmuir}{{1.1}{3}}
\@writefile{lof}{\contentsline {figure}{\numberline {1.2}{\ignorespaces Frazil crystals, from experiments by \cite  {Clark2004}. $D/t$ is an estimate of the aspect ratio of the crystal. The picture on the right shows a large mass of crystals which have formed a single floc.\relax }}{3}}
\newlabel{fig:ClarkDoeringfrazil}{{1.2}{3}}
\citation{Drucker2003}
\citation{Drucker2003}
\citation{Pease1987}
\@writefile{lof}{\contentsline {figure}{\numberline {1.3}{\ignorespaces Streamers of grease ice mark the boundaries of Langmuir cells, from \cite  {Martin1981}. The photograph shows an area 205m wide, and the wind is blowing from the upper left.\relax }}{4}}
\newlabel{fig:Weeksgrease}{{1.3}{4}}
\citation{Biggs2000}
\citation{Smedsrud2011}
\@writefile{lof}{\contentsline {figure}{\numberline {1.4}{\ignorespaces A composite image of the St. Lawrence Island polynya, from \cite  {Drucker2003}. The colours correspond to an estimate of ice thickness from reflectance measurements, the details and texture are from SAR data. St. Lawrence Island is in the top right of the picture, and the wind is blowing from the land towards the bottom left. Streaks of grease ice at Langmuir convergence zones can be seen in the strip of open water adjacent to the land, and thin consolidated ice makes up the rest of the image.\relax }}{5}}
\newlabel{fig:Druckerpolynya}{{1.4}{5}}
\citation{Carstens1966,Dethleff2007,Martin1981,Newyear1997,Smedsrud2001,Tsang1986}
\citation{Carstens1966,Ghobrial2009,Smedsrud2001,Tsang1986}
\citation{Daly1986}
\citation{DelaRosa2011,Martin1981,Smedsrud2001}
\citation{Ettema1984}
\citation{Hanley1977,Hanley1986}
\citation{Hanley1981}
\citation{Tsang1993,Clark2002,Clark2004,Clark2006,Clark2006a,Clark2008,Clark2009,Doering2003}
\citation{Daly1986}
\citation{Clark2002}
\@writefile{toc}{\contentsline {chapter}{\numberline {2}Review of past experimental work and field measurements}{7}}
\@writefile{lof}{\addvspace {10\p@ }}
\@writefile{lot}{\addvspace {10\p@ }}
\newlabel{chap:review}{{2}{7}}
\citation{Pegau1996}
\citation{Daly1986}
\citation{Daly1994}
\citation{Smedsrud2004}
\citation{Holland2004,Holland2005}
\@writefile{toc}{\contentsline {chapter}{\numberline {3}Mathematical modelling of frazil ice}{11}}
\@writefile{lof}{\addvspace {10\p@ }}
\@writefile{lot}{\addvspace {10\p@ }}
\@writefile{toc}{\contentsline {section}{\numberline {3.1}Introduction to modelling}{11}}
\@writefile{toc}{\contentsline {section}{\numberline {3.2}Model components}{13}}
\@writefile{lof}{\contentsline {figure}{\numberline {3.1}{\ignorespaces Schematic of the model domain.\relax }}{13}}
\newlabel{fig:domainschematic}{{3.1}{13}}
\newlabel{eq:n}{{3.1}{14}}
\newlabel{eq:volumefraction}{{3.2}{14}}
\@writefile{toc}{\contentsline {section}{\numberline {3.3}Crystal growth and rise}{14}}
\@writefile{toc}{\contentsline {subsection}{\numberline {3.3.1}Growth}{14}}
\newlabel{sec:Growth}{{3.3.1}{14}}
\newlabel{eq:diffusionproblem}{{3.3}{14}}
\newlabel{eq:rawgrowth}{{3.4}{14}}
\newlabel{eq:Stefancondition}{{3.5}{14}}
\citation{Richard2011}
\citation{Abraham1970}
\citation{Richard2011}
\citation{Abraham1970}
\citation{Richard2011}
\newlabel{eq:adot}{{3.7}{15}}
\newlabel{eq:adotvolume}{{3.8}{15}}
\@writefile{toc}{\contentsline {subsection}{\numberline {3.3.2}Buoyant rise}{15}}
\@writefile{lof}{\contentsline {figure}{\numberline {3.2}{\ignorespaces Experimental data and various models for frazil rise velocity from \cite  {Richard2011}. The models are calculated based on a diameter/thickness ratio of 15. The last three models are based on a relationship suggested by \cite  {Abraham1970}, with parameter values produced by Richard.\relax }}{16}}
\newlabel{fig:RichardUplot}{{3.2}{16}}
\newlabel{eq:Stokesfirst}{{3.9}{16}}
\@writefile{toc}{\contentsline {subsection}{\numberline {3.3.3}Single crystal rising and growing in a fixed temperature field}{17}}
\newlabel{sec:maxsize}{{3.3.3}{17}}
\newlabel{eq:rmaxeq}{{3.13}{17}}
\@writefile{lof}{\contentsline {figure}{\numberline {3.3}{\ignorespaces Typical observed supercoolings are $\theta = 0.001-0.02 ^\circ C$, and domain depths range from tens of metres (eg in a strongly mixed ocean) to a few centimetres (eg in shallow experimental tanks), so that the ``degree-metres'' of supercooling that a rising crystal might experience are covered by the three curves above.\relax }}{18}}
\newlabel{fig:rmax}{{3.3}{18}}
\citation{Daly1984}
\@writefile{toc}{\contentsline {subsection}{\numberline {3.3.4}Crystal distribution equation}{19}}
\@writefile{lof}{\contentsline {figure}{\numberline {3.4}{\ignorespaces Fluxes of crystals in depth and radius space.\relax }}{19}}
\newlabel{fig:domain}{{3.4}{19}}
\newlabel{eq:dnrbasic}{{3.15}{19}}
\newlabel{eq:dndt}{{3.16}{20}}
\newlabel{eq:Pdistribution}{{3.19}{20}}
\newlabel{eq:Nucleationcondition}{{3.20}{20}}
\@writefile{toc}{\contentsline {section}{\numberline {3.4}Temperature equation}{21}}
\@writefile{lof}{\contentsline {figure}{\numberline {3.5}{\ignorespaces Fluxes of heat due to advection and diffusion, and latent heat released in crystal growth.\relax }}{21}}
\newlabel{fig:temperatureflux}{{3.5}{21}}
\newlabel{eq:enthalpy}{{3.21}{21}}
\newlabel{eq:Vdef}{{3.22}{21}}
\newlabel{eq:phitdef}{{3.23}{21}}
\newlabel{eq:temperature}{{3.24}{22}}
\newlabel{eq:heat}{{3.28}{22}}
\newlabel{eq:Ptemperature}{{3.29}{22}}
\@writefile{toc}{\contentsline {section}{\numberline {3.5}Boundary and initial conditions}{22}}
\@writefile{lof}{\contentsline {figure}{\numberline {3.6}{\ignorespaces Fluxes of heat at the surface\relax }}{23}}
\newlabel{fig:surfacefluxes}{{3.6}{23}}
\newlabel{eq:thetabc}{{3.30}{23}}
\newlabel{eq:Zmconditions}{{3.31}{23}}
\citation{Daly1994}
\citation{Osterkamp1989}
\citation{Osterkamp1977}
\citation{Lal1969,Garabedian1974}
\citation{Daly1984,Daly1994}
\citation{Garabedian1972,Garabedian1974,Evans1974,Evans1974a}
\@writefile{toc}{\contentsline {section}{\numberline {3.6}Nucleation}{24}}
\newlabel{sec:nucleation}{{3.6}{24}}
\citation{Daly1984}
\@writefile{toc}{\contentsline {section}{\numberline {3.7}Non-dimensional governing equations}{26}}
\newlabel{eq:dimensionlessP}{{3.37}{27}}
\newlabel{eq:dimensionlesstheta}{{3.38}{27}}
\newlabel{eq:BCs}{{3.40}{27}}
\newlabel{eq:tdef}{{3.41}{28}}
\newlabel{eq:ctdef}{{3.46}{28}}
\@writefile{toc}{\contentsline {chapter}{\numberline {4}Numerical methods}{29}}
\@writefile{lof}{\addvspace {10\p@ }}
\@writefile{lot}{\addvspace {10\p@ }}
\newlabel{eq:stepfunction}{{4.1}{29}}
\citation{Daly1989}
\@writefile{toc}{\contentsline {chapter}{\numberline {5}Results}{33}}
\@writefile{lof}{\addvspace {10\p@ }}
\@writefile{lot}{\addvspace {10\p@ }}
\@writefile{toc}{\contentsline {section}{\numberline {5.1}Numerical solutions and comparison with experimental results}{33}}
\newlabel{sec:Numerics}{{5.1}{33}}
\citation{Clark2004}
\citation{Clark2004}
\@writefile{lot}{\contentsline {table}{\numberline {5.1}{\ignorespaces Collated data from some frazil-producing experiments. Figures in plain type are taken directly from the description of the experiment, figures in italic were estimated from the available data, and the figures in bold were fitted to known results of the experiments. When estimates of dimensional quantities are needed elsewhere in this work without reference to a specific experiment, the data from \cite  {Clark2004} is used.\relax }}{34}}
\newlabel{table:expdata}{{5.1}{34}}
\citation{Clark2009}
\citation{Clark2009}
\@writefile{lof}{\contentsline {figure}{\numberline {5.1}{\ignorespaces A schematic of the apparatus used in Manitoba, from \cite  {Clark2009}.\relax }}{35}}
\newlabel{fig:CD09diagram}{{5.1}{35}}
\citation{Clark2009}
\citation{Clark2009}
\citation{Clark2009}
\@writefile{toc}{\contentsline {subsection}{\numberline {5.1.1}Clark \& Doering (2009)}{36}}
\@writefile{lof}{\contentsline {figure}{\numberline {5.2}{\ignorespaces Cooling curve from \cite  {Clark2009}. The squares and circles represent counts of large particles, made as part of a study of flocculation.\relax }}{36}}
\newlabel{fig:CD09coolinge}{{5.2}{36}}
\@writefile{lof}{\contentsline {figure}{\numberline {5.3}{\ignorespaces Numerical output from my model, with $b$ calibrated to match time until maximum supercooling.\relax }}{36}}
\newlabel{fig:CD09coolingm}{{5.3}{36}}
\@writefile{lof}{\contentsline {figure}{\numberline {5.4}{\ignorespaces Depth-averaged ice production rate corresponding to cooling curve of figure 5.3\hbox {}.\relax }}{37}}
\newlabel{fig:CD09phi}{{5.4}{37}}
\citation{Holland2005}
\@writefile{lof}{\contentsline {figure}{\numberline {5.5}{\ignorespaces Number of particles seen throughout the depth of the tank.\relax }}{38}}
\newlabel{fig:CD09nte}{{5.5}{38}}
\@writefile{lof}{\contentsline {figure}{\numberline {5.6}{\ignorespaces Depth-averaged number density from model, using same parameter values as in figure 5.3\hbox {}.\relax }}{38}}
\newlabel{fig:CD09ntm}{{5.6}{38}}
\citation{Clark2009}
\citation{Clark2004}
\citation{Clark2004}
\citation{Clark2004}
\@writefile{toc}{\contentsline {subsection}{\numberline {5.1.2}Clark \& Doering (2004)}{40}}
\@writefile{lof}{\contentsline {figure}{\numberline {5.7}{\ignorespaces Cooling curves from \cite  {Clark2004}. We consider only experiment 3, the curve which reaches the largest supercooling.\relax }}{41}}
\newlabel{fig:CD04coolinge}{{5.7}{41}}
\@writefile{lof}{\contentsline {figure}{\numberline {5.8}{\ignorespaces Numerical output, with $b$ calibrated so that time until maximum supercooling matches the experiment.\relax }}{41}}
\newlabel{fig:CD04coolingm}{{5.8}{41}}
\citation{Daly1986}
\citation{Daly1986}
\citation{Daly1986}
\@writefile{lof}{\contentsline {figure}{\numberline {5.9}{\ignorespaces Particle distribution throughout depth of tank when steady state has been reached. Red line is fitted log-normal curve.\relax }}{42}}
\newlabel{fig:CD04nre}{{5.9}{42}}
\@writefile{lof}{\contentsline {figure}{\numberline {5.10}{\ignorespaces Depth-averaged size distribution from model, using same parameter values as in figure 5.8\hbox {}.\relax }}{42}}
\newlabel{fig:CD04nrm}{{5.10}{42}}
\@writefile{toc}{\contentsline {subsection}{\numberline {5.1.3}Daly \& Colbeck (1986)}{42}}
\@writefile{lof}{\contentsline {figure}{\numberline {5.11}{\ignorespaces Representative data from the experiments of \cite  {Daly1986}. The left-hand axis is relative frequency in \%, the dashed curve is a fitted log-normal.\relax }}{43}}
\newlabel{fig:DC86nr}{{5.11}{43}}
\@writefile{lof}{\contentsline {figure}{\numberline {5.12}{\ignorespaces Numerical output, calibrated based on $n$.\relax }}{43}}
\newlabel{fig:DC86modelnr}{{5.12}{43}}
\@writefile{toc}{\contentsline {subsection}{\numberline {5.1.4}Differences between model and experiment}{43}}
\newlabel{sec:modelexpdiff}{{5.1.4}{43}}
\newlabel{eq:steadyheat}{{5.5}{43}}
\citation{Clark2004}
\@writefile{toc}{\contentsline {section}{\numberline {5.2}Steady solutions without crystal diffusion}{45}}
\newlabel{sec:simplest}{{5.2}{45}}
\newlabel{eq:crystalintegral}{{5.10}{46}}
\newlabel{eq:chars}{{5.11}{46}}
\newlabel{eq:KIzeronr}{{5.15}{47}}
\newlabel{eq:ThODE}{{5.17}{47}}
\@writefile{lof}{\contentsline {figure}{\numberline {5.13}{\ignorespaces $\theta (z)$ \relax }}{48}}
\newlabel{fig:thetaz}{{5.13}{48}}
\@writefile{lof}{\contentsline {figure}{\numberline {5.14}{\ignorespaces $\phi (z)$\relax }}{48}}
\newlabel{fig:phiz}{{5.14}{48}}
\@writefile{lof}{\contentsline {figure}{\numberline {5.15}{\ignorespaces $r_m(z)$\relax }}{48}}
\newlabel{fig:rmz}{{5.15}{48}}
\newlabel{eq:rmKIzero}{{5.21}{48}}
\newlabel{eq:thetabarKIzero}{{5.22}{48}}
\@writefile{lof}{\contentsline {figure}{\numberline {5.16}{\ignorespaces $\theta (z)$ for various $z_m$.\relax }}{49}}
\newlabel{fig:KIzeroFAfixed}{{5.16}{49}}
\@writefile{lof}{\contentsline {figure}{\numberline {5.17}{\ignorespaces $\theta (z)$ for various $K$; $Z_m$ ranges from 0.125 to 4.\relax }}{49}}
\newlabel{fig:KIzerozmfixed}{{5.17}{49}}
\@writefile{lof}{\contentsline {figure}{\numberline {5.18}{\ignorespaces Depth-averaged $P=N_R/R$, a measure of the size distribution, against $R$. At low $Z_m$ the curve is a quartic, $1-cR^4$, and as $Z_m$ increases the curves move to the left as a smaller proportion of crystals reach the maximum size.\relax }}{50}}
\newlabel{fig:KIzeroPplotsR}{{5.18}{50}}
\@writefile{toc}{\contentsline {section}{\numberline {5.3}Vertically uniform approximation}{51}}
\newlabel{sec:verticalintegration}{{5.3}{51}}
\newlabel{eq:depthE}{{5.27}{52}}
\newlabel{eq:depthP}{{5.28}{52}}
\@writefile{toc}{\contentsline {subsection}{\numberline {5.3.1}Steady solution}{52}}
\newlabel{eq:nrquartic}{{5.31}{52}}
\@writefile{lof}{\contentsline {figure}{\numberline {5.19}{\ignorespaces Number densities in steady state, for various values of $Z_m$ in the model with no mixing of particles, and for the well-mixed model. The largest values of $Z_m$ produce the smallest depth-averaged $n_r$ and have the smallest modal radius.\relax }}{53}}
\newlabel{fig:simplenr}{{5.19}{53}}
\@writefile{toc}{\contentsline {subsection}{\numberline {5.3.2}Transients}{54}}
\newlabel{sec:transients}{{5.3.2}{54}}
\@writefile{lof}{\contentsline {figure}{\numberline {5.20}{\ignorespaces Supercooling and number density of particles, plotted against time in minutes, for various values of the parameter $Z_m c_t$. The supercooling axes are on the left of each plot in $^\circ C$ and are set with zero supercooling at the top (so the supercooling curves begin in the top left of each plot). The number density axes are on the right in m$^{-3}$.\relax }}{57}}
\newlabel{fig:depthmany}{{5.20}{57}}
\@writefile{toc}{\contentsline {chapter}{\numberline {6}Conclusions}{59}}
\@writefile{lof}{\addvspace {10\p@ }}
\@writefile{lot}{\addvspace {10\p@ }}
\citation{Daly1984}
\citation{Daly1984}
\citation{Clark2006a}
\@writefile{lof}{\contentsline {figure}{\numberline {6.1}{\ignorespaces ``Typical supercooling sequence'' from \cite  {Daly1984}.\relax }}{60}}
\newlabel{fig:Dalysupercooling}{{6.1}{60}}
\citation{Daly1984}
\citation{Svensson1994}
\citation{Daly1994}
\citation{Daly1994}
\@writefile{toc}{\contentsline {chapter}{\numberline {A}Discussion of approximations made in the modelling, and some simple extensions}{63}}
\@writefile{lof}{\addvspace {10\p@ }}
\@writefile{lot}{\addvspace {10\p@ }}
\@writefile{toc}{\contentsline {section}{\numberline {A.1}Crystal growth}{63}}
\@writefile{lof}{\contentsline {figure}{\numberline {A.1}{\ignorespaces The unit cell of an ice lattice. From \cite  {Daly1994}.\relax }}{64}}
\newlabel{fig:icecell}{{A.1}{64}}
\citation{Omstedt1984}
\citation{Wadia1974}
\citation{Daly1984}
\citation{Daly1984}
\citation{Daly1984}
\citation{Ray1936}
\@writefile{toc}{\contentsline {section}{\numberline {A.2}Buoyant rise}{66}}
\citation{Clark2006a}
\citation{Richard2011}
\@writefile{lof}{\contentsline {figure}{\numberline {A.2}{\ignorespaces Simple models for terminal rise velocity of disc crystals of an unspecified aspect ratio. In the Stokes range, $U\propto r^2$; in the intermediate range $U\propto r^{1.14}$; in the turbulent range $U\propto r^{1/2}$. From \cite  {Daly1984}.\relax }}{67}}
\newlabel{fig:Daly84buoyantrise}{{A.2}{67}}
\newlabel{eq:reducedU}{{A.6}{67}}
\@writefile{toc}{\contentsline {subsection}{\numberline {A.2.1}Maximum crystal size with alternative models for rise velocity}{68}}
\bibstyle{jfm}
\bibdata{Polynyas}
\bibcite{Abraham1970}{{1}{1970}{{Abraham}}{{}}}
\bibcite{Arden1973}{{2}{1973}{{Arden \& Wigle}}{{}}}
\bibcite{Biggs2000}{{3}{2000}{{Biggs {\em  et~al.\/}}}{{Biggs, Maqueda \& Willmott}}}
\bibcite{Carstens1966}{{4}{1966}{{Carstens}}{{}}}
\bibcite{Clark2002}{{5}{2002}{{Clark \& Doering}}{{}}}
\bibcite{Clark2004}{{6}{2004}{{Clark \& Doering}}{{}}}
\bibcite{Clark2006}{{7}{2006{{\em  a\/}}}{{Clark \& Doering}}{{}}}
\bibcite{Clark2006a}{{8}{2006{{\em  b\/}}}{{Clark \& Doering}}{{}}}
\bibcite{Clark2008}{{9}{2008}{{Clark \& Doering}}{{}}}
\bibcite{Clark2009}{{10}{2009}{{Clark \& Doering}}{{}}}
\bibcite{Daly1984}{{11}{1984}{{Daly}}{{}}}
\bibcite{Daly1994}{{12}{1994}{{Daly}}{{}}}
\bibcite{Daly1986}{{13}{1986}{{Daly \& Colbeck}}{{}}}
\bibcite{Daly1989}{{14}{1989}{{Daly \& Axelson}}{{}}}
\bibcite{DelaRosa2011}{{15}{2012}{{{De la Rosa} \& Maus}}{{}}}
\bibcite{Dethleff2007}{{16}{2007}{{Dethleff \& Kempema}}{{}}}
\bibcite{Doering2003}{{17}{2003}{{Doering \& Morris}}{{}}}
\bibcite{Drucker2003}{{18}{2003}{{Drucker {\em  et~al.\/}}}{{Drucker, Martin \& Moritz}}}
\bibcite{Ettema1984}{{19}{1984}{{Ettema {\em  et~al.\/}}}{{Ettema, Karim \& Kennedy}}}
\bibcite{Evans1974}{{20}{1974{{\em  a\/}}}{{Evans {\em  et~al.\/}}}{{Evans, Margolis \& Sarofim}}}
\bibcite{Evans1974a}{{21}{1974{{\em  b\/}}}{{Evans {\em  et~al.\/}}}{{Evans, Sarofim \& Margolis}}}
\bibcite{Foldvik1988}{{22}{1988}{{Foldvik \& Gammelsr\o {}d}}{{}}}
\bibcite{Garabedian1972}{{23}{1972}{{Garabedian \& Strickland-Constable}}{{}}}
\bibcite{Garabedian1974}{{24}{1974}{{Garabedian \& Strickland-Constable}}{{}}}
\bibcite{Ghobrial2009}{{25}{2009}{{Ghobrial {\em  et~al.\/}}}{{Ghobrial, Loewen \& Hicks}}}
\bibcite{Osterkamp1989}{{26}{1989}{{Gosink \& Osterkamp}}{{}}}
\bibcite{Hanley1986}{{27}{1986}{{Hanley}}{{}}}
\bibcite{Hanley1977}{{28}{1977}{{Hanley \& Michel}}{{}}}
\bibcite{Hanley1981}{{29}{1981}{{Hanley \& Rao}}{{}}}
\bibcite{Holland2004}{{30}{2004}{{Holland \& Feltham}}{{}}}
\bibcite{Holland2005}{{31}{2005}{{Holland \& Feltham}}{{}}}
\bibcite{Lal1969}{{32}{1969}{{Lal {\em  et~al.\/}}}{{Lal, Mason \& Strickland-Constable}}}
\bibcite{Leibovich1983}{{33}{1983}{{Leibovich}}{{}}}
\bibcite{Maqueda2004}{{34}{2004}{{Maqueda {\em  et~al.\/}}}{{Maqueda, Willmott \& Biggs}}}
\bibcite{Martin1981}{{35}{1981}{{Martin}}{{}}}
\bibcite{Martin2001}{{36}{2001}{{Martin}}{{}}}
\bibcite{Morse2009}{{37}{2009}{{Morse \& Richard}}{{}}}
\bibcite{Newyear1997}{{38}{1997}{{Newyear \& Martin}}{{}}}
\bibcite{Omstedt1984}{{39}{1984}{{Omstedt \& Svensson}}{{}}}
\bibcite{Osterkamp1977}{{40}{1977}{{Osterkamp}}{{}}}
\bibcite{Pease1987}{{41}{1987}{{Pease}}{{}}}
\bibcite{Pegau1996}{{42}{1996}{{Pegau {\em  et~al.\/}}}{{Pegau, Paulson \& Zaneveld}}}
\bibcite{Ray1936}{{43}{1936}{{Ray}}{{}}}
\bibcite{Richard2011}{{44}{2011}{{Richard}}{{}}}
\bibcite{Smedsrud2001}{{45}{2001}{{Smedsrud}}{{}}}
\bibcite{Smedsrud2004}{{46}{2004}{{Smedsrud}}{{}}}
\bibcite{Smedsrud2011}{{47}{2011}{{Smedsrud}}{{}}}
\bibcite{Smith1990}{{48}{1990}{{Smith {\em  et~al.\/}}}{{Smith, Muench \& Pease}}}
\bibcite{Svensson1994}{{49}{1994}{{Svensson \& Omstedt}}{{}}}
\bibcite{Thorpe2004}{{50}{2004}{{Thorpe}}{{}}}
\bibcite{Tsang1986}{{51}{1986}{{Tsang}}{{}}}
\bibcite{Tsang1993}{{52}{1993}{{Tsang}}{{}}}
\bibcite{Wadia1974}{{53}{1974}{{Wadia}}{{}}}
\bibcite{Weeks2010}{{54}{2010}{{Weeks \& Hibler~III}}{{}}}
