Id,Prediction
0,negative
1,negative
2,neutral
3,negative
4,positive
5,negative
6,negative
7,negative
8,negative
9,neutral
10,neutral
11,negative
12,negative
13,negative
14,negative
15,positive
16,negative
17,negative
18,negative
19,positive
20,neutral
21,neutral
22,negative
23,negative
24,negative
25,negative
26,positive
27,positive
28,negative
29,negative
30,negative
31,negative
32,negative
33,negative
34,negative
35,positive
36,neutral
37,negative
38,negative
39,negative
40,neutral
41,negative
42,neutral
43,positive
44,negative
45,negative
46,positive
47,negative
48,negative
49,positive
50,negative
51,negative
52,negative
53,neutral
54,negative
55,negative
56,negative
57,neutral
58,negative
59,negative
60,negative
61,neutral
62,negative
63,negative
64,negative
65,negative
66,negative
67,positive
68,negative
69,negative
70,negative
71,positive
72,negative
73,negative
74,negative
75,neutral
76,negative
77,negative
78,negative
79,neutral
80,negative
81,neutral
82,negative
83,negative
84,positive
85,negative
86,negative
87,negative
88,negative
89,neutral
90,negative
91,negative
92,neutral
93,negative
94,negative
95,negative
96,positive
97,neutral
98,neutral
99,negative
100,negative
101,negative
102,negative
103,negative
104,negative
105,negative
106,negative
107,negative
108,negative
109,negative
110,negative
111,negative
112,positive
113,negative
114,negative
115,positive
116,negative
117,negative
118,negative
119,negative
120,negative
121,negative
122,positive
123,positive
124,negative
125,neutral
126,negative
127,neutral
128,negative
129,positive
130,negative
131,negative
132,positive
133,negative
134,positive
135,negative
136,negative
137,negative
138,negative
139,negative
140,negative
141,negative
142,negative
143,negative
144,negative
145,neutral
146,neutral
147,negative
148,neutral
149,negative
150,negative
151,negative
152,neutral
153,neutral
154,negative
155,negative
156,negative
157,negative
158,positive
159,negative
160,negative
161,positive
162,neutral
163,negative
164,negative
165,negative
166,positive
167,negative
168,negative
169,negative
170,negative
171,negative
172,negative
173,negative
174,negative
175,negative
176,positive
177,negative
178,negative
179,neutral
180,neutral
181,positive
182,negative
183,negative
184,negative
185,neutral
186,negative
187,neutral
188,negative
189,negative
190,negative
191,neutral
192,negative
193,neutral
194,negative
195,positive
196,negative
197,negative
198,positive
199,negative
200,negative
201,negative
202,negative
203,negative
204,negative
205,negative
206,positive
207,negative
208,negative
209,negative
210,negative
211,neutral
212,negative
213,negative
214,negative
215,neutral
216,negative
217,neutral
218,positive
219,negative
220,negative
221,neutral
222,neutral
223,neutral
224,neutral
225,negative
226,negative
227,negative
228,neutral
229,negative
230,positive
231,positive
232,negative
233,negative
234,negative
235,negative
236,positive
237,neutral
238,negative
239,positive
240,neutral
241,neutral
242,positive
243,negative
244,neutral
245,negative
246,negative
247,negative
248,positive
249,negative
250,negative
251,negative
252,negative
253,negative
254,positive
255,negative
256,negative
257,negative
258,negative
259,negative
260,neutral
261,positive
262,negative
263,negative
264,negative
265,negative
266,negative
267,negative
268,negative
269,positive
270,negative
271,negative
272,positive
273,negative
274,neutral
275,negative
276,positive
277,neutral
278,negative
279,negative
280,neutral
281,neutral
282,neutral
283,negative
284,neutral
285,positive
286,negative
287,positive
288,neutral
289,positive
290,negative
291,negative
292,neutral
293,neutral
294,neutral
295,neutral
296,negative
297,negative
298,negative
299,negative
300,negative
301,neutral
302,neutral
303,negative
304,negative
305,negative
306,negative
307,positive
308,negative
309,negative
310,negative
311,neutral
312,negative
313,negative
314,negative
315,neutral
316,negative
317,negative
318,negative
319,neutral
320,negative
321,positive
322,negative
323,negative
324,neutral
325,negative
326,negative
327,negative
328,neutral
329,neutral
330,neutral
331,negative
332,negative
333,negative
334,positive
335,neutral
336,negative
337,negative
338,negative
339,negative
340,negative
341,negative
342,negative
343,positive
344,neutral
345,negative
346,negative
347,positive
348,negative
349,negative
350,negative
351,negative
352,negative
353,neutral
354,negative
355,positive
356,negative
357,negative
358,neutral
359,negative
360,neutral
361,negative
362,negative
363,neutral
364,negative
365,negative
366,negative
367,neutral
368,negative
369,negative
370,negative
371,negative
372,negative
373,negative
374,negative
375,neutral
376,negative
377,positive
378,negative
379,negative
380,negative
381,negative
382,negative
383,negative
384,negative
385,negative
386,positive
387,negative
388,negative
389,neutral
390,negative
391,negative
392,negative
393,neutral
394,positive
395,positive
396,negative
397,negative
398,negative
399,positive
400,negative
401,positive
402,negative
403,negative
404,negative
405,positive
406,negative
407,negative
408,neutral
409,negative
410,negative
411,neutral
412,negative
413,negative
414,neutral
415,positive
416,neutral
417,negative
418,negative
419,negative
420,negative
421,negative
422,neutral
423,negative
424,negative
425,negative
426,negative
427,positive
428,negative
429,negative
430,negative
431,negative
432,negative
433,positive
434,negative
435,negative
436,neutral
437,negative
438,neutral
439,negative
440,negative
441,negative
442,negative
443,negative
444,negative
445,neutral
446,negative
447,neutral
448,negative
449,negative
450,neutral
451,negative
452,negative
453,neutral
454,positive
455,negative
456,neutral
457,negative
458,negative
459,negative
460,negative
461,neutral
462,negative
463,negative
464,neutral
465,negative
466,negative
467,negative
468,neutral
469,neutral
470,negative
471,negative
472,negative
473,negative
474,neutral
475,negative
476,neutral
477,positive
478,negative
479,positive
480,negative
481,negative
482,negative
483,negative
484,negative
485,negative
486,neutral
487,positive
488,negative
489,neutral
490,negative
491,negative
492,negative
493,negative
494,negative
495,negative
496,negative
497,negative
498,negative
499,negative
500,negative
501,negative
502,negative
503,negative
504,negative
505,neutral
506,negative
507,negative
508,positive
509,negative
510,neutral
511,negative
512,negative
513,negative
514,negative
515,negative
516,negative
517,negative
518,neutral
519,negative
520,negative
521,negative
522,positive
523,negative
524,negative
525,positive
526,positive
527,negative
528,negative
529,neutral
530,negative
531,neutral
532,negative
533,negative
534,neutral
535,negative
536,negative
537,negative
538,positive
539,negative
540,neutral
541,negative
542,negative
543,negative
544,positive
545,negative
546,negative
547,negative
548,negative
549,negative
550,negative
551,negative
552,negative
553,negative
554,neutral
555,neutral
556,neutral
557,negative
558,negative
559,negative
560,negative
561,negative
562,negative
563,negative
564,positive
565,negative
566,negative
567,negative
568,negative
569,neutral
570,negative
571,negative
572,neutral
573,negative
574,negative
575,negative
576,negative
577,negative
578,neutral
579,neutral
580,positive
581,negative
582,negative
583,negative
584,negative
585,positive
586,negative
587,negative
588,negative
589,negative
590,neutral
591,negative
592,neutral
593,positive
594,negative
595,negative
596,neutral
597,negative
598,negative
599,positive
600,neutral
601,positive
602,negative
603,positive
604,negative
605,negative
606,negative
607,neutral
608,positive
609,neutral
610,negative
611,negative
612,positive
613,neutral
614,negative
615,negative
616,negative
617,neutral
618,negative
619,negative
620,negative
621,neutral
622,negative
623,negative
624,negative
625,neutral
626,neutral
627,positive
628,neutral
629,negative
630,neutral
631,negative
632,negative
633,negative
634,negative
635,negative
636,neutral
637,negative
638,negative
639,negative
640,neutral
641,negative
642,neutral
643,negative
644,negative
645,neutral
646,neutral
647,negative
648,negative
649,negative
650,negative
651,negative
652,negative
653,negative
654,positive
655,negative
656,neutral
657,negative
658,negative
659,neutral
660,negative
661,positive
662,negative
663,positive
664,negative
665,positive
666,negative
667,neutral
668,negative
669,neutral
670,negative
671,neutral
672,neutral
673,negative
674,negative
675,negative
676,negative
677,negative
678,negative
679,positive
680,neutral
681,negative
682,negative
683,negative
684,neutral
685,negative
686,negative
687,neutral
688,negative
689,negative
690,neutral
691,negative
692,negative
693,positive
694,negative
695,neutral
696,negative
697,neutral
698,neutral
699,negative
700,negative
701,negative
702,negative
703,negative
704,negative
705,negative
706,negative
707,negative
708,negative
709,negative
710,negative
711,negative
712,neutral
713,neutral
714,negative
715,negative
716,negative
717,negative
718,negative
719,negative
720,positive
721,negative
722,positive
723,neutral
724,negative
725,negative
726,neutral
727,negative
728,negative
729,negative
730,negative
731,positive
732,neutral
733,negative
734,negative
735,negative
736,negative
737,positive
738,negative
739,neutral
740,negative
741,negative
742,neutral
743,neutral
744,negative
745,positive
746,neutral
747,negative
748,negative
749,negative
750,negative
751,neutral
752,negative
753,negative
754,negative
755,positive
756,negative
757,negative
758,negative
759,positive
760,negative
761,negative
762,neutral
763,neutral
764,positive
765,positive
766,negative
767,negative
768,negative
769,positive
770,negative
771,positive
772,positive
773,positive
774,negative
775,negative
776,negative
777,positive
778,negative
779,negative
780,negative
781,negative
782,negative
783,negative
784,negative
785,neutral
786,negative
787,negative
788,negative
789,neutral
790,negative
791,negative
792,neutral
793,negative
794,negative
795,negative
796,neutral
797,positive
798,negative
799,neutral
800,neutral
801,negative
802,negative
803,positive
804,neutral
805,negative
806,negative
807,negative
808,negative
809,negative
810,negative
811,negative
812,neutral
813,negative
814,positive
815,negative
816,negative
817,negative
818,positive
819,negative
820,negative
821,negative
822,negative
823,negative
824,neutral
825,negative
826,negative
827,negative
828,negative
829,negative
830,negative
831,positive
832,negative
833,negative
834,negative
835,neutral
836,negative
837,negative
838,negative
839,positive
840,negative
841,negative
842,neutral
843,negative
844,positive
845,negative
846,negative
847,negative
848,negative
849,neutral
850,neutral
851,negative
852,neutral
853,neutral
854,negative
855,negative
856,negative
857,positive
858,negative
859,neutral
860,negative
861,negative
862,negative
863,negative
864,negative
865,neutral
866,negative
867,negative
868,negative
869,neutral
870,negative
871,negative
872,negative
873,neutral
874,neutral
875,negative
876,positive
877,negative
878,negative
879,negative
880,negative
881,negative
882,negative
883,negative
884,negative
885,neutral
886,neutral
887,positive
888,negative
889,negative
890,negative
891,positive
892,negative
893,negative
894,neutral
895,negative
896,negative
897,negative
898,negative
899,negative
900,neutral
901,positive
902,negative
903,negative
904,negative
905,negative
906,positive
907,negative
908,negative
909,negative
910,negative
911,negative
912,negative
913,neutral
914,neutral
915,positive
916,negative
917,negative
918,negative
919,neutral
920,neutral
921,negative
922,negative
923,neutral
924,negative
925,negative
926,negative
927,negative
928,negative
929,neutral
930,neutral
931,negative
932,negative
933,negative
934,negative
935,negative
936,negative
937,negative
938,positive
939,positive
940,negative
941,negative
942,positive
943,negative
944,neutral
945,negative
946,negative
947,negative
948,positive
949,negative
950,neutral
951,negative
952,negative
953,negative
954,positive
955,positive
956,positive
957,negative
958,negative
959,positive
960,negative
961,negative
962,negative
963,negative
964,negative
965,negative
966,negative
967,negative
968,negative
969,neutral
970,negative
971,neutral
972,negative
973,negative
974,negative
975,neutral
976,negative
977,neutral
978,negative
979,positive
980,negative
981,negative
982,negative
983,neutral
984,negative
985,negative
986,positive
987,negative
988,negative
989,negative
990,negative
991,negative
992,positive
993,negative
994,negative
995,negative
996,negative
997,negative
998,neutral
999,negative
1000,positive
1001,negative
1002,positive
1003,negative
1004,neutral
1005,positive
1006,negative
1007,negative
1008,negative
1009,negative
1010,negative
1011,positive
1012,negative
1013,negative
1014,neutral
1015,positive
1016,negative
1017,negative
1018,neutral
1019,negative
1020,negative
1021,neutral
1022,negative
1023,negative
1024,neutral
1025,negative
1026,neutral
1027,neutral
1028,neutral
1029,negative
1030,negative
1031,negative
1032,neutral
1033,negative
1034,negative
1035,neutral
1036,neutral
1037,negative
1038,negative
1039,neutral
1040,negative
1041,neutral
1042,negative
1043,negative
1044,negative
1045,positive
1046,neutral
1047,negative
1048,negative
1049,negative
1050,negative
1051,positive
1052,negative
1053,negative
1054,negative
1055,positive
1056,neutral
1057,negative
1058,positive
1059,negative
1060,positive
1061,positive
1062,negative
1063,neutral
1064,positive
1065,negative
1066,negative
1067,negative
1068,negative
1069,negative
1070,negative
1071,negative
1072,negative
1073,negative
1074,negative
1075,neutral
1076,neutral
1077,positive
1078,negative
1079,negative
1080,neutral
1081,negative
1082,negative
1083,negative
1084,positive
1085,negative
1086,positive
1087,positive
1088,positive
1089,negative
1090,neutral
1091,neutral
1092,negative
1093,negative
1094,negative
1095,negative
1096,positive
1097,neutral
1098,negative
1099,negative
1100,neutral
1101,negative
1102,negative
1103,positive
1104,negative
1105,negative
1106,neutral
1107,negative
1108,positive
1109,negative
1110,negative
1111,neutral
1112,negative
1113,negative
1114,negative
1115,negative
1116,negative
1117,negative
1118,neutral
1119,negative
1120,negative
1121,neutral
1122,negative
1123,negative
1124,negative
1125,negative
1126,negative
1127,neutral
1128,negative
1129,negative
1130,negative
1131,negative
1132,negative
1133,positive
1134,neutral
1135,negative
1136,positive
1137,neutral
1138,negative
1139,positive
1140,negative
1141,negative
1142,neutral
1143,negative
1144,negative
1145,negative
1146,negative
1147,negative
1148,negative
1149,neutral
1150,positive
1151,positive
1152,negative
1153,negative
1154,positive
1155,negative
1156,negative
1157,negative
1158,negative
1159,neutral
1160,negative
1161,negative
1162,negative
1163,negative
1164,negative
1165,neutral
1166,negative
1167,neutral
1168,negative
1169,neutral
1170,negative
1171,positive
1172,neutral
1173,neutral
1174,negative
1175,neutral
1176,negative
1177,negative
1178,negative
1179,neutral
1180,negative
1181,negative
1182,negative
1183,negative
1184,negative
1185,negative
1186,negative
1187,negative
1188,negative
1189,negative
1190,positive
1191,negative
1192,negative
1193,negative
1194,negative
1195,negative
1196,negative
1197,negative
1198,neutral
1199,negative
1200,negative
1201,negative
1202,negative
1203,negative
1204,negative
1205,negative
1206,negative
1207,positive
1208,neutral
1209,negative
1210,negative
1211,positive
1212,negative
1213,negative
1214,negative
1215,neutral
1216,neutral
1217,neutral
1218,positive
1219,neutral
1220,neutral
1221,negative
1222,neutral
1223,neutral
1224,neutral
1225,negative
1226,negative
1227,neutral
1228,positive
1229,neutral
1230,negative
1231,negative
1232,neutral
1233,neutral
1234,negative
1235,neutral
1236,neutral
1237,positive
1238,positive
1239,negative
1240,neutral
1241,negative
1242,negative
1243,negative
1244,neutral
1245,positive
1246,neutral
1247,negative
1248,negative
1249,negative
1250,negative
1251,negative
1252,negative
1253,negative
1254,neutral
1255,negative
1256,negative
1257,neutral
1258,negative
1259,negative
1260,neutral
1261,neutral
1262,positive
1263,negative
1264,negative
1265,neutral
1266,positive
1267,negative
1268,neutral
1269,neutral
1270,positive
1271,negative
1272,negative
1273,negative
1274,negative
1275,neutral
1276,negative
1277,neutral
1278,negative
1279,negative
1280,negative
1281,negative
1282,negative
1283,negative
1284,neutral
1285,negative
1286,neutral
1287,positive
1288,negative
1289,negative
1290,negative
1291,negative
1292,negative
1293,negative
1294,positive
1295,negative
1296,positive
1297,neutral
1298,negative
1299,positive
1300,negative
1301,negative
1302,neutral
1303,negative
1304,negative
1305,neutral
1306,negative
1307,neutral
1308,negative
1309,negative
1310,positive
1311,negative
1312,negative
1313,negative
1314,positive
1315,positive
1316,negative
1317,negative
1318,negative
1319,negative
1320,negative
1321,negative
1322,negative
1323,negative
1324,neutral
1325,neutral
1326,negative
1327,positive
1328,neutral
1329,positive
1330,neutral
1331,negative
1332,negative
1333,negative
1334,neutral
1335,positive
1336,positive
1337,negative
1338,negative
1339,positive
1340,negative
1341,negative
1342,negative
1343,negative
1344,negative
1345,positive
1346,negative
1347,negative
1348,positive
1349,positive
1350,neutral
1351,neutral
1352,neutral
1353,negative
1354,negative
1355,neutral
1356,negative
1357,neutral
1358,neutral
1359,negative
1360,negative
1361,positive
1362,neutral
1363,negative
1364,negative
1365,negative
1366,negative
1367,negative
1368,neutral
1369,neutral
1370,negative
1371,negative
1372,positive
1373,neutral
1374,negative
1375,negative
1376,positive
1377,neutral
1378,positive
1379,positive
1380,negative
1381,neutral
1382,negative
1383,negative
1384,negative
1385,negative
1386,negative
1387,negative
1388,negative
1389,neutral
1390,positive
1391,negative
1392,negative
1393,neutral
1394,neutral
1395,neutral
1396,neutral
1397,negative
1398,negative
1399,negative
1400,negative
1401,negative
1402,negative
1403,negative
1404,neutral
1405,negative
1406,neutral
1407,negative
1408,negative
1409,neutral
1410,negative
1411,negative
1412,positive
1413,positive
1414,negative
1415,negative
1416,negative
1417,neutral
1418,negative
1419,negative
1420,negative
1421,negative
1422,neutral
1423,negative
1424,negative
1425,positive
1426,negative
1427,negative
1428,negative
1429,negative
1430,negative
1431,negative
1432,negative
1433,positive
1434,negative
1435,negative
1436,negative
1437,neutral
1438,negative
1439,negative
1440,negative
1441,negative
1442,negative
1443,negative
1444,negative
1445,neutral
1446,positive
1447,negative
1448,negative
1449,negative
1450,neutral
1451,negative
1452,negative
1453,negative
1454,negative
1455,negative
1456,negative
1457,neutral
1458,negative
1459,negative
1460,negative
1461,neutral
1462,negative
1463,positive
1464,negative
1465,negative
1466,negative
1467,negative
1468,negative
1469,negative
1470,negative
1471,positive
1472,negative
1473,negative
1474,neutral
1475,neutral
1476,negative
1477,negative
1478,negative
1479,negative
1480,negative
1481,negative
1482,positive
1483,negative
1484,neutral
1485,negative
1486,negative
1487,negative
1488,negative
1489,negative
1490,negative
1491,neutral
1492,negative
1493,negative
1494,negative
1495,neutral
1496,neutral
1497,negative
1498,negative
1499,negative
1500,negative
1501,neutral
1502,positive
1503,neutral
1504,negative
1505,negative
1506,negative
1507,negative
1508,negative
1509,negative
1510,negative
1511,negative
1512,negative
1513,negative
1514,neutral
1515,positive
1516,negative
1517,negative
1518,positive
1519,negative
1520,neutral
1521,negative
1522,neutral
1523,neutral
1524,negative
1525,negative
1526,negative
1527,negative
1528,negative
1529,negative
1530,negative
1531,neutral
1532,negative
1533,negative
1534,positive
1535,negative
1536,neutral
1537,negative
1538,negative
1539,neutral
1540,positive
1541,negative
1542,negative
1543,negative
1544,neutral
1545,positive
1546,negative
1547,negative
1548,negative
1549,negative
1550,positive
1551,negative
1552,neutral
1553,negative
1554,negative
1555,negative
1556,neutral
1557,positive
1558,negative
1559,neutral
1560,negative
1561,neutral
1562,negative
1563,negative
1564,negative
1565,negative
1566,positive
1567,positive
1568,negative
1569,negative
1570,negative
1571,negative
1572,negative
1573,negative
1574,positive
1575,negative
1576,negative
1577,neutral
1578,positive
1579,neutral
1580,negative
1581,negative
1582,negative
1583,neutral
1584,negative
1585,negative
1586,negative
1587,negative
1588,negative
1589,negative
1590,negative
1591,negative
1592,negative
1593,neutral
1594,negative
1595,neutral
1596,negative
1597,negative
1598,neutral
1599,negative
1600,negative
1601,negative
1602,negative
1603,neutral
1604,positive
1605,neutral
1606,negative
1607,negative
1608,negative
1609,positive
1610,negative
1611,neutral
1612,negative
1613,negative
1614,negative
1615,negative
1616,negative
1617,negative
1618,negative
1619,negative
1620,negative
1621,negative
1622,neutral
1623,neutral
1624,negative
1625,negative
1626,negative
1627,neutral
1628,negative
1629,neutral
1630,neutral
1631,negative
1632,neutral
1633,positive
1634,negative
1635,neutral
1636,negative
1637,negative
1638,negative
1639,negative
1640,negative
1641,negative
1642,negative
1643,negative
1644,negative
1645,neutral
1646,negative
1647,negative
1648,neutral
1649,negative
1650,negative
1651,negative
1652,negative
1653,negative
1654,positive
1655,neutral
1656,positive
1657,neutral
1658,negative
1659,neutral
1660,positive
1661,negative
1662,negative
1663,negative
1664,negative
1665,negative
1666,negative
1667,positive
1668,negative
1669,negative
1670,negative
1671,neutral
1672,negative
1673,negative
1674,negative
1675,negative
1676,negative
1677,negative
1678,negative
1679,neutral
1680,negative
1681,negative
1682,negative
1683,negative
1684,negative
1685,negative
1686,neutral
1687,negative
1688,negative
1689,positive
1690,negative
1691,negative
1692,negative
1693,negative
1694,neutral
1695,neutral
1696,negative
1697,negative
1698,negative
1699,positive
1700,negative
1701,positive
1702,negative
1703,negative
1704,negative
1705,positive
1706,negative
1707,neutral
1708,negative
1709,negative
1710,neutral
1711,negative
1712,negative
1713,negative
1714,neutral
1715,negative
1716,positive
1717,negative
1718,neutral
1719,negative
1720,neutral
1721,negative
1722,negative
1723,negative
1724,negative
1725,positive
1726,negative
1727,neutral
1728,positive
1729,neutral
1730,neutral
1731,negative
1732,negative
1733,negative
1734,negative
1735,positive
1736,negative
1737,positive
1738,negative
1739,negative
1740,negative
1741,negative
1742,negative
1743,negative
1744,negative
1745,negative
1746,negative
1747,positive
1748,negative
1749,negative
1750,negative
1751,negative
1752,negative
1753,neutral
1754,negative
1755,negative
1756,negative
1757,negative
1758,negative
1759,neutral
1760,neutral
1761,negative
1762,negative
1763,negative
1764,negative
1765,negative
1766,negative
1767,positive
1768,negative
1769,neutral
1770,negative
1771,neutral
1772,negative
1773,negative
1774,positive
1775,negative
1776,neutral
1777,negative
1778,negative
1779,negative
1780,negative
1781,negative
1782,negative
1783,negative
1784,positive
1785,negative
1786,negative
1787,neutral
1788,neutral
1789,negative
1790,negative
1791,negative
1792,negative
1793,neutral
1794,negative
1795,negative
1796,negative
1797,negative
1798,negative
1799,negative
1800,negative
1801,negative
1802,neutral
1803,negative
1804,negative
1805,neutral
1806,negative
1807,neutral
1808,neutral
1809,neutral
1810,neutral
1811,negative
1812,positive
1813,neutral
1814,positive
1815,negative
1816,negative
1817,negative
1818,neutral
1819,neutral
1820,negative
1821,negative
1822,negative
1823,negative
1824,neutral
1825,negative
1826,negative
1827,negative
1828,positive
1829,neutral
1830,positive
1831,negative
1832,positive
1833,neutral
1834,negative
1835,negative
1836,negative
1837,neutral
1838,negative
1839,negative
1840,negative
1841,positive
1842,positive
1843,negative
1844,negative
1845,negative
1846,negative
1847,positive
1848,negative
1849,neutral
1850,negative
1851,negative
1852,negative
1853,negative
1854,negative
1855,negative
1856,negative
1857,negative
1858,negative
1859,negative
1860,negative
1861,negative
1862,negative
1863,negative
1864,negative
1865,negative
1866,neutral
1867,negative
1868,negative
1869,neutral
1870,negative
1871,negative
1872,negative
1873,negative
1874,negative
1875,negative
1876,negative
1877,negative
1878,negative
1879,negative
1880,negative
1881,neutral
1882,negative
1883,negative
1884,negative
1885,negative
1886,negative
1887,negative
1888,neutral
1889,negative
1890,negative
1891,negative
1892,positive
1893,negative
1894,negative
1895,positive
1896,negative
1897,negative
1898,negative
1899,negative
1900,neutral
1901,positive
1902,positive
1903,positive
1904,positive
1905,negative
1906,negative
1907,negative
1908,negative
1909,positive
1910,negative
1911,neutral
1912,negative
1913,negative
1914,negative
1915,negative
1916,negative
1917,negative
1918,negative
1919,negative
1920,negative
1921,positive
1922,negative
1923,positive
1924,negative
1925,negative
1926,positive
1927,negative
1928,negative
1929,neutral
1930,negative
1931,negative
1932,negative
1933,positive
1934,negative
1935,negative
1936,negative
1937,negative
1938,negative
1939,negative
1940,negative
1941,negative
1942,negative
1943,neutral
1944,neutral
1945,negative
1946,neutral
1947,negative
1948,negative
1949,neutral
1950,negative
1951,negative
1952,negative
1953,neutral
1954,negative
1955,neutral
1956,neutral
1957,positive
1958,negative
1959,negative
1960,negative
1961,negative
1962,neutral
1963,positive
1964,negative
1965,neutral
1966,neutral
1967,negative
1968,negative
1969,negative
1970,negative
1971,negative
1972,negative
1973,negative
1974,negative
1975,negative
1976,negative
1977,neutral
1978,negative
1979,negative
1980,positive
1981,neutral
1982,neutral
1983,negative
1984,positive
1985,negative
1986,negative
1987,negative
1988,negative
1989,negative
1990,negative
1991,negative
1992,negative
1993,neutral
1994,positive
1995,neutral
1996,neutral
1997,positive
1998,negative
1999,negative
2000,positive
2001,negative
2002,negative
2003,negative
2004,negative
2005,positive
2006,negative
2007,negative
2008,negative
2009,negative
2010,negative
2011,negative
2012,negative
2013,neutral
2014,negative
2015,positive
2016,negative
2017,positive
2018,negative
2019,neutral
2020,negative
2021,neutral
2022,negative
2023,negative
2024,neutral
2025,negative
2026,negative
2027,negative
2028,negative
2029,negative
2030,positive
2031,negative
2032,positive
2033,negative
2034,neutral
2035,negative
2036,negative
2037,negative
2038,negative
2039,negative
2040,neutral
2041,negative
2042,neutral
2043,neutral
2044,negative
2045,neutral
2046,negative
2047,negative
2048,negative
2049,negative
2050,positive
2051,negative
2052,neutral
2053,negative
2054,negative
2055,negative
2056,negative
2057,positive
2058,positive
2059,negative
2060,negative
2061,negative
2062,negative
2063,negative
2064,negative
2065,negative
2066,negative
2067,negative
2068,neutral
2069,neutral
2070,negative
2071,negative
2072,neutral
2073,negative
2074,negative
2075,neutral
2076,negative
2077,positive
2078,negative
2079,negative
2080,positive
2081,negative
2082,negative
2083,neutral
2084,negative
2085,negative
2086,positive
2087,negative
2088,negative
2089,negative
2090,negative
2091,negative
2092,positive
2093,neutral
2094,negative
2095,negative
2096,negative
2097,negative
2098,neutral
2099,negative
2100,negative
2101,negative
2102,negative
2103,negative
2104,negative
2105,negative
2106,negative
2107,neutral
2108,positive
2109,negative
2110,negative
2111,negative
2112,negative
2113,negative
2114,negative
2115,positive
2116,positive
2117,positive
2118,negative
2119,negative
2120,negative
2121,negative
2122,negative
2123,neutral
2124,negative
2125,negative
2126,negative
2127,negative
2128,negative
2129,negative
2130,positive
2131,negative
2132,positive
2133,neutral
2134,negative
2135,negative
2136,negative
2137,negative
2138,negative
2139,negative
2140,positive
2141,negative
2142,positive
2143,negative
2144,negative
2145,negative
2146,negative
2147,positive
2148,negative
2149,negative
2150,negative
2151,negative
2152,negative
2153,positive
2154,negative
2155,neutral
2156,positive
2157,negative
2158,negative
2159,positive
2160,negative
2161,negative
2162,negative
2163,neutral
2164,negative
2165,neutral
2166,negative
2167,negative
2168,neutral
2169,negative
2170,negative
2171,positive
2172,neutral
2173,negative
2174,negative
2175,negative
2176,negative
2177,negative
2178,negative
2179,neutral
2180,neutral
2181,neutral
2182,negative
2183,positive
2184,negative
2185,neutral
2186,negative
2187,neutral
2188,negative
2189,neutral
2190,negative
2191,neutral
2192,neutral
2193,negative
2194,negative
2195,neutral
2196,negative
2197,negative
2198,negative
2199,negative
2200,neutral
2201,negative
2202,negative
2203,negative
2204,negative
2205,negative
2206,negative
2207,negative
2208,neutral
2209,negative
2210,negative
2211,negative
2212,negative
2213,negative
2214,negative
2215,negative
2216,negative
2217,negative
2218,negative
2219,negative
2220,neutral
2221,neutral
2222,neutral
2223,negative
2224,negative
2225,neutral
2226,negative
2227,negative
2228,neutral
2229,positive
2230,neutral
2231,negative
2232,negative
2233,negative
2234,negative
2235,neutral
2236,positive
2237,negative
2238,neutral
2239,negative
2240,negative
2241,negative
2242,positive
2243,positive
2244,negative
2245,negative
2246,neutral
2247,negative
2248,negative
2249,positive
2250,negative
2251,negative
2252,negative
2253,negative
2254,negative
2255,positive
2256,negative
2257,neutral
2258,negative
2259,negative
2260,negative
2261,negative
2262,negative
2263,negative
2264,negative
2265,negative
2266,negative
2267,positive
2268,negative
2269,positive
2270,neutral
2271,neutral
2272,positive
2273,negative
2274,negative
2275,neutral
2276,negative
2277,negative
2278,negative
2279,negative
2280,negative
2281,negative
2282,neutral
2283,negative
2284,negative
2285,negative
2286,negative
2287,negative
2288,negative
2289,neutral
2290,negative
2291,negative
2292,positive
2293,negative
2294,negative
2295,negative
2296,negative
2297,positive
2298,neutral
2299,positive
2300,negative
2301,negative
2302,negative
2303,positive
2304,negative
2305,negative
2306,positive
2307,negative
2308,neutral
2309,negative
2310,neutral
2311,negative
2312,negative
2313,negative
2314,neutral
2315,negative
2316,negative
2317,negative
2318,negative
2319,negative
2320,neutral
2321,negative
2322,positive
2323,negative
2324,negative
2325,positive
2326,positive
2327,negative
2328,negative
2329,negative
2330,negative
2331,neutral
2332,negative
2333,negative
2334,neutral
2335,neutral
2336,positive
2337,negative
2338,negative
2339,neutral
2340,negative
2341,neutral
2342,negative
2343,negative
2344,negative
2345,negative
2346,negative
2347,negative
2348,negative
2349,neutral
2350,neutral
2351,negative
2352,negative
2353,negative
2354,positive
2355,negative
2356,negative
2357,negative
2358,negative
2359,negative
2360,positive
2361,negative
2362,negative
2363,negative
2364,negative
2365,negative
2366,negative
2367,negative
2368,negative
2369,neutral
2370,negative
2371,negative
2372,negative
2373,negative
2374,negative
2375,neutral
2376,negative
2377,negative
2378,neutral
2379,negative
2380,neutral
2381,neutral
2382,positive
2383,neutral
2384,neutral
2385,negative
2386,neutral
2387,negative
2388,negative
2389,negative
2390,positive
2391,negative
2392,negative
2393,positive
2394,negative
2395,negative
2396,negative
2397,negative
2398,negative
2399,negative
2400,negative
2401,neutral
2402,positive
2403,negative
2404,negative
2405,negative
2406,positive
2407,negative
2408,negative
2409,negative
2410,negative
2411,negative
2412,positive
2413,positive
2414,negative
2415,negative
2416,negative
2417,neutral
2418,negative
2419,neutral
2420,negative
2421,negative
2422,negative
2423,negative
2424,negative
2425,positive
2426,negative
2427,positive
2428,positive
2429,negative
2430,negative
2431,negative
2432,positive
2433,negative
2434,negative
2435,negative
2436,negative
2437,negative
2438,negative
2439,neutral
2440,negative
2441,negative
2442,neutral
2443,negative
2444,neutral
2445,negative
2446,positive
2447,neutral
2448,negative
2449,negative
2450,negative
2451,neutral
2452,negative
2453,negative
2454,neutral
2455,negative
2456,negative
2457,negative
2458,negative
2459,positive
2460,negative
2461,negative
2462,positive
2463,neutral
2464,neutral
2465,negative
2466,positive
2467,negative
2468,neutral
2469,positive
2470,neutral
2471,negative
2472,negative
2473,negative
2474,neutral
2475,negative
2476,negative
2477,negative
2478,negative
2479,positive
2480,negative
2481,negative
2482,negative
2483,negative
2484,negative
2485,negative
2486,negative
2487,neutral
2488,negative
2489,neutral
2490,negative
2491,negative
2492,negative
2493,negative
2494,negative
2495,neutral
2496,negative
2497,negative
2498,negative
2499,negative
2500,negative
2501,negative
2502,negative
2503,neutral
2504,negative
2505,neutral
2506,positive
2507,neutral
2508,neutral
2509,negative
2510,negative
2511,positive
2512,neutral
2513,neutral
2514,negative
2515,negative
2516,negative
2517,positive
2518,negative
2519,neutral
2520,negative
2521,negative
2522,negative
2523,negative
2524,negative
2525,negative
2526,negative
2527,negative
2528,negative
2529,positive
2530,negative
2531,negative
2532,negative
2533,negative
2534,neutral
2535,negative
2536,positive
2537,negative
2538,neutral
2539,neutral
2540,positive
2541,negative
2542,positive
2543,negative
2544,negative
2545,negative
2546,positive
2547,negative
2548,neutral
2549,negative
2550,negative
2551,positive
2552,negative
2553,negative
2554,negative
2555,negative
2556,negative
2557,negative
2558,neutral
2559,negative
2560,negative
2561,neutral
2562,negative
2563,neutral
2564,negative
2565,neutral
2566,positive
2567,negative
2568,negative
2569,neutral
2570,neutral
2571,negative
2572,negative
2573,negative
2574,positive
2575,negative
2576,positive
2577,negative
2578,negative
2579,negative
2580,negative
2581,negative
2582,positive
2583,neutral
2584,negative
2585,negative
2586,negative
2587,negative
2588,neutral
2589,negative
2590,negative
2591,negative
2592,negative
2593,positive
2594,negative
2595,neutral
2596,negative
2597,negative
2598,neutral
2599,negative
2600,positive
2601,neutral
2602,negative
2603,negative
2604,negative
2605,negative
2606,neutral
2607,positive
2608,negative
2609,positive
2610,negative
2611,negative
2612,neutral
2613,negative
2614,negative
2615,negative
2616,negative
2617,negative
2618,neutral
2619,neutral
2620,negative
2621,positive
2622,negative
2623,negative
2624,negative
2625,neutral
2626,negative
2627,negative
2628,positive
2629,positive
2630,negative
2631,neutral
2632,negative
2633,positive
2634,negative
2635,positive
2636,negative
2637,negative
2638,neutral
2639,negative
2640,neutral
2641,negative
2642,negative
2643,neutral
2644,negative
2645,negative
2646,negative
2647,negative
2648,positive
2649,negative
2650,negative
2651,negative
2652,negative
2653,negative
2654,negative
2655,negative
2656,negative
2657,neutral
2658,negative
2659,negative
2660,negative
2661,positive
2662,negative
2663,positive
2664,neutral
2665,positive
2666,neutral
2667,negative
2668,negative
2669,neutral
2670,negative
2671,negative
2672,negative
2673,negative
2674,negative
2675,positive
2676,negative
2677,negative
2678,negative
2679,negative
2680,negative
2681,negative
2682,negative
2683,positive
2684,positive
2685,negative
2686,negative
2687,negative
2688,neutral
2689,negative
2690,negative
2691,negative
2692,negative
2693,negative
2694,negative
2695,negative
2696,negative
2697,positive
2698,neutral
2699,negative
2700,negative
2701,negative
2702,negative
2703,negative
2704,neutral
2705,positive
2706,negative
2707,positive
2708,negative
2709,neutral
2710,negative
2711,negative
2712,negative
2713,positive
2714,neutral
2715,negative
2716,neutral
2717,positive
2718,neutral
2719,negative
2720,negative
2721,negative
2722,negative
2723,negative
2724,negative
2725,neutral
2726,negative
2727,neutral
2728,neutral
2729,negative
2730,negative
2731,negative
2732,negative
2733,negative
2734,negative
2735,negative
2736,negative
2737,positive
2738,negative
2739,neutral
2740,negative
2741,positive
2742,negative
2743,neutral
2744,negative
2745,negative
2746,negative
2747,negative
2748,negative
2749,negative
2750,negative
2751,negative
2752,negative
2753,positive
2754,positive
2755,negative
2756,negative
2757,negative
2758,positive
2759,negative
2760,neutral
2761,negative
2762,negative
2763,negative
2764,negative
2765,negative
2766,neutral
2767,negative
2768,negative
2769,negative
2770,negative
2771,positive
2772,neutral
2773,negative
2774,negative
2775,negative
2776,neutral
2777,negative
2778,neutral
2779,negative
2780,negative
2781,negative
2782,negative
2783,negative
2784,negative
2785,negative
2786,negative
2787,positive
2788,negative
2789,negative
2790,neutral
2791,negative
2792,negative
2793,negative
2794,negative
2795,positive
2796,positive
2797,positive
2798,neutral
2799,negative
2800,negative
2801,negative
2802,negative
2803,negative
2804,neutral
2805,positive
2806,negative
2807,neutral
2808,neutral
2809,neutral
2810,positive
2811,negative
2812,negative
2813,negative
2814,negative
2815,neutral
2816,negative
2817,negative
2818,negative
2819,negative
2820,negative
2821,negative
2822,negative
2823,negative
2824,negative
2825,neutral
2826,negative
2827,negative
2828,positive
2829,neutral
2830,negative
2831,positive
2832,positive
2833,negative
2834,neutral
2835,negative
2836,negative
2837,negative
2838,neutral
2839,neutral
2840,negative
2841,negative
2842,neutral
2843,neutral
2844,negative
2845,positive
2846,neutral
2847,negative
2848,negative
2849,negative
2850,positive
2851,negative
2852,negative
2853,negative
2854,negative
2855,negative
2856,neutral
2857,negative
2858,neutral
2859,negative
2860,negative
2861,positive
2862,negative
2863,negative
2864,negative
2865,neutral
2866,negative
2867,negative
2868,neutral
2869,positive
2870,negative
2871,negative
2872,negative
2873,negative
2874,negative
2875,positive
2876,positive
2877,negative
2878,neutral
2879,positive
2880,negative
2881,negative
2882,negative
2883,negative
2884,negative
2885,negative
2886,positive
2887,negative
2888,positive
2889,negative
2890,negative
2891,neutral
2892,positive
2893,negative
2894,negative
2895,neutral
2896,negative
2897,negative
2898,negative
2899,negative
2900,negative
2901,negative
2902,negative
2903,neutral
2904,negative
2905,negative
2906,negative
2907,positive
2908,neutral
2909,neutral
2910,negative
2911,negative
2912,positive
2913,negative
2914,negative
2915,positive
2916,neutral
2917,negative
2918,neutral
2919,negative
2920,positive
2921,neutral
2922,negative
2923,negative
2924,positive
2925,negative
2926,negative
2927,neutral
2928,positive
2929,negative
2930,negative
2931,negative
2932,negative
2933,negative
2934,negative
2935,negative
2936,negative
2937,neutral
2938,positive
2939,negative
2940,neutral
2941,positive
2942,negative
2943,neutral
2944,negative
2945,negative
2946,neutral
2947,neutral
2948,neutral
2949,positive
2950,neutral
2951,neutral
2952,negative
2953,negative
2954,negative
2955,negative
2956,negative
2957,negative
2958,negative
2959,negative
2960,positive
2961,negative
2962,negative
2963,neutral
2964,neutral
2965,negative
2966,positive
2967,negative
2968,negative
2969,negative
2970,negative
2971,positive
2972,negative
2973,negative
2974,negative
2975,positive
2976,negative
2977,positive
2978,negative
2979,negative
2980,neutral
2981,negative
2982,positive
2983,neutral
2984,neutral
2985,positive
2986,neutral
2987,negative
2988,negative
2989,negative
2990,negative
2991,negative
2992,negative
2993,positive
2994,neutral
2995,positive
2996,positive
2997,negative
2998,positive
2999,negative
3000,negative
3001,negative
3002,positive
3003,negative
3004,negative
3005,negative
3006,negative
3007,negative
3008,negative
3009,negative
3010,negative
3011,negative
3012,positive
3013,positive
3014,negative
3015,negative
3016,negative
3017,negative
3018,negative
3019,negative
3020,positive
3021,negative
3022,negative
3023,neutral
3024,negative
3025,neutral
3026,negative
3027,negative
3028,negative
3029,neutral
3030,negative
3031,negative
3032,positive
3033,neutral
3034,negative
3035,neutral
3036,positive
3037,neutral
3038,positive
3039,negative
3040,neutral
3041,neutral
3042,negative
3043,positive
3044,negative
3045,positive
3046,positive
3047,negative
3048,negative
3049,negative
3050,positive
3051,negative
3052,neutral
3053,negative
3054,negative
3055,negative
3056,negative
3057,neutral
3058,negative
3059,negative
3060,negative
3061,neutral
3062,negative
3063,neutral
3064,negative
3065,neutral
3066,negative
3067,positive
3068,neutral
3069,negative
3070,negative
3071,negative
3072,neutral
3073,negative
3074,negative
3075,neutral
3076,negative
3077,positive
3078,neutral
3079,negative
3080,negative
3081,negative
3082,negative
3083,negative
3084,negative
3085,negative
3086,negative
3087,positive
3088,negative
3089,negative
3090,negative
3091,negative
3092,negative
3093,negative
3094,positive
3095,negative
3096,neutral
3097,positive
3098,negative
3099,positive
3100,negative
3101,negative
3102,neutral
3103,positive
3104,negative
3105,negative
3106,negative
3107,neutral
3108,positive
3109,positive
3110,negative
3111,negative
3112,negative
3113,neutral
3114,negative
3115,negative
3116,negative
3117,negative
3118,negative
3119,negative
3120,negative
3121,negative
3122,neutral
3123,negative
3124,positive
3125,negative
3126,neutral
3127,negative
3128,negative
3129,negative
3130,negative
3131,neutral
3132,neutral
3133,negative
3134,negative
3135,negative
3136,negative
3137,negative
3138,negative
3139,positive
3140,positive
3141,negative
3142,negative
3143,negative
3144,positive
3145,negative
3146,negative
3147,negative
3148,neutral
3149,negative
3150,neutral
3151,negative
3152,positive
3153,negative
3154,neutral
3155,negative
3156,positive
3157,negative
3158,neutral
3159,negative
3160,negative
3161,positive
3162,positive
3163,neutral
3164,negative
3165,negative
3166,negative
3167,neutral
3168,negative
3169,negative
3170,positive
3171,negative
3172,negative
3173,negative
3174,negative
3175,neutral
3176,neutral
3177,negative
3178,negative
3179,positive
3180,negative
3181,negative
3182,negative
3183,positive
3184,neutral
3185,positive
3186,negative
3187,neutral
3188,negative
3189,negative
3190,negative
3191,negative
3192,neutral
3193,negative
3194,negative
3195,negative
3196,negative
3197,negative
3198,neutral
3199,neutral
3200,negative
3201,negative
3202,negative
3203,negative
3204,negative
3205,negative
3206,negative
3207,neutral
3208,negative
3209,neutral
3210,negative
3211,positive
3212,negative
3213,negative
3214,negative
3215,neutral
3216,positive
3217,neutral
3218,negative
3219,negative
3220,negative
3221,negative
3222,positive
3223,positive
3224,negative
3225,negative
3226,negative
3227,negative
3228,negative
3229,negative
3230,negative
3231,neutral
3232,neutral
3233,positive
3234,negative
3235,negative
3236,positive
3237,negative
3238,positive
3239,neutral
3240,negative
3241,negative
3242,negative
3243,negative
3244,positive
3245,negative
3246,negative
3247,negative
3248,negative
3249,positive
3250,negative
3251,negative
3252,negative
3253,negative
3254,negative
3255,negative
3256,negative
3257,negative
3258,negative
3259,negative
3260,neutral
3261,negative
3262,negative
3263,positive
3264,negative
3265,negative
3266,negative
3267,positive
3268,negative
3269,neutral
3270,positive
3271,negative
3272,negative
3273,negative
3274,negative
3275,positive
3276,positive
3277,negative
3278,neutral
3279,negative
3280,negative
3281,negative
3282,negative
3283,negative
3284,neutral
3285,negative
3286,positive
3287,negative
3288,negative
3289,negative
3290,negative
3291,negative
3292,negative
3293,negative
3294,neutral
3295,neutral
3296,negative
3297,neutral
3298,positive
3299,positive
3300,positive
3301,negative
3302,positive
3303,negative
3304,neutral
3305,negative
3306,neutral
3307,negative
3308,negative
3309,neutral
3310,positive
3311,negative
3312,negative
3313,negative
3314,positive
3315,negative
3316,negative
3317,negative
3318,negative
3319,negative
3320,negative
3321,neutral
3322,negative
3323,positive
3324,negative
3325,neutral
3326,negative
3327,negative
3328,negative
3329,negative
3330,neutral
3331,negative
3332,negative
3333,positive
3334,negative
3335,positive
3336,neutral
3337,negative
3338,negative
3339,neutral
3340,negative
3341,negative
3342,negative
3343,negative
3344,positive
3345,neutral
3346,neutral
3347,negative
3348,negative
3349,negative
3350,negative
3351,neutral
3352,negative
3353,positive
3354,negative
3355,negative
3356,negative
3357,neutral
3358,positive
3359,negative
3360,negative
3361,positive
3362,positive
3363,negative
3364,negative
3365,neutral
3366,neutral
3367,negative
3368,positive
3369,neutral
3370,negative
3371,negative
3372,negative
3373,negative
3374,positive
3375,negative
3376,negative
3377,neutral
3378,positive
3379,negative
3380,negative
3381,neutral
3382,negative
3383,positive
3384,negative
3385,negative
3386,negative
3387,negative
3388,positive
3389,neutral
3390,negative
3391,negative
3392,negative
3393,negative
3394,negative
3395,negative
3396,neutral
3397,positive
3398,positive
3399,negative
3400,negative
3401,negative
3402,negative
3403,negative
3404,negative
3405,negative
3406,neutral
3407,neutral
3408,negative
3409,negative
3410,negative
3411,negative
3412,positive
3413,negative
3414,negative
3415,negative
3416,negative
3417,negative
3418,negative
3419,negative
3420,positive
3421,negative
3422,positive
3423,positive
3424,negative
3425,neutral
3426,negative
3427,neutral
3428,positive
3429,positive
3430,negative
3431,negative
3432,negative
3433,negative
3434,negative
3435,negative
3436,neutral
3437,negative
3438,negative
3439,negative
3440,positive
3441,negative
3442,negative
3443,negative
3444,positive
3445,neutral
3446,positive
3447,positive
3448,neutral
3449,neutral
3450,negative
3451,positive
3452,neutral
3453,negative
3454,negative
3455,negative
3456,negative
3457,negative
3458,negative
3459,negative
3460,negative
3461,negative
3462,positive
3463,positive
3464,positive
3465,neutral
3466,neutral
3467,positive
3468,negative
3469,negative
3470,negative
3471,negative
3472,negative
3473,neutral
3474,negative
3475,neutral
3476,negative
3477,negative
3478,negative
3479,negative
3480,negative
3481,negative
3482,negative
3483,neutral
3484,negative
3485,negative
3486,negative
3487,negative
3488,negative
3489,negative
3490,negative
3491,positive
3492,negative
3493,negative
3494,negative
3495,negative
3496,negative
3497,negative
3498,negative
3499,negative
3500,positive
3501,positive
3502,positive
3503,positive
3504,negative
3505,negative
3506,positive
3507,negative
3508,neutral
3509,positive
3510,neutral
3511,neutral
3512,negative
3513,neutral
3514,neutral
3515,negative
3516,negative
3517,negative
3518,negative
3519,negative
3520,negative
3521,negative
3522,negative
3523,negative
3524,negative
3525,negative
3526,positive
3527,positive
3528,negative
3529,neutral
3530,negative
3531,negative
3532,negative
3533,negative
3534,neutral
3535,neutral
3536,neutral
3537,positive
3538,negative
3539,negative
3540,negative
3541,neutral
3542,neutral
3543,negative
3544,neutral
3545,neutral
3546,negative
3547,positive
3548,negative
3549,neutral
3550,negative
3551,negative
3552,neutral
3553,negative
3554,neutral
3555,negative
3556,neutral
3557,positive
3558,negative
3559,negative
3560,positive
3561,neutral
3562,negative
3563,negative
3564,negative
3565,neutral
3566,neutral
3567,negative
3568,negative
3569,negative
3570,positive
3571,negative
3572,negative
3573,negative
3574,positive
3575,negative
3576,negative
3577,negative
3578,negative
3579,negative
3580,neutral
3581,negative
3582,positive
3583,neutral
3584,negative
3585,neutral
3586,negative
3587,positive
3588,negative
3589,negative
3590,negative
3591,negative
3592,negative
3593,negative
3594,neutral
3595,negative
3596,neutral
3597,negative
3598,neutral
3599,negative
3600,negative
3601,neutral
3602,negative
3603,positive
3604,negative
3605,negative
3606,negative
3607,neutral
3608,neutral
3609,negative
3610,negative
3611,positive
3612,negative
3613,negative
3614,negative
3615,negative
3616,negative
3617,positive
3618,negative
3619,negative
3620,negative
3621,negative
3622,neutral
3623,negative
3624,negative
3625,neutral
3626,negative
3627,neutral
3628,negative
3629,negative
3630,positive
3631,negative
3632,negative
3633,negative
3634,negative
3635,negative
3636,positive
3637,negative
3638,negative
3639,negative
3640,negative
3641,negative
3642,positive
3643,negative
3644,neutral
3645,negative
3646,negative
3647,negative
3648,positive
3649,positive
3650,positive
3651,positive
3652,positive
3653,neutral
3654,negative
3655,neutral
3656,negative
3657,neutral
3658,negative
3659,negative
3660,negative
3661,negative
3662,negative
3663,negative
3664,positive
3665,negative
3666,negative
3667,negative
3668,negative
3669,negative
3670,neutral
3671,negative
3672,negative
3673,negative
3674,negative
3675,positive
3676,negative
3677,positive
3678,negative
3679,negative
3680,negative
3681,neutral
3682,neutral
3683,neutral
3684,negative
3685,negative
3686,negative
3687,negative
3688,positive
3689,negative
3690,neutral
3691,negative
3692,negative
3693,neutral
3694,negative
3695,negative
3696,negative
3697,negative
3698,negative
3699,positive
3700,negative
3701,neutral
3702,negative
3703,negative
3704,neutral
3705,positive
3706,negative
3707,positive
3708,negative
3709,negative
3710,negative
3711,negative
3712,negative
3713,positive
3714,negative
3715,positive
3716,negative
3717,negative
3718,negative
3719,positive
3720,positive
3721,negative
3722,negative
3723,negative
3724,negative
3725,neutral
3726,negative
3727,negative
3728,negative
3729,neutral
3730,neutral
3731,negative
3732,negative
3733,negative
3734,negative
3735,negative
3736,negative
3737,negative
3738,positive
3739,neutral
3740,negative
3741,negative
3742,negative
3743,negative
3744,neutral
3745,negative
3746,negative
3747,negative
3748,positive
3749,negative
3750,neutral
3751,negative
3752,negative
3753,positive
3754,negative
3755,negative
3756,neutral
3757,negative
3758,positive
3759,negative
3760,neutral
3761,negative
3762,negative
3763,neutral
3764,positive
3765,negative
3766,neutral
3767,neutral
3768,negative
3769,neutral
3770,negative
3771,negative
3772,negative
3773,neutral
3774,negative
3775,neutral
3776,negative
3777,positive
3778,negative
3779,neutral
3780,negative
3781,neutral
3782,negative
3783,positive
3784,negative
3785,negative
3786,negative
3787,negative
3788,negative
3789,negative
3790,negative
3791,negative
3792,negative
3793,neutral
3794,negative
3795,negative
3796,neutral
3797,negative
3798,positive
3799,negative
3800,neutral
3801,negative
3802,neutral
3803,negative
3804,negative
3805,negative
3806,negative
3807,negative
3808,neutral
3809,negative
3810,negative
3811,neutral
3812,neutral
3813,negative
3814,negative
3815,neutral
3816,negative
3817,negative
3818,negative
3819,negative
3820,negative
3821,positive
3822,negative
3823,negative
3824,positive
3825,negative
3826,neutral
3827,negative
3828,positive
3829,positive
3830,neutral
3831,negative
3832,positive
3833,negative
3834,negative
3835,negative
3836,positive
3837,negative
3838,positive
3839,negative
3840,negative
3841,negative
3842,negative
3843,neutral
3844,negative
3845,neutral
3846,negative
3847,negative
3848,negative
3849,negative
3850,negative
3851,negative
3852,negative
3853,negative
3854,neutral
3855,negative
3856,negative
3857,neutral
3858,negative
3859,neutral
3860,negative
3861,neutral
3862,negative
3863,negative
3864,negative
3865,neutral
3866,negative
3867,negative
3868,neutral
3869,positive
3870,negative
3871,negative
3872,negative
3873,negative
3874,negative
3875,negative
3876,neutral
3877,positive
3878,neutral
3879,negative
3880,negative
3881,negative
3882,negative
3883,neutral
3884,negative
3885,negative
3886,positive
3887,negative
3888,positive
3889,negative
3890,negative
3891,negative
3892,negative
3893,neutral
3894,negative
3895,positive
3896,positive
3897,negative
3898,neutral
3899,neutral
3900,neutral
3901,neutral
3902,negative
3903,negative
3904,positive
3905,negative
3906,negative
3907,neutral
3908,positive
3909,negative
3910,negative
3911,negative
3912,negative
3913,negative
3914,negative
3915,negative
3916,negative
3917,negative
3918,negative
3919,negative
3920,negative
3921,positive
3922,positive
3923,neutral
3924,neutral
3925,neutral
3926,positive
3927,neutral
3928,negative
3929,neutral
3930,negative
3931,negative
3932,negative
3933,negative
3934,negative
3935,negative
3936,negative
3937,negative
3938,negative
3939,negative
3940,negative
3941,positive
3942,neutral
3943,positive
3944,positive
3945,neutral
3946,negative
3947,neutral
3948,positive
3949,negative
3950,negative
3951,negative
3952,negative
3953,negative
3954,negative
3955,neutral
3956,negative
3957,negative
3958,positive
3959,neutral
3960,positive
3961,positive
3962,negative
3963,neutral
3964,neutral
3965,negative
3966,negative
3967,negative
3968,negative
3969,negative
3970,positive
3971,neutral
3972,negative
3973,neutral
3974,neutral
3975,positive
3976,negative
3977,positive
3978,positive
3979,negative
3980,positive
3981,negative
3982,negative
3983,negative
3984,neutral
3985,negative
3986,negative
3987,negative
3988,negative
3989,negative
3990,neutral
3991,negative
3992,neutral
3993,negative
3994,negative
3995,negative
3996,neutral
3997,negative
3998,neutral
3999,negative
4000,negative
4001,positive
4002,neutral
4003,negative
4004,neutral
4005,negative
4006,negative
4007,neutral
4008,negative
4009,positive
4010,negative
4011,negative
4012,negative
4013,positive
4014,negative
4015,neutral
4016,negative
4017,negative
4018,negative
4019,negative
4020,negative
4021,positive
4022,positive
4023,positive
4024,negative
4025,negative
4026,negative
4027,neutral
4028,negative
4029,neutral
4030,positive
4031,neutral
4032,positive
4033,positive
4034,negative
4035,negative
4036,neutral
4037,positive
4038,negative
4039,positive
4040,negative
4041,positive
4042,negative
4043,positive
4044,negative
4045,negative
4046,neutral
4047,negative
4048,neutral
4049,negative
4050,neutral
4051,negative
4052,negative
4053,negative
4054,neutral
4055,negative
4056,negative
4057,negative
4058,neutral
4059,negative
4060,negative
4061,negative
4062,negative
4063,negative
4064,negative
4065,negative
4066,negative
4067,negative
4068,neutral
4069,neutral
4070,positive
4071,negative
4072,negative
4073,positive
4074,negative
4075,negative
4076,negative
4077,negative
4078,negative
4079,negative
4080,positive
4081,negative
4082,negative
4083,negative
4084,negative
4085,neutral
4086,negative
4087,negative
4088,negative
4089,neutral
4090,negative
4091,positive
4092,neutral
4093,negative
4094,neutral
4095,negative
4096,negative
4097,positive
4098,positive
4099,negative
4100,negative
4101,positive
4102,positive
4103,negative
4104,neutral
4105,negative
4106,negative
4107,negative
4108,negative
4109,negative
4110,positive
4111,negative
4112,neutral
4113,negative
4114,positive
4115,negative
4116,negative
4117,neutral
4118,neutral
4119,neutral
4120,positive
4121,negative
4122,negative
4123,neutral
4124,negative
4125,negative
4126,negative
4127,negative
4128,negative
4129,positive
4130,negative
4131,negative
4132,negative
4133,negative
4134,negative
4135,negative
4136,negative
4137,negative
4138,negative
4139,negative
4140,negative
4141,neutral
4142,negative
4143,negative
4144,negative
4145,neutral
4146,negative
4147,negative
4148,positive
4149,negative
4150,negative
4151,neutral
4152,neutral
4153,positive
4154,neutral
4155,neutral
4156,negative
4157,neutral
4158,neutral
4159,negative
4160,negative
4161,neutral
4162,negative
4163,negative
4164,neutral
4165,neutral
4166,negative
4167,negative
4168,negative
4169,neutral
4170,neutral
4171,negative
4172,neutral
4173,positive
4174,positive
4175,neutral
4176,positive
4177,negative
4178,neutral
4179,neutral
4180,positive
4181,neutral
4182,negative
4183,negative
4184,neutral
4185,positive
4186,negative
4187,positive
4188,negative
4189,negative
4190,negative
4191,positive
4192,neutral
4193,negative
4194,negative
4195,negative
4196,negative
4197,negative
4198,neutral
4199,neutral
4200,negative
4201,negative
4202,negative
4203,negative
4204,negative
4205,negative
4206,negative
4207,negative
4208,neutral
4209,positive
4210,neutral
4211,neutral
4212,negative
4213,negative
4214,neutral
4215,negative
4216,neutral
4217,negative
4218,negative
4219,negative
4220,negative
4221,negative
4222,negative
4223,negative
4224,negative
4225,negative
4226,negative
4227,negative
4228,positive
4229,positive
4230,negative
4231,negative
4232,positive
4233,negative
4234,negative
4235,negative
4236,negative
4237,negative
4238,negative
4239,neutral
4240,neutral
4241,negative
4242,negative
4243,negative
4244,neutral
4245,negative
4246,negative
4247,negative
4248,negative
4249,negative
4250,negative
4251,negative
4252,positive
4253,negative
4254,negative
4255,neutral
4256,negative
4257,neutral
4258,negative
4259,neutral
4260,negative
4261,negative
4262,negative
4263,neutral
4264,negative
4265,positive
4266,negative
4267,neutral
4268,negative
4269,neutral
4270,positive
4271,negative
4272,negative
4273,negative
4274,positive
4275,negative
4276,negative
4277,negative
4278,positive
4279,negative
4280,neutral
4281,negative
4282,negative
4283,negative
4284,neutral
4285,negative
4286,negative
4287,negative
4288,neutral
4289,negative
4290,negative
4291,negative
4292,negative
4293,negative
4294,neutral
4295,negative
4296,neutral
4297,negative
4298,positive
4299,negative
4300,negative
4301,negative
4302,neutral
4303,negative
4304,neutral
4305,negative
4306,negative
4307,negative
4308,negative
4309,negative
4310,negative
4311,positive
4312,negative
4313,negative
4314,neutral
4315,negative
4316,negative
4317,positive
4318,negative
4319,negative
4320,negative
4321,negative
4322,negative
4323,positive
4324,neutral
4325,neutral
4326,negative
4327,negative
4328,negative
4329,neutral
4330,negative
4331,negative
4332,negative
4333,negative
4334,neutral
4335,negative
4336,negative
4337,negative
4338,negative
4339,negative
4340,negative
4341,negative
4342,neutral
4343,negative
4344,neutral
4345,negative
4346,negative
4347,negative
4348,neutral
4349,neutral
4350,positive
4351,negative
4352,negative
4353,positive
4354,negative
4355,negative
4356,negative
4357,neutral
4358,negative
4359,neutral
4360,negative
4361,negative
4362,negative
4363,negative
4364,neutral
4365,negative
4366,negative
4367,neutral
4368,negative
4369,negative
4370,positive
4371,negative
4372,negative
4373,negative
4374,negative
4375,negative
4376,neutral
4377,negative
4378,negative
4379,negative
4380,negative
4381,negative
4382,negative
4383,negative
4384,negative
4385,neutral
4386,negative
4387,negative
4388,negative
4389,negative
4390,negative
4391,negative
4392,negative
4393,negative
4394,negative
4395,negative
4396,negative
4397,negative
4398,negative
4399,negative
4400,negative
4401,positive
4402,positive
4403,negative
4404,negative
4405,neutral
4406,negative
4407,negative
4408,negative
4409,positive
4410,negative
4411,negative
4412,negative
4413,negative
4414,negative
4415,neutral
4416,positive
4417,negative
4418,positive
4419,negative
4420,negative
4421,negative
4422,negative
4423,neutral
4424,negative
4425,positive
4426,negative
4427,positive
4428,positive
4429,neutral
4430,negative
4431,neutral
4432,positive
4433,negative
4434,negative
4435,positive
4436,negative
4437,neutral
4438,negative
4439,positive
4440,neutral
4441,negative
4442,neutral
4443,positive
4444,positive
4445,negative
4446,negative
4447,neutral
4448,negative
4449,negative
4450,negative
4451,positive
4452,negative
4453,negative
4454,neutral
4455,neutral
4456,negative
4457,neutral
4458,negative
4459,negative
4460,negative
4461,negative
4462,negative
4463,positive
4464,negative
4465,negative
4466,negative
4467,negative
4468,negative
4469,positive
4470,negative
4471,negative
4472,negative
4473,negative
4474,positive
4475,neutral
4476,neutral
4477,negative
4478,neutral
4479,positive
4480,positive
4481,negative
4482,negative
4483,positive
4484,negative
4485,negative
4486,neutral
4487,negative
4488,negative
4489,negative
4490,negative
4491,negative
4492,positive
4493,negative
4494,neutral
4495,negative
4496,neutral
4497,negative
4498,negative
4499,positive
4500,positive
4501,negative
4502,negative
4503,neutral
4504,negative
4505,positive
4506,neutral
4507,negative
4508,negative
4509,negative
4510,neutral
4511,negative
4512,neutral
4513,neutral
4514,neutral
4515,neutral
4516,neutral
4517,negative
4518,neutral
4519,negative
4520,negative
4521,negative
4522,neutral
4523,neutral
4524,neutral
4525,neutral
4526,negative
4527,negative
4528,neutral
4529,neutral
4530,negative
4531,negative
4532,negative
4533,neutral
4534,negative
4535,negative
4536,negative
4537,negative
4538,neutral
4539,negative
4540,negative
4541,negative
4542,negative
4543,negative
4544,neutral
4545,negative
4546,negative
4547,negative
4548,negative
4549,negative
4550,negative
4551,neutral
4552,negative
4553,negative
4554,neutral
4555,neutral
4556,negative
4557,negative
4558,negative
4559,negative
4560,negative
4561,negative
4562,neutral
4563,negative
4564,negative
4565,negative
4566,negative
4567,neutral
4568,negative
4569,positive
4570,neutral
4571,negative
4572,negative
4573,positive
4574,neutral
4575,positive
4576,negative
4577,negative
4578,negative
4579,negative
4580,negative
4581,negative
4582,positive
4583,negative
4584,neutral
4585,positive
4586,negative
4587,negative
4588,positive
4589,negative
4590,negative
4591,positive
4592,negative
4593,negative
4594,negative
4595,negative
4596,negative
4597,positive
4598,negative
4599,neutral
4600,negative
4601,neutral
4602,negative
4603,positive
4604,negative
4605,negative
4606,negative
4607,positive
4608,neutral
4609,negative
4610,negative
4611,negative
4612,negative
4613,negative
4614,positive
4615,negative
4616,neutral
4617,negative
4618,negative
4619,negative
4620,positive
4621,neutral
4622,negative
4623,negative
4624,negative
4625,negative
4626,neutral
4627,positive
4628,negative
4629,negative
4630,negative
4631,negative
4632,neutral
4633,negative
4634,negative
4635,negative
4636,negative
4637,negative
4638,negative
4639,negative
4640,negative
4641,negative
4642,negative
4643,negative
4644,negative
4645,negative
4646,negative
4647,neutral
4648,negative
4649,negative
4650,negative
4651,negative
4652,negative
4653,neutral
4654,positive
4655,negative
4656,neutral
4657,negative
4658,negative
4659,negative
4660,negative
4661,neutral
4662,positive
4663,negative
4664,negative
4665,negative
4666,negative
4667,neutral
4668,negative
4669,neutral
4670,neutral
4671,negative
4672,negative
4673,negative
4674,negative
4675,negative
4676,negative
4677,negative
4678,negative
4679,negative
4680,neutral
4681,negative
4682,negative
4683,neutral
4684,negative
4685,positive
4686,negative
4687,negative
4688,negative
4689,negative
4690,negative
4691,negative
4692,negative
4693,negative
4694,negative
4695,negative
4696,negative
4697,negative
4698,negative
4699,neutral
4700,negative
4701,positive
4702,neutral
4703,negative
4704,negative
4705,negative
4706,positive
4707,negative
4708,neutral
4709,negative
4710,negative
4711,negative
4712,negative
4713,negative
4714,negative
4715,negative
4716,neutral
4717,negative
4718,negative
4719,negative
4720,positive
4721,negative
4722,negative
4723,negative
4724,neutral
4725,negative
4726,negative
4727,negative
4728,negative
4729,negative
4730,negative
4731,negative
4732,negative
4733,neutral
4734,negative
4735,negative
4736,negative
4737,negative
4738,negative
4739,negative
4740,negative
4741,negative
4742,negative
4743,negative
4744,positive
4745,negative
4746,negative
4747,negative
4748,negative
4749,positive
4750,positive
4751,negative
4752,negative
4753,positive
4754,neutral
4755,negative
4756,negative
4757,negative
4758,negative
4759,negative
4760,neutral
4761,negative
4762,negative
4763,negative
4764,negative
4765,neutral
4766,neutral
4767,negative
4768,negative
4769,neutral
4770,negative
4771,negative
4772,negative
4773,negative
4774,negative
4775,positive
4776,negative
4777,negative
4778,positive
4779,negative
4780,neutral
4781,positive
4782,negative
4783,neutral
4784,negative
4785,negative
4786,negative
4787,negative
4788,neutral
4789,positive
4790,neutral
4791,negative
4792,negative
4793,negative
4794,negative
4795,neutral
4796,positive
4797,neutral
4798,negative
4799,negative
4800,negative
4801,neutral
4802,negative
4803,neutral
4804,positive
4805,negative
4806,neutral
4807,negative
4808,negative
4809,negative
4810,negative
4811,negative
4812,neutral
4813,negative
4814,negative
4815,negative
4816,negative
4817,negative
4818,negative
4819,positive
4820,positive
4821,negative
4822,negative
4823,neutral
4824,negative
4825,positive
4826,negative
4827,negative
4828,negative
4829,negative
4830,negative
4831,positive
4832,negative
4833,negative
4834,negative
4835,negative
4836,positive
4837,negative
4838,negative
4839,negative
4840,neutral
4841,neutral
4842,negative
4843,negative
4844,negative
4845,negative
4846,negative
4847,negative
4848,positive
4849,positive
4850,negative
4851,negative
4852,negative
4853,positive
4854,negative
4855,neutral
4856,negative
4857,negative
4858,positive
4859,negative
4860,negative
4861,negative
4862,negative
4863,negative
4864,positive
4865,negative
4866,positive
4867,negative
4868,neutral
4869,negative
4870,negative
4871,neutral
4872,negative
4873,positive
4874,negative
4875,negative
4876,negative
4877,positive
4878,negative
4879,negative
4880,negative
4881,negative
4882,neutral
4883,negative
4884,negative
4885,neutral
4886,positive
4887,neutral
4888,negative
4889,negative
4890,negative
4891,negative
4892,negative
4893,positive
4894,negative
4895,positive
4896,neutral
4897,negative
4898,negative
4899,neutral
4900,negative
4901,negative
4902,negative
4903,negative
4904,negative
4905,negative
4906,negative
4907,negative
4908,positive
4909,negative
4910,negative
4911,neutral
4912,negative
4913,neutral
4914,positive
4915,negative
4916,negative
4917,negative
4918,negative
4919,negative
4920,negative
4921,negative
4922,neutral
4923,neutral
4924,negative
4925,negative
4926,positive
4927,positive
4928,negative
4929,neutral
4930,negative
4931,negative
4932,negative
4933,negative
4934,positive
4935,neutral
4936,negative
4937,negative
4938,negative
4939,neutral
4940,negative
4941,neutral
4942,positive
4943,negative
4944,positive
4945,negative
4946,negative
4947,positive
4948,negative
4949,neutral
4950,negative
4951,neutral
4952,negative
4953,negative
4954,negative
4955,negative
4956,negative
4957,neutral
4958,negative
4959,negative
4960,positive
4961,negative
4962,negative
4963,negative
4964,negative
4965,negative
4966,negative
4967,negative
4968,negative
4969,negative
4970,positive
4971,negative
4972,positive
4973,negative
4974,neutral
4975,negative
4976,negative
4977,negative
4978,negative
4979,negative
4980,neutral
4981,negative
4982,negative
4983,negative
4984,negative
4985,negative
4986,negative
4987,positive
4988,neutral
4989,positive
4990,negative
4991,negative
4992,neutral
4993,negative
4994,negative
4995,negative
4996,negative
4997,negative
4998,negative
4999,negative
5000,negative
5001,negative
5002,negative
5003,negative
5004,negative
5005,negative
5006,negative
5007,negative
5008,negative
5009,neutral
5010,negative
5011,negative
5012,negative
5013,negative
5014,negative
5015,negative
5016,positive
5017,positive
5018,neutral
5019,negative
5020,neutral
5021,negative
5022,negative
5023,positive
5024,negative
5025,neutral
5026,positive
5027,negative
5028,neutral
5029,positive
5030,negative
5031,negative
5032,negative
5033,negative
5034,negative
5035,negative
5036,positive
5037,negative
5038,positive
5039,neutral
5040,positive
5041,positive
5042,negative
5043,positive
5044,negative
5045,negative
5046,negative
5047,negative
5048,negative
5049,negative
5050,negative
5051,negative
5052,negative
5053,positive
5054,negative
5055,positive
5056,neutral
5057,negative
5058,neutral
5059,negative
5060,positive
5061,negative
5062,positive
5063,negative
5064,neutral
5065,positive
5066,neutral
5067,negative
5068,negative
5069,negative
5070,negative
5071,neutral
5072,positive
5073,negative
5074,positive
5075,positive
5076,negative
5077,negative
5078,negative
5079,negative
5080,negative
5081,negative
5082,negative
5083,neutral
5084,negative
5085,negative
5086,negative
5087,neutral
5088,negative
5089,negative
5090,positive
5091,neutral
5092,negative
5093,negative
5094,negative
5095,negative
5096,negative
5097,negative
5098,neutral
5099,negative
5100,neutral
5101,positive
5102,negative
5103,negative
5104,negative
5105,negative
5106,negative
5107,negative
5108,negative
5109,neutral
5110,neutral
5111,negative
5112,negative
5113,negative
5114,negative
5115,negative
5116,positive
5117,negative
5118,positive
5119,negative
5120,neutral
5121,neutral
5122,positive
5123,negative
5124,neutral
5125,negative
5126,neutral
5127,neutral
5128,negative
5129,negative
5130,neutral
5131,negative
5132,negative
5133,negative
5134,neutral
5135,positive
5136,negative
5137,neutral
5138,negative
5139,positive
5140,negative
5141,positive
5142,negative
5143,negative
5144,negative
5145,neutral
5146,negative
5147,negative
5148,positive
5149,neutral
5150,positive
5151,negative
5152,negative
5153,negative
5154,positive
5155,negative
5156,positive
5157,negative
5158,negative
5159,negative
5160,negative
5161,negative
5162,neutral
5163,positive
5164,negative
5165,negative
5166,negative
5167,negative
5168,negative
5169,negative
5170,neutral
5171,negative
5172,negative
5173,neutral
5174,neutral
5175,negative
5176,negative
5177,negative
5178,negative
5179,negative
5180,negative
5181,neutral
5182,negative
5183,negative
5184,positive
5185,negative
5186,positive
5187,neutral
5188,negative
5189,negative
5190,negative
5191,negative
5192,negative
5193,negative
5194,neutral
5195,negative
5196,neutral
5197,negative
5198,negative
5199,negative
5200,negative
5201,neutral
5202,negative
5203,negative
5204,negative
5205,negative
5206,neutral
5207,negative
5208,negative
5209,positive
5210,neutral
5211,negative
5212,positive
5213,positive
5214,negative
5215,positive
5216,neutral
5217,negative
5218,positive
5219,negative
5220,neutral
5221,negative
5222,negative
5223,negative
5224,negative
5225,negative
5226,negative
5227,positive
5228,negative
5229,neutral
5230,positive
5231,negative
5232,negative
5233,negative
5234,negative
5235,positive
5236,negative
5237,neutral
5238,positive
5239,neutral
5240,negative
5241,neutral
5242,negative
5243,positive
5244,neutral
5245,negative
5246,positive
5247,negative
5248,negative
5249,positive
5250,neutral
5251,negative
5252,positive
5253,neutral
5254,negative
5255,negative
5256,negative
5257,neutral
5258,negative
5259,negative
5260,neutral
5261,negative
5262,positive
5263,negative
5264,negative
5265,negative
5266,positive
5267,neutral
5268,positive
5269,negative
5270,negative
5271,negative
5272,negative
5273,negative
5274,negative
5275,neutral
5276,neutral
5277,negative
5278,negative
5279,neutral
5280,negative
5281,negative
5282,negative
5283,neutral
5284,negative
5285,negative
5286,positive
5287,negative
5288,negative
5289,negative
5290,negative
5291,negative
5292,positive
5293,negative
5294,neutral
5295,positive
5296,negative
5297,neutral
5298,negative
5299,negative
5300,negative
5301,neutral
5302,positive
5303,negative
5304,neutral
5305,negative
5306,negative
5307,negative
5308,neutral
5309,neutral
5310,negative
5311,negative
5312,positive
5313,neutral
5314,negative
5315,neutral
5316,neutral
5317,neutral
5318,negative
5319,neutral
5320,positive
5321,negative
5322,negative
5323,negative
5324,negative
5325,neutral
5326,negative
5327,negative
5328,negative
5329,neutral
5330,negative
5331,negative
5332,negative
5333,neutral
5334,neutral
5335,negative
5336,neutral
5337,negative
5338,negative
5339,negative
5340,negative
5341,negative
5342,neutral
5343,negative
5344,negative
5345,negative
5346,negative
5347,negative
5348,negative
5349,neutral
5350,neutral
5351,negative
5352,neutral
5353,negative
5354,negative
5355,positive
5356,positive
5357,negative
5358,neutral
5359,neutral
5360,negative
5361,negative
5362,positive
5363,negative
5364,negative
5365,negative
5366,negative
5367,negative
5368,neutral
5369,negative
5370,negative
5371,neutral
5372,negative
5373,neutral
5374,negative
5375,neutral
5376,neutral
5377,negative
5378,negative
5379,positive
5380,negative
5381,neutral
5382,negative
5383,negative
5384,negative
5385,positive
5386,positive
5387,negative
5388,negative
5389,negative
5390,negative
5391,positive
5392,negative
5393,negative
5394,neutral
5395,negative
5396,negative
5397,neutral
5398,neutral
5399,neutral
5400,neutral
5401,neutral
5402,negative
5403,negative
5404,negative
5405,negative
5406,negative
5407,neutral
5408,neutral
5409,negative
5410,negative
5411,negative
5412,negative
5413,negative
5414,negative
5415,negative
5416,neutral
5417,negative
5418,negative
5419,negative
5420,negative
5421,negative
5422,negative
5423,negative
5424,negative
5425,positive
5426,negative
5427,negative
5428,negative
5429,positive
5430,positive
5431,negative
5432,negative
5433,negative
5434,negative
5435,negative
5436,negative
5437,negative
5438,negative
5439,neutral
5440,negative
5441,positive
5442,negative
5443,neutral
5444,neutral
5445,neutral
5446,negative
5447,negative
5448,neutral
5449,neutral
5450,negative
5451,neutral
5452,neutral
5453,negative
5454,negative
5455,negative
5456,negative
5457,negative
5458,negative
5459,negative
5460,negative
5461,negative
5462,positive
5463,negative
5464,neutral
5465,negative
5466,positive
5467,negative
5468,negative
5469,positive
5470,neutral
5471,neutral
5472,negative
5473,negative
5474,negative
5475,negative
5476,negative
5477,positive
5478,negative
5479,negative
5480,negative
5481,negative
5482,neutral
5483,positive
5484,negative
5485,positive
5486,negative
5487,neutral
5488,positive
5489,neutral
5490,negative
5491,positive
5492,negative
5493,negative
5494,negative
5495,negative
5496,neutral
5497,negative
5498,negative
5499,negative
5500,positive
5501,positive
5502,neutral
5503,neutral
5504,positive
5505,neutral
5506,positive
5507,positive
5508,neutral
5509,negative
5510,negative
5511,negative
5512,positive
5513,negative
5514,negative
5515,negative
5516,negative
5517,negative
5518,neutral
5519,negative
5520,neutral
5521,negative
5522,negative
5523,negative
5524,negative
5525,negative
5526,neutral
5527,negative
5528,negative
5529,negative
5530,negative
5531,negative
5532,negative
5533,positive
5534,negative
5535,positive
5536,negative
5537,neutral
5538,negative
5539,negative
5540,neutral
5541,negative
5542,negative
5543,positive
5544,negative
5545,negative
5546,negative
5547,negative
5548,negative
5549,negative
5550,positive
5551,neutral
5552,negative
5553,negative
5554,neutral
5555,neutral
5556,neutral
5557,negative
5558,negative
5559,negative
5560,negative
5561,negative
5562,negative
5563,negative
5564,negative
5565,negative
5566,negative
5567,neutral
5568,positive
5569,negative
5570,negative
5571,negative
5572,neutral
5573,positive
5574,negative
5575,negative
5576,negative
5577,negative
5578,negative
5579,negative
5580,negative
5581,negative
5582,negative
5583,neutral
5584,negative
5585,negative
5586,negative
5587,negative
5588,negative
5589,negative
5590,negative
5591,neutral
5592,negative
5593,neutral
5594,negative
5595,negative
5596,negative
5597,negative
5598,neutral
5599,negative
5600,neutral
5601,negative
5602,negative
5603,positive
5604,positive
5605,negative
5606,neutral
5607,negative
5608,negative
5609,negative
5610,negative
5611,negative
5612,positive
5613,negative
5614,negative
5615,neutral
5616,negative
5617,negative
5618,positive
5619,negative
5620,negative
5621,negative
5622,negative
5623,positive
5624,positive
5625,negative
5626,negative
5627,negative
5628,negative
5629,neutral
5630,positive
5631,negative
5632,positive
5633,negative
5634,neutral
5635,neutral
5636,negative
5637,negative
5638,neutral
5639,negative
5640,negative
5641,negative
5642,negative
5643,negative
5644,positive
5645,negative
5646,negative
5647,negative
5648,positive
5649,positive
5650,negative
5651,negative
5652,negative
5653,negative
5654,negative
5655,negative
5656,positive
5657,negative
5658,negative
5659,negative
5660,negative
5661,positive
5662,negative
5663,negative
5664,positive
5665,negative
5666,positive
5667,neutral
5668,negative
5669,neutral
5670,positive
5671,neutral
5672,negative
5673,negative
5674,negative
5675,negative
5676,negative
5677,neutral
5678,neutral
5679,negative
5680,negative
5681,negative
5682,positive
5683,neutral
5684,negative
5685,negative
5686,negative
5687,neutral
5688,positive
5689,negative
5690,neutral
5691,negative
5692,negative
5693,negative
5694,neutral
5695,negative
5696,negative
5697,negative
5698,negative
5699,negative
5700,negative
5701,positive
5702,negative
5703,negative
5704,neutral
5705,neutral
5706,neutral
5707,negative
5708,negative
5709,negative
5710,positive
5711,positive
5712,positive
5713,neutral
5714,neutral
5715,neutral
5716,negative
5717,neutral
5718,negative
5719,positive
5720,negative
5721,negative
5722,negative
5723,neutral
5724,negative
5725,negative
5726,negative
5727,negative
5728,positive
5729,negative
5730,negative
5731,neutral
5732,neutral
5733,negative
5734,negative
5735,negative
5736,negative
5737,negative
5738,negative
5739,positive
5740,negative
5741,negative
5742,neutral
5743,negative
5744,negative
5745,negative
5746,negative
5747,negative
5748,negative
5749,negative
5750,neutral
5751,negative
5752,negative
5753,negative
5754,negative
5755,negative
5756,negative
5757,negative
5758,positive
5759,neutral
5760,negative
5761,negative
5762,negative
5763,negative
5764,negative
5765,negative
5766,negative
5767,negative
5768,negative
5769,neutral
5770,neutral
5771,negative
5772,negative
5773,negative
5774,negative
5775,negative
5776,negative
5777,negative
5778,neutral
5779,negative
5780,negative
5781,negative
5782,negative
5783,positive
5784,negative
5785,negative
5786,neutral
5787,negative
5788,negative
5789,negative
5790,negative
5791,negative
5792,negative
5793,negative
5794,neutral
5795,negative
5796,negative
5797,neutral
5798,negative
5799,negative
5800,negative
5801,negative
5802,negative
5803,negative
5804,neutral
5805,negative
5806,neutral
5807,neutral
5808,positive
5809,negative
5810,positive
5811,neutral
5812,negative
5813,negative
5814,negative
5815,negative
5816,positive
5817,negative
5818,negative
5819,negative
5820,negative
5821,positive
5822,positive
5823,negative
5824,negative
5825,negative
5826,neutral
5827,negative
5828,neutral
5829,negative
5830,positive
5831,negative
5832,neutral
5833,negative
5834,negative
5835,neutral
5836,negative
5837,positive
5838,negative
5839,positive
5840,positive
5841,negative
5842,neutral
5843,negative
5844,negative
5845,negative
5846,positive
5847,neutral
5848,negative
5849,negative
5850,negative
5851,negative
5852,negative
5853,positive
5854,neutral
5855,negative
