.......................
----------------------------------------------------------------------
Ran 23 tests in 0.092s

OK
Name             Stmts   Miss Branch BrPart  Cover   Missing
------------------------------------------------------------
Collatz.py          59      0     24      0   100%
TestCollatz.py     100      0      0      0   100%
------------------------------------------------------------
TOTAL              159      0     24      0   100%
