.........................
----------------------------------------------------------------------
Ran 25 tests in 6.212s

OK
Name             Stmts   Miss Branch BrPart  Cover   Missing
------------------------------------------------------------
Collatz.py          31      0     12      0   100%
TestCollatz.py     107      0      0      0   100%
cache.py             0      0      0      0   100%
------------------------------------------------------------
TOTAL              138      0     12      0   100%
