<mxfile host="app.diagrams.net" modified="2022-03-13T10:51:42.667Z" agent="5.0 (Windows NT 10.0; Win64; x64) AppleWebKit/537.36 (KHTML, like Gecko) Chrome/99.0.4844.51 Safari/537.36" etag="0RJ-vvsfiGPLGceV4jrK" version="17.1.2" type="gitlab">
  <diagram id="lVsSadlPEzOHSI3j2TA8" name="Page-1">
    <mxGraphModel dx="1422" dy="794" grid="1" gridSize="10" guides="1" tooltips="1" connect="1" arrows="1" fold="1" page="1" pageScale="1" pageWidth="827" pageHeight="1169" math="0" shadow="0">
      <root>
        <mxCell id="0" />
        <mxCell id="1" parent="0" />
        <mxCell id="tIdDM9TJG42eZMSi6oDj-21" value="Git - Pre-Commit" style="swimlane;fontStyle=0;childLayout=stackLayout;horizontal=1;startSize=26;horizontalStack=0;resizeParent=1;resizeParentMax=0;resizeLast=0;collapsible=1;marginBottom=0;align=center;fontSize=20;fillColor=#d5e8d4;strokeColor=#82b366;" parent="1" vertex="1">
          <mxGeometry x="90" y="540" width="400" height="146" as="geometry" />
        </mxCell>
        <mxCell id="tIdDM9TJG42eZMSi6oDj-22" value="Linting" style="swimlane;childLayout=stackLayout;horizontal=1;startSize=30;horizontalStack=0;rounded=1;fontSize=20;fontStyle=0;strokeWidth=2;resizeParent=0;resizeLast=1;shadow=0;dashed=0;align=center;" parent="tIdDM9TJG42eZMSi6oDj-21" vertex="1">
          <mxGeometry y="26" width="400" height="120" as="geometry" />
        </mxCell>
        <mxCell id="tIdDM9TJG42eZMSi6oDj-23" value="- Black&#xa;- Flake8" style="align=left;strokeColor=none;fillColor=none;spacingLeft=4;fontSize=18;verticalAlign=top;resizable=0;rotatable=0;part=1;" parent="tIdDM9TJG42eZMSi6oDj-22" vertex="1">
          <mxGeometry y="30" width="400" height="90" as="geometry" />
        </mxCell>
        <mxCell id="tIdDM9TJG42eZMSi6oDj-24" value="GitLab - Remote Repository" style="swimlane;fontStyle=0;childLayout=stackLayout;horizontal=1;startSize=26;horizontalStack=0;resizeParent=1;resizeParentMax=0;resizeLast=0;collapsible=1;marginBottom=0;align=center;fontSize=20;fillColor=#f8cecc;strokeColor=#b85450;" parent="1" vertex="1">
          <mxGeometry x="90" y="770" width="400" height="256" as="geometry" />
        </mxCell>
        <mxCell id="tIdDM9TJG42eZMSi6oDj-25" value="Development &lt;Branch&gt;" style="swimlane;childLayout=stackLayout;horizontal=1;startSize=30;horizontalStack=0;rounded=1;fontSize=20;fontStyle=0;strokeWidth=2;resizeParent=0;resizeLast=1;shadow=0;dashed=0;align=center;" parent="tIdDM9TJG42eZMSi6oDj-24" vertex="1">
          <mxGeometry y="26" width="400" height="230" as="geometry" />
        </mxCell>
        <mxCell id="tIdDM9TJG42eZMSi6oDj-26" value="GitLab CI/CD Pipeline" style="swimlane;childLayout=stackLayout;horizontal=1;startSize=30;horizontalStack=0;rounded=1;fontSize=16;fontStyle=0;strokeWidth=2;resizeParent=0;resizeLast=1;shadow=0;dashed=0;align=center;" parent="tIdDM9TJG42eZMSi6oDj-25" vertex="1">
          <mxGeometry y="30" width="400" height="200" as="geometry" />
        </mxCell>
        <mxCell id="tIdDM9TJG42eZMSi6oDj-27" value="Stage 1 - Linting &#xa;- Black&#xa;- Flake8&#xa;&#xa;Stage 2 - Tests&#xa;- Unit Tests&#xa;- Integration Tests&#xa;" style="align=left;strokeColor=none;fillColor=none;spacingLeft=4;fontSize=18;verticalAlign=top;resizable=0;rotatable=0;part=1;" parent="tIdDM9TJG42eZMSi6oDj-26" vertex="1">
          <mxGeometry y="30" width="400" height="170" as="geometry" />
        </mxCell>
        <mxCell id="tIdDM9TJG42eZMSi6oDj-28" value="Pycharm IDE - Local Repository" style="swimlane;fontStyle=0;childLayout=stackLayout;horizontal=1;startSize=26;horizontalStack=0;resizeParent=1;resizeParentMax=0;resizeLast=0;collapsible=1;marginBottom=0;align=center;fontSize=20;fillColor=#dae8fc;strokeColor=#6c8ebf;" parent="1" vertex="1">
          <mxGeometry x="90" y="40" width="400" height="370" as="geometry" />
        </mxCell>
        <mxCell id="tIdDM9TJG42eZMSi6oDj-29" value="pa2552-cie-project" style="swimlane;childLayout=stackLayout;horizontal=1;startSize=30;horizontalStack=0;rounded=1;fontSize=20;fontStyle=0;strokeWidth=2;resizeParent=0;resizeLast=1;shadow=0;dashed=0;align=center;" parent="tIdDM9TJG42eZMSi6oDj-28" vertex="1">
          <mxGeometry y="26" width="400" height="344" as="geometry" />
        </mxCell>
        <mxCell id="tIdDM9TJG42eZMSi6oDj-30" value="- main - User Menu &#xa;- calculator - Calculator Methods&#xa;- Tests - Including unit and integration tests&#xa;-..flake8.- Config of flake8 linting&#xa;- .gitlab-ci.yaml - Config of GitLab CI stages&#xa;- .pre-commit-config.yaml - Config of pre-commit&#xa;- .build.sh - automated build for run of calculator&#xa;- pa2552-cie-project.toml - Config of Black linting&#xa;- README.md - Project info (Setup, run, etc..)&#xa;- requirements.txt - Project setup requirements&#xa;- CI_Diagram - Project module overview" style="align=left;strokeColor=none;fillColor=none;spacingLeft=4;fontSize=18;verticalAlign=top;resizable=0;rotatable=0;part=1;" parent="tIdDM9TJG42eZMSi6oDj-29" vertex="1">
          <mxGeometry y="30" width="400" height="314" as="geometry" />
        </mxCell>
        <mxCell id="tIdDM9TJG42eZMSi6oDj-31" style="edgeStyle=orthogonalEdgeStyle;rounded=0;orthogonalLoop=1;jettySize=auto;html=1;fontSize=12;exitX=0.5;exitY=1;exitDx=0;exitDy=0;" parent="1" source="tIdDM9TJG42eZMSi6oDj-30" edge="1">
          <mxGeometry relative="1" as="geometry">
            <mxPoint x="290" y="286" as="sourcePoint" />
            <mxPoint x="210" y="539.9999999999998" as="targetPoint" />
            <Array as="points">
              <mxPoint x="210" y="410" />
              <mxPoint x="210" y="540" />
            </Array>
          </mxGeometry>
        </mxCell>
        <mxCell id="tIdDM9TJG42eZMSi6oDj-32" value="Run pre-commit&lt;br&gt;Git commit -m &quot;Feature description&quot;&amp;nbsp;&lt;br&gt;" style="edgeLabel;html=1;align=center;verticalAlign=middle;resizable=0;points=[];fontSize=16;" parent="tIdDM9TJG42eZMSi6oDj-31" vertex="1" connectable="0">
          <mxGeometry x="-0.2199" relative="1" as="geometry">
            <mxPoint x="-20" y="68" as="offset" />
          </mxGeometry>
        </mxCell>
        <mxCell id="tIdDM9TJG42eZMSi6oDj-33" style="edgeStyle=orthogonalEdgeStyle;rounded=0;orthogonalLoop=1;jettySize=auto;html=1;entryX=0.5;entryY=0;entryDx=0;entryDy=0;fontSize=12;exitX=0.5;exitY=1;exitDx=0;exitDy=0;" parent="1" source="tIdDM9TJG42eZMSi6oDj-23" target="tIdDM9TJG42eZMSi6oDj-24" edge="1">
          <mxGeometry relative="1" as="geometry">
            <mxPoint x="290" y="656" as="sourcePoint" />
          </mxGeometry>
        </mxCell>
        <mxCell id="tIdDM9TJG42eZMSi6oDj-34" value="Pre-commit passed&lt;br&gt;Git push remote branch" style="edgeLabel;html=1;align=center;verticalAlign=middle;resizable=0;points=[];fontSize=18;" parent="tIdDM9TJG42eZMSi6oDj-33" vertex="1" connectable="0">
          <mxGeometry x="0.2281" y="-2" relative="1" as="geometry">
            <mxPoint x="2" y="-18" as="offset" />
          </mxGeometry>
        </mxCell>
        <mxCell id="tIdDM9TJG42eZMSi6oDj-35" value="Main &lt;Branch&gt;" style="swimlane;childLayout=stackLayout;horizontal=1;startSize=30;horizontalStack=0;rounded=1;fontSize=20;fontStyle=0;strokeWidth=2;resizeParent=0;resizeLast=1;shadow=0;dashed=0;align=center;" parent="1" vertex="1">
          <mxGeometry x="90" y="1030" width="400" height="100" as="geometry" />
        </mxCell>
        <mxCell id="tIdDM9TJG42eZMSi6oDj-36" value="Production" style="align=left;strokeColor=none;fillColor=none;spacingLeft=4;fontSize=18;verticalAlign=top;resizable=0;rotatable=0;part=1;" parent="tIdDM9TJG42eZMSi6oDj-35" vertex="1">
          <mxGeometry y="30" width="400" height="70" as="geometry" />
        </mxCell>
        <mxCell id="tIdDM9TJG42eZMSi6oDj-37" style="edgeStyle=orthogonalEdgeStyle;rounded=0;orthogonalLoop=1;jettySize=auto;html=1;entryX=1;entryY=0.5;entryDx=0;entryDy=0;fontSize=12;" parent="1" source="tIdDM9TJG42eZMSi6oDj-27" target="tIdDM9TJG42eZMSi6oDj-36" edge="1">
          <mxGeometry relative="1" as="geometry">
            <mxPoint x="500" y="870" as="sourcePoint" />
            <Array as="points">
              <mxPoint x="570" y="898" />
              <mxPoint x="570" y="1095" />
            </Array>
          </mxGeometry>
        </mxCell>
        <mxCell id="tIdDM9TJG42eZMSi6oDj-38" value="Merge-Request&lt;br&gt;--------------------&amp;nbsp;&lt;br&gt;Main &amp;lt;--- Branch" style="edgeLabel;html=1;align=center;verticalAlign=middle;resizable=0;points=[];fontSize=18;" parent="tIdDM9TJG42eZMSi6oDj-37" vertex="1" connectable="0">
          <mxGeometry x="0.1388" relative="1" as="geometry">
            <mxPoint y="-36" as="offset" />
          </mxGeometry>
        </mxCell>
        <mxCell id="tIdDM9TJG42eZMSi6oDj-39" style="edgeStyle=orthogonalEdgeStyle;rounded=0;orthogonalLoop=1;jettySize=auto;html=1;entryX=0.779;entryY=1;entryDx=0;entryDy=0;entryPerimeter=0;fontSize=16;" parent="1" target="tIdDM9TJG42eZMSi6oDj-30" edge="1">
          <mxGeometry relative="1" as="geometry">
            <mxPoint x="402" y="539.9999999999998" as="sourcePoint" />
            <Array as="points">
              <mxPoint x="402" y="530" />
              <mxPoint x="402" y="530" />
            </Array>
          </mxGeometry>
        </mxCell>
        <mxCell id="tIdDM9TJG42eZMSi6oDj-40" value="Pre-commit failed&amp;nbsp;&lt;br&gt;Re-commit neded" style="edgeLabel;html=1;align=center;verticalAlign=middle;resizable=0;points=[];fontSize=16;" parent="tIdDM9TJG42eZMSi6oDj-39" vertex="1" connectable="0">
          <mxGeometry x="-0.1966" y="-5" relative="1" as="geometry">
            <mxPoint x="3" y="-8" as="offset" />
          </mxGeometry>
        </mxCell>
      </root>
    </mxGraphModel>
  </diagram>
</mxfile>
