[
    {
        "groupName": "users",
        "precedence": 1
    },
    {
        "groupName": "homebuyers",
        "precedence": 2
    },
    {
        "groupName": "realtors",
        "precedence": 3
    },
    {
        "groupName": "sysadmins",
        "precedence": 4
    }
]