  531  git status
  532  git branch
  533  git switch main
  534  git config --list | grep remote
  535  git pull --rebase upstream
  536  git pull --rebase upstream main
  537  ls
  538  git branch 
  539  git branch 525283-hw03
  540  git branch 
  541  git switch 525283-hw03
  542  git branch 
  543  ls
  544  cd class3_homework/
  545  ls
  546  touch 525283.txt
  547  ls
  548  vim 525283.txt 
  549  vim 525283.txt 
  550  ls
  551  git status
  552  git add 525283.txt 
  553  git status
  554  git log
  555  git log 525283-hw02
  556  git commit -m "hw03 - uco.txt part done"
  557  git status
  558  history
  559  history | tail -29 > ./525283_commands.txt
