{
    "$schema": "https://raw.githubusercontent.com/martinring/tmlanguage/master/tmlanguage.json",
    "name": "odl",
    "scopeName": "source.odl",
    "patterns": [
        {
            "include": "#global"
        },
        {
            "include": "#config-section"
        },
        {
            "include": "#define-section"
        },
        {
            "include": "#populate-section"
        },
        {
            "include": "#body"
        }
    ],
    "repository": {
        "global": {
			"patterns": [
                {
				    "name": "meta.import",
                    "begin": "import",
                    "beginCaptures": {
                        "0": { "name": "keyword.other.import.odl" }
                    },
                    "end": ";",
                    "patterns": [
                        {
                            "include": "#dqstring"
                        },
                        {
                            "include": "#sqstring"
                        }
                    ]
                },
                {
				    "name": "meta.include",
				    "begin": "[#\\?]?include",
                    "beginCaptures": {
                        "0": { "name": "keyword.other.include.odl" }
                    },
                    "end": ";",
                    "patterns": [
                        {
                            "include": "#dqstring"
                        },
                        {
                            "include": "#sqstring"
                        }
                    ]
                }
            ]
        },
        "config-section": {
            "name": "entity.name.section.config.odl",
            "begin": "(%config)\\s*\\{",
            "beginCaptures": {
                "1": { "name": "keyword.other.section.odl" }
            },
            "end": "\\}",
            "endCaptures": {
                "0": { "name": "punctuation.section.end.odl" }
            },
            "patterns": [
                {
                    "include": "#type-name"
                }, 
                {
                    "include": "#value-assign"
                },
                {
                    "include": "#comments"
                }
            ]
        },
        "define-section": {
            "name": "entity.name.section.define.odl",
            "begin": "(%define)\\s*\\{",
            "beginCaptures": {
                "1": { "name": "keyword.other.section.odl" }
            },
            "end": "\\}",
            "endCaptures": {
                "0": { "name": "punctuation.section.end.odl" }
            },
            "patterns": [
                {
                    "include": "#comments"
                },
                {
                    "include": "#body"
                }
            ]
        },
        "populate-section": {
            "name": "entity.name.section.define.odl",
            "begin": "(%populate|datamodel)\\s*\\{",
            "beginCaptures": {
                "1": { "name": "keyword.other.section.odl" }
            },
            "end": "\\}",
            "endCaptures": {
                "0": { "name": "punctuation.section.end.odl" }
            },
            "patterns": [
                {
                    "include": "#comments"
                },
                {
                    "include": "#body"
                }
            ]
        },
        "body": {
            "patterns": [
                {
                    "include": "#keywords"
                },
                {
                    "include": "#comments"
                },
                {
                    "include": "#attributes"
                },
                {
                    "include": "#types"
                },
                {
                    "include": "#type-name"
                },
                {
                    "include": "#value"
                },
                {
                    "include": "#value"
                },
                {
                    "begin": "\\s*\\{",
                    "beginCaptures": {
                        "0": { "name": "punctuation.section.begin.odl" }
                    },
                    "end": "\\s*\\}",
                    "endCaptures": {
                        "0": { "name": "punctuation.section.end.odl" }
                    },
                    "patterns": [
                        {
                            "include": "#body"
                        }
                    ]
                },
                {
                    "begin": "\\s*\\(",
                    "beginCaptures": {
                        "0": { "name": "markup.italic" }
                    },
                    "end": "\\s*\\)\\s*;|{",
                    "endCaptures": {
                        "0": { "name": "punctuation.section.end.odl" }
                    },
                    "patterns": [
                        {
                            "include": "#attributes"
                        },
                        {
                            "include": "#types"
                        },
                        {
                            "include": "#type-name"
                        },
                        {
                            "name": "punctuation.assignment",
                            "match": "\\s*="
                        },
                        {
                            "include": "#value"
                        }
                    ]
                }
            ]
        },
        "comments": {
            "patterns": [
                {
                    "begin": "/\\*\\*(?!/)",
                    "end": "\\*/",
                    "name": "comment.block.documentation.odl"
                },
                {
                    "begin": "/\\*",
                    "end": "\\*/",
                    "name": "comment.block.odl"
                },
                {
                    "match": "(//).*$\\n?",
                    "name": "comment.line.double-slash.odl"
                }
            ]
        },
        "type-name": {
            "name": "variable.name.type.odl",
            "match": "\\s*[a-zA-Z_]{1}[a-zA-Z0-9\\-_]*"
        },
        "value-assign": {
            "name": "meta.value",
            "begin": "\\s*=\\s*",
            "beginCaptures": {
                "0": { "name": "punctuation.assignment.odl" }
            },
            "end": ";|,|}",
            "endCaptures": {
                "0": { "name": "punctuation.line-end.odl" }
            },
            "patterns": [
                {
                    "include": "#value"
                },
                {
                    "name": "meta.table",
                    "match": "\\s*\\{",
                    "patterns": [
                        {
                            "include": "#type-name"
                        },
                        {
                            "include": "#value-assign"
                        }
                    ]
                }
            ]
        },
        "keywords": {
            "name": "meta.keywords",
            "patterns": [
                {
                    "include": "#actions"
                },
                {
                    "name": "keyword.other",
                    "match": "\\s*parameter"
                },
                {
                    "name": "keyword.other",
                    "match": "\\s*select"
                },
                {
                    "name": "keyword.other",
                    "match": "\\s*instance"
                },
                {
                    "name": "keyword.other",
                    "match": "\\s*add"
                },
                {
                    "name": "keyword.other",
                    "match": "\\s*entry-point"
                },
                {
                    "name": "keyword.other",
                    "match": "\\s*object"
                },
                {
                    "name": "keyword.other",
                    "match": "\\s*on"
                },
                {
                    "name": "keyword.other",
                    "match": "\\s*action"
                },
                {
                    "name": "keyword.other",
                    "match": "\\s*event"
                },
                {
                    "name": "keyword.other",
                    "match": "\\s*filter"
                },
                {
                    "name": "keyword.other",
                    "match": "\\s*call"
                },
                {
                    "name": "keyword.other",
                    "match": "\\s*default"
                },
                {
                    "name": "keyword.other",
                    "match": "\\s*counted"
                },
                {
                    "name": "keyword.other",
                    "match": "\\s*with"
                }
            ]
        },
        "actions": {
            "name": "meta.actions",
            "patterns": [
                {
                    "name": "support.class",
                    "match": "\\s*read"
                },
                {
                    "name": "support.class",
                    "match": "\\s*write"
                },
                {
                    "name": "support.class",
                    "match": "\\s*validate"
                },
                {
                    "name": "support.class",
                    "match": "\\s*describe"
                },
                {
                    "name": "support.class",
                    "match": "\\s*list"
                },
                {
                    "name": "support.class",
                    "match": "\\s*add-inst"
                },
                {
                    "name": "support.class",
                    "match": "\\s*del-inst"
                }
            ]
        },
        "attributes": {
            "name": "meta.attributes",
            "patterns": [
                {
                    "name": "invalid.deprecated",
                    "match": "\\s*read-only"
                },
                {
                    "name": "invalid.deprecated",
                    "match": "\\s*persistent"
                },
                {
                    "name": "invalid.deprecated",
                    "match": "\\s*in"
                },
                {
                    "name": "invalid.deprecated",
                    "match": "\\s*out"
                },
                {
                    "name": "support.class",
                    "match": "\\s*[%!]template"
                },
                {
                    "name": "support.class",
                    "match": "\\s*[%!]read-only"
                },
                {
                    "name": "support.class",
                    "match": "\\s*[%!]persistent"
                },
                {
                    "name": "support.class",
                    "match": "\\s*[%!]private"
                },
                {
                    "name": "support.class",
                    "match": "\\s*[%!]protected"
                },
                {
                    "name": "support.class",
                    "match": "\\s*%in"
                },
                {
                    "name": "support.class",
                    "match": "\\s*%out"
                },
                {
                    "name": "support.class",
                    "match": "\\s*%strict"
                },
                {
                    "name": "support.class",
                    "match": "\\s*%mandatory"
                }
            ]
        },
        "types": {
            "patterns": [
                {
                    "name": "support.function",
                    "match": "\\s*void"
                },
                {
                    "name": "support.function",
                    "match": "\\s*string"
                },
                {
                    "name": "support.function",
                    "match": "\\s*csv_string"
                },
                {
                    "name": "support.function",
                    "match": "\\s*ssv_string"
                },
                {
                    "name": "support.function",
                    "match": "\\s*int8"
                },
                {
                    "name": "support.function",
                    "match": "\\s*int16"
                },
                {
                    "name": "support.function",
                    "match": "\\s*int32"
                },
                {
                    "name": "support.function",
                    "match": "\\s*int64"
                },
                {
                    "name": "support.function",
                    "match": "\\s*uint8"
                },
                {
                    "name": "support.function",
                    "match": "\\s*uint16"
                },
                {
                    "name": "support.function",
                    "match": "\\s*uint32"
                },
                {
                    "name": "support.function",
                    "match": "\\s*uint64"
                },
                {
                    "name": "support.function",
                    "match": "\\s*bool"
                },
                {
                    "name": "support.function",
                    "match": "\\s*list"
                },
                {
                    "name": "support.function",
                    "match": "\\s*htable"
                },
                {
                    "name": "support.function",
                    "match": "\\s*fd"
                },
                {
                    "name": "support.function",
                    "match": "\\s*variant"
                },
                {
                    "name": "support.function",
                    "match": "\\s*double"
                },
                {
                    "name": "support.function",
                    "match": "\\s*datetime"
                }
            ]
        },
        "value": {
            "patterns": [
                {
                    "include": "#constant"
                },
                {
                    "include": "#number"
                },
                {
                    "include": "#dqstring"
                },
                {
                    "include": "#sqstring"
                }
            ]
        },
        "constant": {
            "name": "constant.other.boolean.odl",
            "match": "\\b(true|false|yes|no)\\b"
        },
        "number": {
            "name": "constant.numeric.odl",
            "match": "(?x)-?(?:0|[1-9]\\d*)(?:(?:\\.\\d+)?(?:[eE][+-]?\\d+)?)?"
        },
        "dqstring": {
            "begin": "\"",
            "end": "\"",
            "name": "string.quoted.double.odl",
            "patterns": [
                {
                    "match": "(?x)\\$\\{(.*?)\\}|\\$\\((.*?)\\)",
                    "captures": {
                        "1": { "name": "variable.name"},
                        "2": { "name": "variable.name"},
                        "3": { "name": "variable.name"},
                        "4": { "name": "variable.name"},
                        "5": { "name": "variable.name"},
                        "6": { "name": "variable.name"},
                        "7": { "name": "variable.name"},
                        "8": { "name": "variable.name"},
                        "9": { "name": "variable.name"},
                        "10": { "name": "variable.name"}
                    }
                }
            ]
        },
        "sqstring": {
            "begin": "'",
            "end": "'",
            "name": "string.quoted.single.odl",
            "patterns": [
                {
                    "match": "(?x)\\$\\{(.*?)\\}",
                    "captures": {
                        "1": { "name": "variable.name"},
                        "2": { "name": "variable.name"},
                        "3": { "name": "variable.name"},
                        "4": { "name": "variable.name"},
                        "5": { "name": "variable.name"},
                        "6": { "name": "variable.name"},
                        "7": { "name": "variable.name"},
                        "8": { "name": "variable.name"},
                        "9": { "name": "variable.name"},
                        "10": { "name": "variable.name"}
                    }
                }
            ]
        }
    }
}