{"properties": [
  {
    "name": "app.jwtSecret",
    "type": "java.lang.String",
    "description": "A description for 'app.jwtSecret'"
  },
  {
    "name": "app.jwtExpirationInMs",
    "type": "java.lang.String",
    "description": "A description for 'app.jwtExpirationInMs'"
  },
  {
    "name": "data.sourcePath",
    "type": "java.lang.String",
    "description": "A description for 'data.sourcePath'"
  },
  {
    "name": "data.dataPath",
    "type": "java.lang.String",
    "description": "A description for 'data.dataPath'"
  }
]}